maven-notifications mailing list archives

Site index · List index
Message view « Date » · « Thread »
Top « Date » · « Thread »
From Continuum Build Server <contin...@ci.codehaus.org>
Subject [continuum] BUILD FAILURE: Continuum Core Integration Test
Date Mon, 27 Mar 2006 20:01:52 GMT
Online report : http://ci.codehaus.org/continuum-maven/servlet/continuum/target/ProjectBuild.vm/view/ProjectBuild/id/149/buildId/395
Build statistics:
  State: Failed
  Previous State: Failed
  Started at: Mon, 27 Mar 2006 12:01:41 -0800
  Finished at: Mon, 27 Mar 2006 12:01:52 -0800
  Total time: 11s
  Build Trigger: Schedule
  Exit code: 1
  Building machine hostname: cheddar.simulalabs.com
  Operating system : Linux(unknown)
  Java version : 1.5.0_03(Sun Microsystems Inc.)

Changes
         evenisse          Load application.xml from jar instead of file system path
             /maven/continuum/branches/continuum-1.0.x/continuum-core-it/src/test/java/org/apache/maven/continuum/it/AbstractIntegrationTest.java
        
****************************************************************************
Output:
****************************************************************************
[INFO] Scanning for projects...
[INFO] ----------------------------------------------------------------------------
[INFO] Building Continuum Core Integration Test
[INFO]    task-segment: [clean, install]
[INFO] ----------------------------------------------------------------------------
[INFO] [clean:clean]
[INFO] Deleting directory /home/continuum/continuum-maven/working-directory/149/target
[INFO] Deleting directory /home/continuum/continuum-maven/working-directory/149/target/classes
[INFO] Deleting directory /home/continuum/continuum-maven/working-directory/149/target/test-classes
[INFO] [resources:resources]
[INFO] Using default encoding to copy filtered resources.
[WARNING] 
	Artifact junit:junit:jar:3.8.1:test retains local scope 'test' overriding broader scope 'compile'
	given by a dependency. If this is not intended, modify or remove the local scope.

[INFO] [compiler:compile]
[INFO] No sources to compile
[INFO] [resources:testResources]
[INFO] Using default encoding to copy filtered resources.
[INFO] [compiler:testCompile]
Compiling 7 source files to /home/continuum/continuum-maven/working-directory/149/target/test-classes
[INFO] [surefire:test]
[INFO] Setting reports dir: /home/continuum/continuum-maven/working-directory/149/target/surefire-reports

-------------------------------------------------------
 T E S T S
-------------------------------------------------------
[surefire] Running org.apache.maven.continuum.it.ShellIntegrationTest
[surefire] Tests run: 1, Failures: 0, Errors: 1, Time elapsed: 0.119 sec <<<<<<<<
FAILURE !! 
[surefire] Running org.apache.maven.continuum.it.MavenTwoIntegrationTest
[surefire] Tests run: 1, Failures: 0, Errors: 1, Time elapsed: 0.043 sec <<<<<<<<
FAILURE !! 
[surefire] Running org.apache.maven.continuum.it.MavenOneIntegrationTest
[surefire] Tests run: 1, Failures: 0, Errors: 1, Time elapsed: 0.038 sec <<<<<<<<
FAILURE !! 
[surefire] Running org.apache.maven.continuum.it.AntIntegrationTest
[surefire] Tests run: 2, Failures: 0, Errors: 2, Time elapsed: 0.066 sec <<<<<<<<
FAILURE !! 
[INFO] ----------------------------------------------------------------------------
[ERROR] BUILD ERROR
[INFO] ----------------------------------------------------------------------------
[INFO] There are test failures.
[INFO] ----------------------------------------------------------------------------
[INFO] For more information, run Maven with the -e switch
[INFO] ----------------------------------------------------------------------------
[INFO] Total time: 9 seconds
[INFO] Finished at: Mon Mar 27 12:01:52 PST 2006
[INFO] Final Memory: 14M/153M
[INFO] ----------------------------------------------------------------------------

****************************************************************************



Mime
View raw message