maven-notifications mailing list archives

Site index · List index
Message view « Date » · « Thread »
Top « Date » · « Thread »
From Continuum Build Server <contin...@ci.codehaus.org>
Subject [continuum] BUILD FAILURE: Maven IDEA Plugin
Date Fri, 31 Mar 2006 06:03:57 GMT
Online report : http://ci.codehaus.org/continuum-maven/servlet/continuum/target/ProjectBuild.vm/view/ProjectBuild/id/45/buildId/593
Build statistics:
  State: Failed
  Previous State: Ok
  Started at: Thu, 30 Mar 2006 22:03:49 -0800
  Finished at: Thu, 30 Mar 2006 22:03:56 -0800
  Total time: 6s
  Build Trigger: Schedule
  Exit code: 1
  Building machine hostname: cheddar.simulalabs.com
  Operating system : Linux(unknown)
  Java version : 1.5.0_03(Sun Microsystems Inc.)

Changes
         epunzalan          Updated plugin tests that use the plugin harness with the new
package name
             /maven/plugins/trunk/maven-compiler-plugin/src/test/java/org/apache/maven/plugin/CompilerMojoTest.java
            /maven/plugins/trunk/maven-compiler-plugin/src/test/resources/unit/compiler-basic-test/plugin-config.xml
            /maven/plugins/trunk/maven-compiler-plugin/src/test/resources/unit/compiler-empty-source-test/plugin-config.xml
            /maven/plugins/trunk/maven-compiler-plugin/src/test/resources/unit/compiler-fork-test/plugin-config.xml
            /maven/plugins/trunk/maven-compiler-plugin/src/test/resources/unit/compiler-includes-excludes-test/plugin-config.xml
            /maven/plugins/trunk/maven-idea-plugin/src/test/java/org/apache/maven/plugin/idea/IdeaProjectTest.java
            /maven/plugins/trunk/maven-idea-plugin/src/test/java/org/apache/maven/plugin/idea/stubs/IdeaArtifactStub.java
            /maven/plugins/trunk/maven-idea-plugin/src/test/java/org/apache/maven/plugin/idea/stubs/SimpleMavenProjectStub.java
        
****************************************************************************
Output:
****************************************************************************
[INFO] Scanning for projects...
[INFO] ----------------------------------------------------------------------------
[INFO] Building Maven IDEA Plugin
[INFO]    task-segment: [clean, install]
[INFO] ----------------------------------------------------------------------------
[INFO] [clean:clean]
[INFO] Deleting directory /home/continuum/continuum-maven/working-directory/45/target
[INFO] Deleting directory /home/continuum/continuum-maven/working-directory/45/target/classes
[INFO] Deleting directory /home/continuum/continuum-maven/working-directory/45/target/test-classes
[INFO] [plugin:descriptor]
[INFO] Using 2 extractors.
[INFO] Applying extractor for language: java
[INFO] Extractor for language: java found 5 mojo descriptors.
[INFO] Applying extractor for language: bsh
[INFO] Extractor for language: bsh found 0 mojo descriptors.
[INFO] [resources:resources]
[INFO] Using default encoding to copy filtered resources.
[INFO] [compiler:compile]
Compiling 7 source files to /home/continuum/continuum-maven/working-directory/45/target/classes
[INFO] [resources:testResources]
[INFO] Using default encoding to copy filtered resources.
[INFO] [compiler:testCompile]
Compiling 3 source files to /home/continuum/continuum-maven/working-directory/45/target/test-classes
[INFO] ----------------------------------------------------------------------------
[ERROR] BUILD FAILURE
[INFO] ----------------------------------------------------------------------------
[INFO] Compilation failure

/home/continuum/continuum-maven/working-directory/45/src/test/java/org/apache/maven/plugin/idea/stubs/IdeaArtifactStub.java:[22,45]
package org.apache.maven.plugin.testing.stubs does not exist

/home/continuum/continuum-maven/working-directory/45/src/test/java/org/apache/maven/plugin/idea/stubs/IdeaArtifactStub.java:[28,12]
cannot find symbol
symbol: class ArtifactStub
    extends ArtifactStub

/home/continuum/continuum-maven/working-directory/45/src/test/java/org/apache/maven/plugin/idea/IdeaProjectTest.java:[20,39]
package org.apache.maven.plugin.testing does not exist

/home/continuum/continuum-maven/working-directory/45/src/test/java/org/apache/maven/plugin/idea/IdeaProjectTest.java:[33,12]
cannot find symbol
symbol: class AbstractMojoTestCase
    extends AbstractMojoTestCase

/home/continuum/continuum-maven/working-directory/45/src/test/java/org/apache/maven/plugin/idea/stubs/SimpleMavenProjectStub.java:[21,45]
package org.apache.maven.plugin.testing.stubs does not exist

/home/continuum/continuum-maven/working-directory/45/src/test/java/org/apache/maven/plugin/idea/stubs/SimpleMavenProjectStub.java:[32,12]
cannot find symbol
symbol: class MavenProjectStub
    extends MavenProjectStub

/home/continuum/continuum-maven/working-directory/45/src/test/java/org/apache/maven/plugin/idea/IdeaProjectTest.java:[58,8]
cannot find symbol
symbol  : method assertEquals(java.lang.String,java.lang.String,java.lang.String)
location: class org.apache.maven.plugin.idea.IdeaProjectTest

/home/continuum/continuum-maven/working-directory/45/src/test/java/org/apache/maven/plugin/idea/IdeaProjectTest.java:[81,39]
cannot find symbol
symbol  : method getBasedir()
location: class org.apache.maven.plugin.idea.IdeaProjectTest

/home/continuum/continuum-maven/working-directory/45/src/test/java/org/apache/maven/plugin/idea/IdeaProjectTest.java:[83,33]
cannot find symbol
symbol  : method lookupMojo(java.lang.String,java.io.File)
location: class org.apache.maven.plugin.idea.IdeaProjectTest

/home/continuum/continuum-maven/working-directory/45/src/test/java/org/apache/maven/plugin/idea/IdeaProjectTest.java:[85,8]
cannot find symbol
symbol  : method assertNotNull(java.lang.String,org.apache.maven.plugin.idea.IdeaProjectMojo)
location: class org.apache.maven.plugin.idea.IdeaProjectTest

/home/continuum/continuum-maven/working-directory/45/src/test/java/org/apache/maven/plugin/idea/IdeaProjectTest.java:[93,8]
cannot find symbol
symbol  : method assertTrue(java.lang.String,boolean)
location: class org.apache.maven.plugin.idea.IdeaProjectTest

/home/continuum/continuum-maven/working-directory/45/src/test/java/org/apache/maven/plugin/idea/IdeaProjectTest.java:[114,12]
cannot find symbol
symbol  : method assertEquals(java.lang.String,java.lang.String,java.lang.String)
location: class org.apache.maven.plugin.idea.IdeaProjectTest

/home/continuum/continuum-maven/working-directory/45/src/test/java/org/apache/maven/plugin/idea/IdeaProjectTest.java:[117,12]
cannot find symbol
symbol  : method assertEquals(java.lang.String,java.lang.String,java.lang.String)
location: class org.apache.maven.plugin.idea.IdeaProjectTest

/home/continuum/continuum-maven/working-directory/45/src/test/java/org/apache/maven/plugin/idea/IdeaProjectTest.java:[122,12]
cannot find symbol
symbol  : method assertEquals(java.lang.String,java.lang.String,java.lang.String)
location: class org.apache.maven.plugin.idea.IdeaProjectTest

/home/continuum/continuum-maven/working-directory/45/src/test/java/org/apache/maven/plugin/idea/IdeaProjectTest.java:[125,12]
cannot find symbol
symbol  : method assertEquals(java.lang.String,java.lang.String,java.lang.String)
location: class org.apache.maven.plugin.idea.IdeaProjectTest

/home/continuum/continuum-maven/working-directory/45/src/test/java/org/apache/maven/plugin/idea/IdeaProjectTest.java:[130,12]
cannot find symbol
symbol  : method assertEquals(java.lang.String,java.lang.String,java.lang.String)
location: class org.apache.maven.plugin.idea.IdeaProjectTest

/home/continuum/continuum-maven/working-directory/45/src/test/java/org/apache/maven/plugin/idea/IdeaProjectTest.java:[136,12]
cannot find symbol
symbol  : method assertEquals(java.lang.String,java.lang.String,java.lang.String)
location: class org.apache.maven.plugin.idea.IdeaProjectTest

/home/continuum/continuum-maven/working-directory/45/src/test/java/org/apache/maven/plugin/idea/stubs/SimpleMavenProjectStub.java:[105,28]
incompatible types
found   : org.apache.maven.plugin.idea.stubs.IdeaArtifactStub
required: org.apache.maven.artifact.Artifact


[INFO] ----------------------------------------------------------------------------
[INFO] For more information, run Maven with the -e switch
[INFO] ----------------------------------------------------------------------------
[INFO] Total time: 5 seconds
[INFO] Finished at: Thu Mar 30 22:03:56 PST 2006
[INFO] Final Memory: 10M/124M
[INFO] ----------------------------------------------------------------------------

****************************************************************************



Mime
View raw message