maven-notifications mailing list archives

Site index · List index
Message view « Date » · « Thread »
Top « Date » · « Thread »
From Continuum Build Server <contin...@ci.codehaus.org>
Subject [continuum] BUILD FAILURE: Maven SCM Bazaar Provider
Date Tue, 28 Mar 2006 01:22:58 GMT
Online report : http://ci.codehaus.org/continuum-maven/servlet/continuum/target/ProjectBuild.vm/view/ProjectBuild/id/80/buildId/447
Build statistics:
  State: Failed
  Previous State: Failed
  Started at: Mon, 27 Mar 2006 17:22:45 -0800
  Finished at: Mon, 27 Mar 2006 17:22:57 -0800
  Total time: 11s
  Build Trigger: Forced
  Exit code: 1
  Building machine hostname: cheddar.simulalabs.com
  Operating system : Linux(unknown)
  Java version : 1.5.0_03(Sun Microsystems Inc.)

Changes
      No files changed
  
****************************************************************************
Output:
****************************************************************************
[INFO] Scanning for projects...
[INFO] ----------------------------------------------------------------------------
[INFO] Building Maven SCM Bazaar Provider
[INFO]    task-segment: [clean, install]
[INFO] ----------------------------------------------------------------------------
[INFO] [clean:clean]
[INFO] Deleting directory /home/continuum/continuum-maven/working-directory/80/target
[INFO] Deleting directory /home/continuum/continuum-maven/working-directory/80/target/classes
[INFO] Deleting directory /home/continuum/continuum-maven/working-directory/80/target/test-classes
[INFO] [resources:resources]
[INFO] Using default encoding to copy filtered resources.
[INFO] [compiler:compile]
Compiling 20 source files to /home/continuum/continuum-maven/working-directory/80/target/classes
[INFO] [resources:testResources]
[INFO] Using default encoding to copy filtered resources.
[INFO] [compiler:testCompile]
Compiling 8 source files to /home/continuum/continuum-maven/working-directory/80/target/test-classes
[INFO] [surefire:test]
[INFO] Setting reports dir: /home/continuum/continuum-maven/working-directory/80/target/surefire-reports

-------------------------------------------------------
 T E S T S
-------------------------------------------------------
[surefire] Running org.apache.maven.scm.provider.bazaar.command.checkin.BazaarCheckInCommandTest
EXECUTING: bzr init
[ERROR]  exceptions.ImportError: No module named elementtree.ElementTree[ERROR]  exceptions.ImportError:
No module named elementtree.ElementTree[ERROR] 
EXECUTION FAILED
  Execution of cmd : init failed with exit code: 3.
  Working directory was: 
    /home/continuum/continuum-maven/working-directory/80/target/test-branch
  Your Bazaar installation seems to be valid and complete.
    Python version: 2.3.4 (OK)
    Bazaar version: NA (OK)
    Paramiko installed: true (For remote access eg. sftp) 
    cCrypt installed: true (For remote access eg. sftp) 
    cElementTree installed: true (Not mandatory) 

EXECUTING: bzr add /home/continuum/continuum-maven/working-directory/80/target/test-branch/pom.xml
/home/continuum/continuum-maven/working-directory/80/target/test-branch/readme.txt /home/continuum/continuum-maven/working-directory/80/target/test-branch/src/main/java/Application.java
/home/continuum/continuum-maven/working-directory/80/target/test-branch/src/test/java/Test.java
[ERROR]  exceptions.ImportError: No module named elementtree.ElementTree[ERROR]  exceptions.ImportError:
No module named elementtree.ElementTree[ERROR] 
EXECUTION FAILED
  Execution of cmd : add failed with exit code: 3.
  Working directory was: 
    /home/continuum/continuum-maven/working-directory/80/target/test-branch
  Your Bazaar installation seems to be valid and complete.
    Python version: 2.3.4 (OK)
    Bazaar version: NA (OK)
    Paramiko installed: true (For remote access eg. sftp) 
    cCrypt installed: true (For remote access eg. sftp) 
    cElementTree installed: true (Not mandatory) 

EXECUTING: bzr init
[ERROR]  exceptions.ImportError: No module named elementtree.ElementTree[ERROR]  exceptions.ImportError:
No module named elementtree.ElementTree[ERROR] 
EXECUTION FAILED
  Execution of cmd : init failed with exit code: 3.
  Working directory was: 
    /home/continuum/continuum-maven/working-directory/80/target/test-branch
  Your Bazaar installation seems to be valid and complete.
    Python version: 2.3.4 (OK)
    Bazaar version: NA (OK)
    Paramiko installed: true (For remote access eg. sftp) 
    cCrypt installed: true (For remote access eg. sftp) 
    cElementTree installed: true (Not mandatory) 

EXECUTING: bzr add /home/continuum/continuum-maven/working-directory/80/target/test-branch/pom.xml
/home/continuum/continuum-maven/working-directory/80/target/test-branch/readme.txt /home/continuum/continuum-maven/working-directory/80/target/test-branch/src/main/java/Application.java
/home/continuum/continuum-maven/working-directory/80/target/test-branch/src/test/java/Test.java
[ERROR]  exceptions.ImportError: No module named elementtree.ElementTree[ERROR]  exceptions.ImportError:
No module named elementtree.ElementTree[ERROR] 
EXECUTION FAILED
  Execution of cmd : add failed with exit code: 3.
  Working directory was: 
    /home/continuum/continuum-maven/working-directory/80/target/test-branch
  Your Bazaar installation seems to be valid and complete.
    Python version: 2.3.4 (OK)
    Bazaar version: NA (OK)
    Paramiko installed: true (For remote access eg. sftp) 
    cCrypt installed: true (For remote access eg. sftp) 
    cElementTree installed: true (Not mandatory) 

[surefire] Tests run: 2, Failures: 0, Errors: 2, Time elapsed: 1.819 sec <<<<<<<<
FAILURE !! 
[surefire] Running org.apache.maven.scm.provider.bazaar.command.checkout.BazaarCheckOutCommandTest
EXECUTING: bzr init
[ERROR]  exceptions.ImportError: No module named elementtree.ElementTree[ERROR]  exceptions.ImportError:
No module named elementtree.ElementTree[ERROR] 
EXECUTION FAILED
  Execution of cmd : init failed with exit code: 3.
  Working directory was: 
    /home/continuum/continuum-maven/working-directory/80/target/test-branch
  Your Bazaar installation seems to be valid and complete.
    Python version: 2.3.4 (OK)
    Bazaar version: NA (OK)
    Paramiko installed: true (For remote access eg. sftp) 
    cCrypt installed: true (For remote access eg. sftp) 
    cElementTree installed: true (Not mandatory) 

EXECUTING: bzr add /home/continuum/continuum-maven/working-directory/80/target/test-branch/pom.xml
/home/continuum/continuum-maven/working-directory/80/target/test-branch/readme.txt /home/continuum/continuum-maven/working-directory/80/target/test-branch/src/main/java/Application.java
/home/continuum/continuum-maven/working-directory/80/target/test-branch/src/test/java/Test.java
[ERROR]  exceptions.ImportError: No module named elementtree.ElementTree[ERROR]  exceptions.ImportError:
No module named elementtree.ElementTree[ERROR] 
EXECUTION FAILED
  Execution of cmd : add failed with exit code: 3.
  Working directory was: 
    /home/continuum/continuum-maven/working-directory/80/target/test-branch
  Your Bazaar installation seems to be valid and complete.
    Python version: 2.3.4 (OK)
    Bazaar version: NA (OK)
    Paramiko installed: true (For remote access eg. sftp) 
    cCrypt installed: true (For remote access eg. sftp) 
    cElementTree installed: true (Not mandatory) 

[surefire] Tests run: 1, Failures: 0, Errors: 1, Time elapsed: 0.816 sec <<<<<<<<
FAILURE !! 
[surefire] Running org.apache.maven.scm.provider.bazaar.command.status.BazaarStatusCommandTest
EXECUTING: bzr init
[ERROR]  exceptions.ImportError: No module named elementtree.ElementTree[ERROR]  exceptions.ImportError:
No module named elementtree.ElementTree[ERROR] 
EXECUTION FAILED
  Execution of cmd : init failed with exit code: 3.
  Working directory was: 
    /home/continuum/continuum-maven/working-directory/80/target/test-branch
  Your Bazaar installation seems to be valid and complete.
    Python version: 2.3.4 (OK)
    Bazaar version: NA (OK)
    Paramiko installed: true (For remote access eg. sftp) 
    cCrypt installed: true (For remote access eg. sftp) 
    cElementTree installed: true (Not mandatory) 

EXECUTING: bzr add /home/continuum/continuum-maven/working-directory/80/target/test-branch/pom.xml
/home/continuum/continuum-maven/working-directory/80/target/test-branch/readme.txt /home/continuum/continuum-maven/working-directory/80/target/test-branch/src/main/java/Application.java
/home/continuum/continuum-maven/working-directory/80/target/test-branch/src/test/java/Test.java
[ERROR]  exceptions.ImportError: No module named elementtree.ElementTree[ERROR]  exceptions.ImportError:
No module named elementtree.ElementTree[ERROR] 
EXECUTION FAILED
  Execution of cmd : add failed with exit code: 3.
  Working directory was: 
    /home/continuum/continuum-maven/working-directory/80/target/test-branch
  Your Bazaar installation seems to be valid and complete.
    Python version: 2.3.4 (OK)
    Bazaar version: NA (OK)
    Paramiko installed: true (For remote access eg. sftp) 
    cCrypt installed: true (For remote access eg. sftp) 
    cElementTree installed: true (Not mandatory) 

[surefire] Tests run: 1, Failures: 0, Errors: 1, Time elapsed: 0.797 sec <<<<<<<<
FAILURE !! 
[surefire] Running org.apache.maven.scm.provider.bazaar.command.diff.BazaarDiffCommandTest
EXECUTING: bzr init
[ERROR]  exceptions.ImportError: No module named elementtree.ElementTree[ERROR]  exceptions.ImportError:
No module named elementtree.ElementTree[ERROR] 
EXECUTION FAILED
  Execution of cmd : init failed with exit code: 3.
  Working directory was: 
    /home/continuum/continuum-maven/working-directory/80/target/test-branch
  Your Bazaar installation seems to be valid and complete.
    Python version: 2.3.4 (OK)
    Bazaar version: NA (OK)
    Paramiko installed: true (For remote access eg. sftp) 
    cCrypt installed: true (For remote access eg. sftp) 
    cElementTree installed: true (Not mandatory) 

EXECUTING: bzr add /home/continuum/continuum-maven/working-directory/80/target/test-branch/pom.xml
/home/continuum/continuum-maven/working-directory/80/target/test-branch/readme.txt /home/continuum/continuum-maven/working-directory/80/target/test-branch/src/main/java/Application.java
/home/continuum/continuum-maven/working-directory/80/target/test-branch/src/test/java/Test.java
[ERROR]  exceptions.ImportError: No module named elementtree.ElementTree[ERROR]  exceptions.ImportError:
No module named elementtree.ElementTree[ERROR] 
EXECUTION FAILED
  Execution of cmd : add failed with exit code: 3.
  Working directory was: 
    /home/continuum/continuum-maven/working-directory/80/target/test-branch
  Your Bazaar installation seems to be valid and complete.
    Python version: 2.3.4 (OK)
    Bazaar version: NA (OK)
    Paramiko installed: true (For remote access eg. sftp) 
    cCrypt installed: true (For remote access eg. sftp) 
    cElementTree installed: true (Not mandatory) 

[surefire] Tests run: 1, Failures: 0, Errors: 1, Time elapsed: 0.784 sec <<<<<<<<
FAILURE !! 
[surefire] Running org.apache.maven.scm.provider.bazaar.command.update.BazaarUpdateCommandTest
EXECUTING: bzr init
[ERROR]  exceptions.ImportError: No module named elementtree.ElementTree[ERROR]  exceptions.ImportError:
No module named elementtree.ElementTree[ERROR] 
EXECUTION FAILED
  Execution of cmd : init failed with exit code: 3.
  Working directory was: 
    /home/continuum/continuum-maven/working-directory/80/target/test-branch
  Your Bazaar installation seems to be valid and complete.
    Python version: 2.3.4 (OK)
    Bazaar version: NA (OK)
    Paramiko installed: true (For remote access eg. sftp) 
    cCrypt installed: true (For remote access eg. sftp) 
    cElementTree installed: true (Not mandatory) 

EXECUTING: bzr add /home/continuum/continuum-maven/working-directory/80/target/test-branch/pom.xml
/home/continuum/continuum-maven/working-directory/80/target/test-branch/readme.txt /home/continuum/continuum-maven/working-directory/80/target/test-branch/src/main/java/Application.java
/home/continuum/continuum-maven/working-directory/80/target/test-branch/src/test/java/Test.java
[ERROR]  exceptions.ImportError: No module named elementtree.ElementTree[ERROR]  exceptions.ImportError:
No module named elementtree.ElementTree[ERROR] 
EXECUTION FAILED
  Execution of cmd : add failed with exit code: 3.
  Working directory was: 
    /home/continuum/continuum-maven/working-directory/80/target/test-branch
  Your Bazaar installation seems to be valid and complete.
    Python version: 2.3.4 (OK)
    Bazaar version: NA (OK)
    Paramiko installed: true (For remote access eg. sftp) 
    cCrypt installed: true (For remote access eg. sftp) 
    cElementTree installed: true (Not mandatory) 

[surefire] Tests run: 1, Failures: 0, Errors: 1, Time elapsed: 0.811 sec <<<<<<<<
FAILURE !! 
[surefire] Running org.apache.maven.scm.provider.bazaar.command.changelog.BazaarChangeLogCommandTckTest
EXECUTING: bzr init
[ERROR]  exceptions.ImportError: No module named elementtree.ElementTree[ERROR]  exceptions.ImportError:
No module named elementtree.ElementTree[ERROR] 
EXECUTION FAILED
  Execution of cmd : init failed with exit code: 3.
  Working directory was: 
    /home/continuum/continuum-maven/working-directory/80/target/test-branch
  Your Bazaar installation seems to be valid and complete.
    Python version: 2.3.4 (OK)
    Bazaar version: NA (OK)
    Paramiko installed: true (For remote access eg. sftp) 
    cCrypt installed: true (For remote access eg. sftp) 
    cElementTree installed: true (Not mandatory) 

EXECUTING: bzr add /home/continuum/continuum-maven/working-directory/80/target/test-branch/pom.xml
/home/continuum/continuum-maven/working-directory/80/target/test-branch/readme.txt /home/continuum/continuum-maven/working-directory/80/target/test-branch/src/main/java/Application.java
/home/continuum/continuum-maven/working-directory/80/target/test-branch/src/test/java/Test.java
[ERROR]  exceptions.ImportError: No module named elementtree.ElementTree[ERROR]  exceptions.ImportError:
No module named elementtree.ElementTree[ERROR] 
EXECUTION FAILED
  Execution of cmd : add failed with exit code: 3.
  Working directory was: 
    /home/continuum/continuum-maven/working-directory/80/target/test-branch
  Your Bazaar installation seems to be valid and complete.
    Python version: 2.3.4 (OK)
    Bazaar version: NA (OK)
    Paramiko installed: true (For remote access eg. sftp) 
    cCrypt installed: true (For remote access eg. sftp) 
    cElementTree installed: true (Not mandatory) 

[surefire] Tests run: 1, Failures: 0, Errors: 1, Time elapsed: 0.782 sec <<<<<<<<
FAILURE !! 
[surefire] Running org.apache.maven.scm.provider.bazaar.command.changelog.BazaarChangeLogConsumerTest
[surefire] Tests run: 1, Failures: 0, Errors: 0, Time elapsed: 0.049 sec
[INFO] ----------------------------------------------------------------------------
[ERROR] BUILD ERROR
[INFO] ----------------------------------------------------------------------------
[INFO] There are test failures.
[INFO] ----------------------------------------------------------------------------
[INFO] For more information, run Maven with the -e switch
[INFO] ----------------------------------------------------------------------------
[INFO] Total time: 9 seconds
[INFO] Finished at: Mon Mar 27 17:22:57 PST 2006
[INFO] Final Memory: 7M/158M
[INFO] ----------------------------------------------------------------------------

****************************************************************************



Mime
View raw message