maven-notifications mailing list archives

Site index · List index
Message view « Date » · « Thread »
Top « Date » · « Thread »
From Continuum Build Server <contin...@ci.codehaus.org>
Subject [continuum] BUILD FAILURE: Maven AntRun Plugin
Date Fri, 17 Mar 2006 06:50:02 GMT
Online report : http://ci.codehaus.org/continuum-maven/servlet/continuum/target/ProjectBuild.vm/view/ProjectBuild/id/22/buildId/224
Build statistics:
  State: Failed
  Previous Build: No previous build.
  Started at: Thu, 16 Mar 2006 22:49:55 -0800
  Finished at: Thu, 16 Mar 2006 22:49:57 -0800
  Total time: 2s
  Build Trigger: Forced
  Exit code: 1
  Building machine hostname: cheddar.simulalabs.com
  Operating system : Linux(unknown)
  Java version : 1.5.0_03(Sun Microsystems Inc.)

Changes
      No files changed
  
****************************************************************************
Output:
****************************************************************************
[INFO] Scanning for projects...
[INFO] ----------------------------------------------------------------------------
[ERROR] BUILD FAILURE
[INFO] ----------------------------------------------------------------------------
[INFO] Unable to build project '/home/nobody/continuum-maven/working-directory/22/pom.xml;
it requires Maven version 2.0.1
[INFO] ----------------------------------------------------------------------------
[INFO] For more information, run Maven with the -e switch
[INFO] ----------------------------------------------------------------------------
[INFO] Total time: < 1 second
[INFO] Finished at: Thu Mar 16 22:49:57 PST 2006
[INFO] Final Memory: 1M/60M
[INFO] ----------------------------------------------------------------------------

****************************************************************************



Mime
View raw message