maven-notifications mailing list archives

Site index · List index
Message view « Date » · « Thread »
Top « Date » · « Thread »
From Continuum Build Server <contin...@ci.codehaus.org>
Subject [continuum] BUILD FAILURE: Maven IDEA Plugin
Date Wed, 29 Mar 2006 07:03:24 GMT
Online report : http://ci.codehaus.org/continuum-maven/servlet/continuum/target/ProjectBuild.vm/view/ProjectBuild/id/45/buildId/519
Build statistics:
  State: Failed
  Previous State: Ok
  Started at: Tue, 28 Mar 2006 23:03:16 -0800
  Finished at: Tue, 28 Mar 2006 23:03:24 -0800
  Total time: 8s
  Build Trigger: Schedule
  Exit code: 1
  Building machine hostname: cheddar.simulalabs.com
  Operating system : Linux(unknown)
  Java version : 1.5.0_03(Sun Microsystems Inc.)

Changes
         epunzalan          Committing what I have before I evaluate a patch
             /maven/plugins/trunk/maven-idea-plugin/pom.xml
            /maven/plugins/trunk/maven-idea-plugin/src/test/java/org/apache/maven/plugin/idea/IdeaProjectTest.java
            /maven/plugins/trunk/maven-idea-plugin/src/test/plugin-configs/plugin-config-idea5.xml
            /maven/plugins/trunk/maven-idea-plugin/src/test/plugin-configs/plugin-config-jdkName.xml
        
****************************************************************************
Output:
****************************************************************************
[INFO] Scanning for projects...
[INFO] ----------------------------------------------------------------------------
[INFO] Building Maven IDEA Plugin
[INFO]    task-segment: [clean, install]
[INFO] ----------------------------------------------------------------------------
[INFO] [clean:clean]
[INFO] Deleting directory /home/continuum/continuum-maven/working-directory/45/target
[INFO] Deleting directory /home/continuum/continuum-maven/working-directory/45/target/classes
[INFO] Deleting directory /home/continuum/continuum-maven/working-directory/45/target/test-classes
[INFO] [plugin:descriptor]
[INFO] Using 2 extractors.
[INFO] Applying extractor for language: java
[INFO] Extractor for language: java found 5 mojo descriptors.
[INFO] Applying extractor for language: bsh
[INFO] Extractor for language: bsh found 0 mojo descriptors.
[INFO] [resources:resources]
[INFO] Using default encoding to copy filtered resources.
[INFO] [compiler:compile]
Compiling 7 source files to /home/continuum/continuum-maven/working-directory/45/target/classes
[INFO] [resources:testResources]
[INFO] Using default encoding to copy filtered resources.
[INFO] [compiler:testCompile]
Compiling 4 source files to /home/continuum/continuum-maven/working-directory/45/target/test-classes
[INFO] ----------------------------------------------------------------------------
[ERROR] BUILD FAILURE
[INFO] ----------------------------------------------------------------------------
[INFO] Compilation failure

/home/continuum/continuum-maven/working-directory/45/src/test/java/org/apache/maven/plugin/idea/stubs/ArtifactStub.java:[6,46]
cannot find symbol
symbol  : class StubArtifact
location: package org.apache.maven.plugins.testing.stubs

/home/continuum/continuum-maven/working-directory/45/src/test/java/org/apache/maven/plugin/idea/stubs/ArtifactStub.java:[12,12]
cannot find symbol
symbol: class StubArtifact
    extends StubArtifact

/home/continuum/continuum-maven/working-directory/45/src/test/java/org/apache/maven/plugin/idea/stubs/SimpleMavenProjectStub.java:[21,46]
cannot find symbol
symbol  : class StubMavenProject
location: package org.apache.maven.plugins.testing.stubs

/home/continuum/continuum-maven/working-directory/45/src/test/java/org/apache/maven/plugin/idea/stubs/SimpleMavenProjectStub.java:[32,12]
cannot find symbol
symbol: class StubMavenProject
    extends StubMavenProject

/home/continuum/continuum-maven/working-directory/45/src/test/java/org/apache/maven/plugin/idea/stubs/SimpleMavenProjectStub.java:[105,28]
incompatible types
found   : org.apache.maven.plugin.idea.stubs.ArtifactStub
required: org.apache.maven.artifact.Artifact


[INFO] ----------------------------------------------------------------------------
[INFO] For more information, run Maven with the -e switch
[INFO] ----------------------------------------------------------------------------
[INFO] Total time: 6 seconds
[INFO] Finished at: Tue Mar 28 23:03:23 PST 2006
[INFO] Final Memory: 10M/124M
[INFO] ----------------------------------------------------------------------------

****************************************************************************



Mime
View raw message