maven-notifications mailing list archives

Site index · List index
Message view « Date » · « Thread »
Top « Date » · « Thread »
From Continuum Build Server <contin...@ci.codehaus.org>
Subject [continuum] BUILD SUCCESSFUL: Continuum Core Integration Test
Date Tue, 28 Mar 2006 10:09:44 GMT
Online report : http://ci.codehaus.org/continuum-maven/servlet/continuum/target/ProjectBuild.vm/view/ProjectBuild/id/149/buildId/473
Build statistics:
  State: Ok
  Previous State: Failed
  Started at: Tue, 28 Mar 2006 02:01:58 -0800
  Finished at: Tue, 28 Mar 2006 02:09:44 -0800
  Total time: 7m 46s
  Build Trigger: Schedule
  Exit code: 0
  Building machine hostname: cheddar.simulalabs.com
  Operating system : Linux(unknown)
  Java version : 1.5.0_03(Sun Microsystems Inc.)

Changes
         evenisse          Remove all dependencies to file system in other projects
             /maven/continuum/branches/continuum-1.0.x/continuum-core-it/src/test/java/org/apache/maven/continuum/it/AbstractIntegrationTest.java
        
****************************************************************************
Output:
****************************************************************************
[INFO] Scanning for projects...
[INFO] snapshot org.codehaus.plexus:plexus-maven-plugin:1.2-SNAPSHOT: checking for updates from snapshots
[INFO] snapshot org.codehaus.plexus:plexus-maven-plugin:1.2-SNAPSHOT: checking for updates from apache.snapshots
[INFO] ----------------------------------------------------------------------------
[INFO] Building Continuum Core Integration Test
[INFO]    task-segment: [clean, install]
[INFO] ----------------------------------------------------------------------------
[INFO] [clean:clean]
[INFO] Deleting directory /home/continuum/continuum-maven/working-directory/149/target
[INFO] Deleting directory /home/continuum/continuum-maven/working-directory/149/target/classes
[INFO] Deleting directory /home/continuum/continuum-maven/working-directory/149/target/test-classes
[INFO] snapshot org.apache.maven.plugins:maven-resources-plugin:2.2-SNAPSHOT: checking for updates from snapshots
[INFO] snapshot org.apache.maven.plugins:maven-compiler-plugin:2.0.1-SNAPSHOT: checking for updates from snapshots
[INFO] snapshot org.apache.maven.plugins:maven-surefire-plugin:2.1.3-SNAPSHOT: checking for updates from snapshots
[INFO] snapshot org.apache.maven.plugins:maven-jar-plugin:2.1-SNAPSHOT: checking for updates from snapshots
[INFO] [resources:resources]
[INFO] Using default encoding to copy filtered resources.
[INFO] snapshot org.apache.maven.continuum:continuum-xmlrpc:1.0.3-SNAPSHOT: checking for updates from snapshots
[INFO] snapshot org.apache.maven.continuum:continuum-xmlrpc:1.0.3-SNAPSHOT: checking for updates from apache.snapshots
[INFO] snapshot org.apache.maven.continuum:continuum-core:1.0.3-SNAPSHOT: checking for updates from snapshots
[INFO] snapshot org.apache.maven.continuum:continuum-core:1.0.3-SNAPSHOT: checking for updates from apache.snapshots
[INFO] snapshot org.apache.maven.continuum:continuum-store:1.0.3-SNAPSHOT: checking for updates from snapshots
[INFO] snapshot org.apache.maven.continuum:continuum-store:1.0.3-SNAPSHOT: checking for updates from apache.snapshots
[INFO] snapshot org.codehaus.plexus:plexus-jdo2:1.0-alpha-4-SNAPSHOT: checking for updates from snapshots
[INFO] snapshot org.codehaus.plexus:plexus-jdo2:1.0-alpha-4-SNAPSHOT: checking for updates from apache.snapshots
[INFO] snapshot org.codehaus.plexus:plexus-utils:1.2-SNAPSHOT: checking for updates from snapshots
[INFO] snapshot org.codehaus.plexus:plexus-utils:1.2-SNAPSHOT: checking for updates from apache.snapshots
[INFO] snapshot org.apache.maven.continuum:continuum-model:1.0.3-SNAPSHOT: checking for updates from snapshots
[INFO] snapshot org.apache.maven.continuum:continuum-model:1.0.3-SNAPSHOT: checking for updates from apache.snapshots
[INFO] snapshot org.apache.maven.continuum:continuum-api:1.0.3-SNAPSHOT: checking for updates from snapshots
[INFO] snapshot org.apache.maven.continuum:continuum-api:1.0.3-SNAPSHOT: checking for updates from apache.snapshots
[INFO] snapshot org.codehaus.plexus:plexus-formica:1.0-beta-10-SNAPSHOT: checking for updates from snapshots
[INFO] snapshot org.codehaus.plexus:plexus-formica:1.0-beta-10-SNAPSHOT: checking for updates from apache.snapshots
[INFO] snapshot org.codehaus.plexus:plexus-quartz:1.0-alpha-2-SNAPSHOT: checking for updates from snapshots
[INFO] snapshot org.codehaus.plexus:plexus-quartz:1.0-alpha-2-SNAPSHOT: checking for updates from apache.snapshots
Downloading: http://repo1.maven.org/maven2/org/apache/maven/maven-project/2.0.3/maven-project-2.0.3.pom
1K downloaded
Downloading: http://repo1.maven.org/maven2/org/apache/maven/maven/2.0.3/maven-2.0.3.pom
14K downloaded
Downloading: http://repo1.maven.org/maven2/org/apache/maven/maven-settings/2.0.3/maven-settings-2.0.3.pom
1K downloaded
Downloading: http://repo1.maven.org/maven2/org/apache/maven/maven-model/2.0.3/maven-model-2.0.3.pom
2K downloaded
Downloading: http://repo1.maven.org/maven2/org/apache/maven/maven-artifact/2.0.3/maven-artifact-2.0.3.pom
765b downloaded
Downloading: http://repo1.maven.org/maven2/org/apache/maven/maven-profile/2.0.3/maven-profile-2.0.3.pom
1K downloaded
Downloading: http://repo1.maven.org/maven2/org/apache/maven/maven-artifact-manager/2.0.3/maven-artifact-manager-2.0.3.pom
1K downloaded
Downloading: http://repo1.maven.org/maven2/org/apache/maven/maven-repository-metadata/2.0.3/maven-repository-metadata-2.0.3.pom
1K downloaded
[INFO] snapshot org.codehaus.plexus:plexus-security-api:1.0-alpha-3-SNAPSHOT: checking for updates from apache.snapshots
[INFO] snapshot org.codehaus.plexus:plexus-security:1.0-alpha-3-SNAPSHOT: checking for updates from snapshots
[INFO] snapshot org.codehaus.plexus:plexus-security:1.0-alpha-3-SNAPSHOT: checking for updates from apache.snapshots
[INFO] snapshot org.apache.maven.continuum:continuum-notifier-api:1.0.3-SNAPSHOT: checking for updates from snapshots
[INFO] snapshot org.apache.maven.continuum:continuum-notifier-api:1.0.3-SNAPSHOT: checking for updates from apache.snapshots
[INFO] snapshot org.apache.maven.continuum:continuum-notifiers:1.0.3-SNAPSHOT: checking for updates from snapshots
[INFO] snapshot org.apache.maven.continuum:continuum-notifiers:1.0.3-SNAPSHOT: checking for updates from apache.snapshots
[INFO] snapshot org.apache.maven.scm:maven-scm-manager-plexus:1.0-beta-3-SNAPSHOT: checking for updates from apache.snapshots
[INFO] snapshot org.apache.maven.scm:maven-scm-managers:1.0-beta-3-SNAPSHOT: checking for updates from apache.snapshots
Downloading: http://repo1.maven.org/maven2/org/apache/maven/maven-core/2.0.3/maven-core-2.0.3.pom
5K downloaded
Downloading: http://repo1.maven.org/maven2/org/apache/maven/maven-plugin-parameter-documenter/2.0.3/maven-plugin-parameter-documenter-2.0.3.pom
1K downloaded
Downloading: http://repo1.maven.org/maven2/org/apache/maven/reporting/maven-reporting-api/2.0.3/maven-reporting-api-2.0.3.pom
902b downloaded
Downloading: http://repo1.maven.org/maven2/org/apache/maven/reporting/maven-reporting/2.0.3/maven-reporting-2.0.3.pom
12K downloaded
Downloading: http://repo1.maven.org/maven2/org/apache/maven/maven-plugin-registry/2.0.3/maven-plugin-registry-2.0.3.pom
1K downloaded
Downloading: http://repo1.maven.org/maven2/org/apache/maven/maven-error-diagnostics/2.0.3/maven-error-diagnostics-2.0.3.pom
854b downloaded
Downloading: http://repo1.maven.org/maven2/org/apache/maven/maven-plugin-descriptor/2.0.3/maven-plugin-descriptor-2.0.3.pom
1K downloaded
Downloading: http://repo1.maven.org/maven2/org/apache/maven/maven-plugin-api/2.0.3/maven-plugin-api-2.0.3.pom
643b downloaded
Downloading: http://repo1.maven.org/maven2/org/apache/maven/maven-monitor/2.0.3/maven-monitor-2.0.3.pom
442b downloaded
[INFO] snapshot org.apache.maven.continuum:continuum-plexus-application:1.0.3-SNAPSHOT: checking for updates from snapshots
[INFO] snapshot org.apache.maven.continuum:continuum-plexus-application:1.0.3-SNAPSHOT: checking for updates from apache.snapshots
[INFO] snapshot org.apache.maven.continuum:continuum-notifier-msn:1.0.3-SNAPSHOT: checking for updates from snapshots
[INFO] snapshot org.apache.maven.continuum:continuum-notifier-msn:1.0.3-SNAPSHOT: checking for updates from apache.snapshots
[INFO] snapshot org.apache.maven.continuum:continuum-notifier-irc:1.0.3-SNAPSHOT: checking for updates from snapshots
[INFO] snapshot org.apache.maven.continuum:continuum-notifier-irc:1.0.3-SNAPSHOT: checking for updates from apache.snapshots
[INFO] snapshot org.codehaus.plexus:plexus-appserver:1.0-alpha-5-SNAPSHOT: checking for updates from snapshots
[INFO] snapshot org.codehaus.plexus:plexus-appserver:1.0-alpha-5-SNAPSHOT: checking for updates from apache.snapshots
[INFO] snapshot org.codehaus.plexus:plexus-xmlrpc:1.0-beta-4-SNAPSHOT: checking for updates from snapshots
[INFO] snapshot org.codehaus.plexus:plexus-xmlrpc:1.0-beta-4-SNAPSHOT: checking for updates from apache.snapshots
[INFO] snapshot org.apache.maven.scm:maven-scm-provider-perforce:1.0-beta-3-SNAPSHOT: checking for updates from apache.snapshots
[INFO] snapshot org.apache.maven.scm:maven-scm-provider-bazaar:1.0-beta-3-SNAPSHOT: checking for updates from apache.snapshots
[INFO] snapshot org.apache.maven.continuum:continuum-notifier-jabber:1.0.3-SNAPSHOT: checking for updates from snapshots
[INFO] snapshot org.apache.maven.continuum:continuum-notifier-jabber:1.0.3-SNAPSHOT: checking for updates from apache.snapshots
[INFO] snapshot org.codehaus.plexus:plexus-jabber:1.0-alpha-4-SNAPSHOT: checking for updates from snapshots
[INFO] snapshot org.codehaus.plexus:plexus-jabber:1.0-alpha-4-SNAPSHOT: checking for updates from apache.snapshots
[INFO] snapshot org.apache.maven.scm:maven-scm-provider-local:1.0-beta-3-SNAPSHOT: checking for updates from snapshots
[INFO] snapshot org.apache.maven.scm:maven-scm-provider-local:1.0-beta-3-SNAPSHOT: checking for updates from apache.snapshots
[INFO] snapshot org.apache.maven.continuum:continuum-web:1.0.3-SNAPSHOT: checking for updates from snapshots
[INFO] snapshot org.apache.maven.continuum:continuum-web:1.0.3-SNAPSHOT: checking for updates from apache.snapshots
[INFO] snapshot org.codehaus.plexus:plexus-summit:1.0-beta-9-SNAPSHOT: checking for updates from snapshots
[INFO] snapshot org.codehaus.plexus:plexus-summit:1.0-beta-9-SNAPSHOT: checking for updates from apache.snapshots
[INFO] snapshot org.codehaus.plexus:plexus-security-summit:1.0-alpha-3-SNAPSHOT: checking for updates from snapshots
[INFO] snapshot org.codehaus.plexus:plexus-security-summit:1.0-alpha-3-SNAPSHOT: checking for updates from apache.snapshots
[WARNING] 
	Artifact junit:junit:jar:3.8.1:test retains local scope 'test' overriding broader scope 'compile'
	given by a dependency. If this is not intended, modify or remove the local scope.

[INFO] snapshot org.apache.maven.continuum:continuum-test:1.0.3-SNAPSHOT: checking for updates from snapshots
[INFO] snapshot org.apache.maven.continuum:continuum-test:1.0.3-SNAPSHOT: checking for updates from apache.snapshots
Downloading: http://repo1.maven.org/maven2/org/apache/maven/maven-artifact/2.0.3/maven-artifact-2.0.3.jar
80K downloaded
Downloading: http://repo1.maven.org/maven2/org/apache/maven/maven-plugin-api/2.0.3/maven-plugin-api-2.0.3.jar
10K downloaded
Downloading: http://repo1.maven.org/maven2/org/apache/maven/reporting/maven-reporting-api/2.0.3/maven-reporting-api-2.0.3.jar
6K downloaded
Downloading: http://repo1.maven.org/maven2/org/apache/maven/maven-model/2.0.3/maven-model-2.0.3.jar
80K downloaded
Downloading: http://repo1.maven.org/maven2/org/apache/maven/maven-error-diagnostics/2.0.3/maven-error-diagnostics-2.0.3.jar
10K downloaded
Downloading: http://repo1.maven.org/maven2/org/apache/maven/maven-plugin-descriptor/2.0.3/maven-plugin-descriptor-2.0.3.jar
33K downloaded
Downloading: http://repo1.maven.org/maven2/org/apache/maven/maven-project/2.0.3/maven-project-2.0.3.jar
107K downloaded
Downloading: http://repo1.maven.org/maven2/org/apache/maven/maven-monitor/2.0.3/maven-monitor-2.0.3.jar
7K downloaded
Downloading: http://repo1.maven.org/maven2/org/apache/maven/maven-plugin-registry/2.0.3/maven-plugin-registry-2.0.3.jar
25K downloaded
Downloading: http://repo1.maven.org/maven2/org/apache/maven/maven-repository-metadata/2.0.3/maven-repository-metadata-2.0.3.jar
21K downloaded
Downloading: http://repo1.maven.org/maven2/org/apache/maven/maven-artifact-manager/2.0.3/maven-artifact-manager-2.0.3.jar
50K downloaded
Downloading: http://repo1.maven.org/maven2/org/apache/maven/maven-core/2.0.3/maven-core-2.0.3.jar
135K downloaded
Downloading: http://repo1.maven.org/maven2/org/apache/maven/maven-settings/2.0.3/maven-settings-2.0.3.jar
44K downloaded
Downloading: http://repo1.maven.org/maven2/org/apache/maven/maven-profile/2.0.3/maven-profile-2.0.3.jar
31K downloaded
Downloading: http://repo1.maven.org/maven2/org/apache/maven/maven-plugin-parameter-documenter/2.0.3/maven-plugin-parameter-documenter-2.0.3.jar
18K downloaded
[INFO] [compiler:compile]
[INFO] No sources to compile
[INFO] [resources:testResources]
[INFO] Using default encoding to copy filtered resources.
[INFO] [compiler:testCompile]
Compiling 7 source files to /home/continuum/continuum-maven/working-directory/149/target/test-classes
[INFO] [surefire:test]
[INFO] Setting reports dir: /home/continuum/continuum-maven/working-directory/149/target/surefire-reports

-------------------------------------------------------
 T E S T S
-------------------------------------------------------
[surefire] Running org.apache.maven.continuum.it.ShellIntegrationTest
2006-03-28 02:06:09,153 [main] DEBUG PlexusContainer                - Found 3 components to load on start
2006-03-28 02:06:09,156 [main] INFO  PlexusContainer                - Loading on start [role]: [org.apache.maven.continuum.Continuum]
2006-03-28 02:06:09,197 [main] INFO  JdoFactory                     - Initializing JDO.
2006-03-28 02:06:09,614 [main] INFO  JDO                            - PersistenceManagerFactory - Vendor: JPOX  Version: 1.1.0-rc-1
2006-03-28 02:06:09,614 [main] INFO  JDO                            - PersistenceManagerFactory initialised for datastore URL=jdbc:derby:/home/continuum/continuum-maven/working-directory/149/target/level1/level2/plexus-home/database;create=true driver=org.apache.derby.jdbc.EmbeddedDriver userName=sa
Mar 28, 2006 2:06:09 AM org.quartz.simpl.RAMJobStore initialize
INFO: RAMJobStore initialized.
Mar 28, 2006 2:06:09 AM org.quartz.impl.StdSchedulerFactory instantiate
INFO: Quartz scheduler 'defaultScheduler' initialized from an externally provided properties instance.
Mar 28, 2006 2:06:09 AM org.quartz.impl.StdSchedulerFactory instantiate
INFO: Quartz scheduler version: 1.4.5
Mar 28, 2006 2:06:09 AM org.quartz.core.QuartzScheduler start
INFO: Scheduler defaultScheduler_$_NON_CLUSTERED started.
2006-03-28 02:06:09,753 [main] WARN  ContinuumBuildExecutor:ant     - Could not find the executable 'ant' in the path '[]'.
2006-03-28 02:06:09,758 [main] WARN  ContinuumBuildExecutor:maven-1 - Could not find the executable 'maven' in the path '[]'.
2006-03-28 02:06:09,928 [main] DEBUG MavenSettingsBuilder           - Building Maven global-level settings from: '/usr/local/maven-2.0.3-SNAPSHOT/conf/settings.xml'
2006-03-28 02:06:09,929 [main] DEBUG MavenSettingsBuilder           - Building Maven user-level settings from: '/home/continuum/.m2/settings.xml'
2006-03-28 02:06:09,997 [main] WARN  ContinuumBuildExecutor:maven2  - Could not find the executable 'mvn' in the path '[]'.
2006-03-28 02:06:09,998 [main] INFO  BuildExecutorManager           - Build executors:
2006-03-28 02:06:09,999 [main] INFO  BuildExecutorManager           -   maven-1
2006-03-28 02:06:09,999 [main] INFO  BuildExecutorManager           -   ant
2006-03-28 02:06:09,999 [main] INFO  BuildExecutorManager           -   maven2
2006-03-28 02:06:09,999 [main] INFO  BuildExecutorManager           -   shell
2006-03-28 02:06:10,006 [main] INFO  Continuum                      - Initializing Continuum.
2006-03-28 02:06:10,007 [main] INFO  Continuum                      - Showing all projects: 
2006-03-28 02:06:12,833 [main] INFO  RDBMS                          - RDBMS Adapter initialised : CloudscapeAdapter : Apache Derby version=10.1.2.1, major=10, minor=1, revision=2
Identifier Names : UPPERCASE 
Driver name=Apache Derby Embedded JDBC Driver, version=10.1.2.1, major=10, minor=1
Identifier Max Lengths : Table=128  Column=128  Constraint=18  Index=18  Delimeters="
Identifier Support in DDL : catalog=false  schema=true
2006-03-28 02:06:12,834 [main] INFO  SCHEMA                         - Initialising Catalog "", Schema "SA" using "SchemaTable" auto-start option
2006-03-28 02:06:12,846 [main] WARN  RDBMS                          - Error initialising derby schema : Schema 'SA' does not exist
ERROR 42Y07: Schema 'SA' does not exist
	at org.apache.derby.iapi.error.StandardException.newException(Unknown Source)
	at org.apache.derby.impl.sql.catalog.DataDictionaryImpl.getSchemaDescriptor(Unknown Source)
	at org.apache.derby.impl.sql.compile.QueryTreeNode.getSchemaDescriptor(Unknown Source)
	at org.apache.derby.impl.sql.compile.DDLStatementNode.getSchemaDescriptor(Unknown Source)
	at org.apache.derby.impl.sql.compile.DropAliasNode.bind(Unknown Source)
	at org.apache.derby.impl.sql.GenericStatement.prepMinion(Unknown Source)
	at org.apache.derby.impl.sql.GenericStatement.prepare(Unknown Source)
	at org.apache.derby.impl.sql.conn.GenericLanguageConnectionContext.prepareInternalStatement(Unknown Source)
	at org.apache.derby.impl.jdbc.EmbedStatement.execute(Unknown Source)
	at org.apache.derby.impl.jdbc.EmbedStatement.execute(Unknown Source)
	at org.jpox.store.rdbms.adapter.CloudscapeAdapter.initialiseDatastore(CloudscapeAdapter.java:115)
	at org.jpox.store.rdbms.RDBMSManager.initialiseSchema(RDBMSManager.java:442)
	at org.jpox.store.rdbms.RDBMSManager.<init>(RDBMSManager.java:237)
	at org.jpox.store.rdbms.RDBMSManagerFactory.getStoreManager(RDBMSManagerFactory.java:59)
	at org.jpox.AbstractPersistenceManager.<init>(AbstractPersistenceManager.java:221)
	at org.jpox.PersistenceManagerImpl.<init>(PersistenceManagerImpl.java:34)
	at org.jpox.PersistenceManagerFactoryImpl.getPersistenceManager(PersistenceManagerFactoryImpl.java:887)
	at org.jpox.PersistenceManagerFactoryImpl.getPersistenceManager(PersistenceManagerFactoryImpl.java:862)
	at org.apache.maven.continuum.store.JdoContinuumStore.getPersistenceManager(JdoContinuumStore.java:1283)
	at org.apache.maven.continuum.store.JdoContinuumStore.getAllObjectsDetached(JdoContinuumStore.java:980)
	at org.apache.maven.continuum.store.JdoContinuumStore.getAllProjectsByNameWithBuildDetails(JdoContinuumStore.java:638)
	at org.apache.maven.continuum.DefaultContinuum.initialize(DefaultContinuum.java:1884)
	at org.codehaus.plexus.personality.plexus.lifecycle.phase.InitializePhase.execute(InitializePhase.java:16)
	at org.codehaus.plexus.lifecycle.AbstractLifecycleHandler.start(AbstractLifecycleHandler.java:101)
	at org.codehaus.plexus.component.manager.AbstractComponentManager.startComponentLifecycle(AbstractComponentManager.java:105)
	at org.codehaus.plexus.component.manager.AbstractComponentManager.createComponentInstance(AbstractComponentManager.java:95)
	at org.codehaus.plexus.component.manager.ClassicSingletonComponentManager.getComponent(ClassicSingletonComponentManager.java:92)
	at org.codehaus.plexus.DefaultPlexusContainer.lookup(DefaultPlexusContainer.java:331)
	at org.codehaus.plexus.DefaultPlexusContainer.loadComponentsOnStart(DefaultPlexusContainer.java:894)
	at org.codehaus.plexus.DefaultPlexusContainer.start(DefaultPlexusContainer.java:781)
	at org.codehaus.plexus.PlexusTestCase.setUp(PlexusTestCase.java:121)
	at org.apache.maven.continuum.it.AbstractIntegrationTest.setUp(AbstractIntegrationTest.java:150)
	at junit.framework.TestCase.runBare(TestCase.java:125)
	at junit.framework.TestResult$1.protect(TestResult.java:106)
	at junit.framework.TestResult.runProtected(TestResult.java:124)
	at junit.framework.TestResult.run(TestResult.java:109)
	at junit.framework.TestCase.run(TestCase.java:118)
	at junit.framework.TestSuite.runTest(TestSuite.java:208)
	at junit.framework.TestSuite.run(TestSuite.java:203)
	at sun.reflect.NativeMethodAccessorImpl.invoke0(Native Method)
	at sun.reflect.NativeMethodAccessorImpl.invoke(NativeMethodAccessorImpl.java:39)
	at sun.reflect.DelegatingMethodAccessorImpl.invoke(DelegatingMethodAccessorImpl.java:25)
	at java.lang.reflect.Method.invoke(Method.java:585)
	at org.apache.maven.surefire.battery.JUnitBattery.executeJUnit(JUnitBattery.java:242)
	at org.apache.maven.surefire.battery.JUnitBattery.execute(JUnitBattery.java:216)
	at org.apache.maven.surefire.Surefire.executeBattery(Surefire.java:215)
	at org.apache.maven.surefire.Surefire.run(Surefire.java:163)
	at org.apache.maven.surefire.Surefire.run(Surefire.java:87)
	at sun.reflect.NativeMethodAccessorImpl.invoke0(Native Method)
	at sun.reflect.NativeMethodAccessorImpl.invoke(NativeMethodAccessorImpl.java:39)
	at sun.reflect.DelegatingMethodAccessorImpl.invoke(DelegatingMethodAccessorImpl.java:25)
	at java.lang.reflect.Method.invoke(Method.java:585)
	at org.apache.maven.surefire.SurefireBooter.runTestsInProcess(SurefireBooter.java:313)
	at org.apache.maven.surefire.SurefireBooter.run(SurefireBooter.java:221)
	at org.apache.maven.test.SurefirePlugin.execute(SurefirePlugin.java:371)
	at org.apache.maven.plugin.DefaultPluginManager.executeMojo(DefaultPluginManager.java:412)
	at org.apache.maven.lifecycle.DefaultLifecycleExecutor.executeGoals(DefaultLifecycleExecutor.java:534)
	at org.apache.maven.lifecycle.DefaultLifecycleExecutor.executeGoalWithLifecycle(DefaultLifecycleExecutor.java:475)
	at org.apache.maven.lifecycle.DefaultLifecycleExecutor.executeGoal(DefaultLifecycleExecutor.java:454)
	at org.apache.maven.lifecycle.DefaultLifecycleExecutor.executeGoalAndHandleFailures(DefaultLifecycleExecutor.java:306)
	at org.apache.maven.lifecycle.DefaultLifecycleExecutor.executeTaskSegments(DefaultLifecycleExecutor.java:273)
	at org.apache.maven.lifecycle.DefaultLifecycleExecutor.execute(DefaultLifecycleExecutor.java:140)
	at org.apache.maven.DefaultMaven.doExecute(DefaultMaven.java:322)
	at org.apache.maven.DefaultMaven.execute(DefaultMaven.java:115)
	at org.apache.maven.cli.MavenCli.main(MavenCli.java:256)
	at sun.reflect.NativeMethodAccessorImpl.invoke0(Native Method)
	at sun.reflect.NativeMethodAccessorImpl.invoke(NativeMethodAccessorImpl.java:39)
	at sun.reflect.DelegatingMethodAccessorImpl.invoke(DelegatingMethodAccessorImpl.java:25)
	at java.lang.reflect.Method.invoke(Method.java:585)
	at org.codehaus.classworlds.Launcher.launchEnhanced(Launcher.java:315)
	at org.codehaus.classworlds.Launcher.launch(Launcher.java:255)
	at org.codehaus.classworlds.Launcher.mainWithExitCode(Launcher.java:430)
	at org.codehaus.classworlds.Launcher.main(Launcher.java:375)

2006-03-28 02:06:13,813 [main] INFO  RDBMS                          - Creating table JPOX_TABLES
2006-03-28 02:06:14,405 [main] INFO  SCHEMA                         - Catalog "", Schema "SA" initialised - managing 0 classes
2006-03-28 02:06:14,481 [main] INFO  MetaData                       - Parsing MetaData from file "file:/home/continuum/.m2/repository/org/apache/maven/continuum/continuum-model/1.0.3-SNAPSHOT/continuum-model-1.0.3-SNAPSHOT.jar!/META-INF/package.jdo"
2006-03-28 02:06:15,009 [main] INFO  SCHEMA                         - Managing Persistence of Class : org.apache.maven.continuum.model.system.Installation [Table : INSTALLATION, InheritanceStrategy : new-table]
2006-03-28 02:06:15,137 [main] INFO  SCHEMA                         - Managing Persistence of Class : org.apache.maven.continuum.model.project.Profile [Table : PROFILE, InheritanceStrategy : new-table]
2006-03-28 02:06:15,145 [main] INFO  SCHEMA                         - Managing Persistence of Class : org.apache.maven.continuum.model.project.Schedule [Table : SCHEDULE, InheritanceStrategy : new-table]
2006-03-28 02:06:15,148 [main] INFO  SCHEMA                         - Managing Persistence of Class : org.apache.maven.continuum.model.project.BuildDefinition [Table : BUILDDEFINITION, InheritanceStrategy : new-table]
2006-03-28 02:06:15,152 [main] INFO  SCHEMA                         - Managing Persistence of Class : org.apache.maven.continuum.model.scm.ChangeFile [Table : CHANGEFILE, InheritanceStrategy : new-table]
2006-03-28 02:06:15,155 [main] INFO  SCHEMA                         - Managing Persistence of Class : org.apache.maven.continuum.model.scm.ChangeSet [Table : CHANGESET, InheritanceStrategy : new-table]
2006-03-28 02:06:15,161 [main] INFO  SCHEMA                         - Managing Persistence of Class : org.apache.maven.continuum.model.scm.ScmResult [Table : SCMRESULT, InheritanceStrategy : new-table]
2006-03-28 02:06:15,166 [main] INFO  SCHEMA                         - Managing Persistence of Class : org.apache.maven.continuum.model.project.BuildResult [Table : BUILDRESULT, InheritanceStrategy : new-table]
2006-03-28 02:06:15,171 [main] INFO  SCHEMA                         - Managing Persistence of Class : org.apache.maven.continuum.model.project.ProjectDependency [Table : PROJECTDEPENDENCY, InheritanceStrategy : new-table]
2006-03-28 02:06:15,176 [main] INFO  SCHEMA                         - Managing Persistence of Class : org.apache.maven.continuum.model.project.ProjectDeveloper [Table : PROJECTDEVELOPER, InheritanceStrategy : new-table]
2006-03-28 02:06:15,181 [main] INFO  SCHEMA                         - Managing Persistence of Class : org.apache.maven.continuum.model.project.ProjectNotifier [Table : PROJECTNOTIFIER, InheritanceStrategy : new-table]
2006-03-28 02:06:15,186 [main] INFO  SCHEMA                         - Managing Persistence of Class : org.apache.maven.continuum.model.project.ProjectGroup [Table : PROJECTGROUP, InheritanceStrategy : new-table]
2006-03-28 02:06:15,191 [main] INFO  SCHEMA                         - Managing Persistence of Class : org.apache.maven.continuum.model.project.Project [Table : PROJECT, InheritanceStrategy : new-table]
2006-03-28 02:06:15,238 [main] INFO  SCHEMA                         - Managing Persistence of Field : org.apache.maven.continuum.model.project.ProjectNotifier.configuration [Table : PROJECTNOTIFIER_CONFIGURATION]
2006-03-28 02:06:15,260 [main] INFO  SCHEMA                         - Managing Persistence of Field : org.apache.maven.continuum.model.project.ProjectGroup.buildDefinitions [Table : PROJECTGROUP_BUILDDEFINITIONS]
2006-03-28 02:06:15,268 [main] INFO  SCHEMA                         - Managing Persistence of Field : org.apache.maven.continuum.model.project.ProjectGroup.notifiers [Table : PROJECTGROUP_NOTIFIERS]
2006-03-28 02:06:15,290 [main] INFO  SCHEMA                         - Managing Persistence of Field : org.apache.maven.continuum.model.project.Project.buildDefinitions [Table : PROJECT_BUILDDEFINITIONS]
2006-03-28 02:06:15,302 [main] INFO  SCHEMA                         - Managing Persistence of Field : org.apache.maven.continuum.model.project.Project.notifiers [Table : PROJECT_NOTIFIERS]
2006-03-28 02:06:15,363 [main] INFO  SCHEMA                         - No column info found for table "CHANGEFILE" - the table apparently doesnt yet exist in the datastore
2006-03-28 02:06:15,364 [main] INFO  RDBMS                          - Creating table CHANGEFILE
2006-03-28 02:06:15,634 [main] INFO  SCHEMA                         - No column info found for table "BUILDDEFINITION" - the table apparently doesnt yet exist in the datastore
2006-03-28 02:06:15,671 [main] INFO  RDBMS                          - Creating table BUILDDEFINITION
2006-03-28 02:06:15,899 [main] WARN  RDBMS                          - Column BUILDDEFINITION.LATEST_BUILD_ID should not allow nulls but does. You can prevent nulls by specifying "allows-null" as "false" for the <field> in the MetaData
2006-03-28 02:06:15,952 [main] INFO  SCHEMA                         - No column info found for table "PROJECTNOTIFIER" - the table apparently doesnt yet exist in the datastore
2006-03-28 02:06:15,990 [main] INFO  RDBMS                          - Creating table PROJECTNOTIFIER
2006-03-28 02:06:16,262 [main] INFO  SCHEMA                         - No column info found for table "CHANGESET" - the table apparently doesnt yet exist in the datastore
2006-03-28 02:06:16,299 [main] INFO  RDBMS                          - Creating table CHANGESET
2006-03-28 02:06:16,581 [main] INFO  SCHEMA                         - No column info found for table "PROJECTGROUP" - the table apparently doesnt yet exist in the datastore
2006-03-28 02:06:16,625 [main] INFO  RDBMS                          - Creating table PROJECTGROUP
2006-03-28 02:06:16,904 [main] INFO  SCHEMA                         - No column info found for table "SCMRESULT" - the table apparently doesnt yet exist in the datastore
2006-03-28 02:06:16,954 [main] INFO  RDBMS                          - Creating table SCMRESULT
2006-03-28 02:06:17,212 [main] INFO  SCHEMA                         - No column info found for table "BUILDRESULT" - the table apparently doesnt yet exist in the datastore
2006-03-28 02:06:17,260 [main] INFO  RDBMS                          - Creating table BUILDRESULT
2006-03-28 02:06:17,501 [main] INFO  SCHEMA                         - No column info found for table "PROJECTDEVELOPER" - the table apparently doesnt yet exist in the datastore
2006-03-28 02:06:17,537 [main] INFO  RDBMS                          - Creating table PROJECTDEVELOPER
2006-03-28 02:06:17,797 [main] INFO  SCHEMA                         - No column info found for table "SCHEDULE" - the table apparently doesnt yet exist in the datastore
2006-03-28 02:06:17,832 [main] INFO  RDBMS                          - Creating table SCHEDULE
2006-03-28 02:06:18,075 [main] INFO  SCHEMA                         - No column info found for table "INSTALLATION" - the table apparently doesnt yet exist in the datastore
2006-03-28 02:06:18,119 [main] INFO  RDBMS                          - Creating table INSTALLATION
2006-03-28 02:06:18,343 [main] INFO  SCHEMA                         - No column info found for table "PROJECT" - the table apparently doesnt yet exist in the datastore
2006-03-28 02:06:18,383 [main] INFO  RDBMS                          - Creating table PROJECT
2006-03-28 02:06:18,653 [main] INFO  SCHEMA                         - No column info found for table "PROJECTDEPENDENCY" - the table apparently doesnt yet exist in the datastore
2006-03-28 02:06:18,687 [main] INFO  RDBMS                          - Creating table PROJECTDEPENDENCY
2006-03-28 02:06:18,975 [main] INFO  SCHEMA                         - No column info found for table "PROFILE" - the table apparently doesnt yet exist in the datastore
2006-03-28 02:06:19,022 [main] INFO  RDBMS                          - Creating table PROFILE
2006-03-28 02:06:19,410 [main] INFO  SCHEMA                         - No column info found for table "PROJECT_NOTIFIERS" - the table apparently doesnt yet exist in the datastore
2006-03-28 02:06:19,452 [main] INFO  RDBMS                          - Creating table PROJECT_NOTIFIERS
2006-03-28 02:06:19,735 [main] INFO  SCHEMA                         - No column info found for table "PROJECTGROUP_NOTIFIERS" - the table apparently doesnt yet exist in the datastore
2006-03-28 02:06:19,767 [main] INFO  RDBMS                          - Creating table PROJECTGROUP_NOTIFIERS
2006-03-28 02:06:20,062 [main] INFO  SCHEMA                         - No column info found for table "PROJECTNOTIFIER_CONFIGURATION" - the table apparently doesnt yet exist in the datastore
2006-03-28 02:06:20,108 [main] INFO  RDBMS                          - Creating table PROJECTNOTIFIER_CONFIGURATION
2006-03-28 02:06:20,369 [main] INFO  SCHEMA                         - No column info found for table "PROJECTGROUP_BUILDDEFINITIONS" - the table apparently doesnt yet exist in the datastore
2006-03-28 02:06:20,401 [main] INFO  RDBMS                          - Creating table PROJECTGROUP_BUILDDEFINITIONS
2006-03-28 02:06:20,710 [main] INFO  SCHEMA                         - No column info found for table "PROJECT_BUILDDEFINITIONS" - the table apparently doesnt yet exist in the datastore
2006-03-28 02:06:20,760 [main] INFO  RDBMS                          - Creating table PROJECT_BUILDDEFINITIONS
2006-03-28 02:07:21,264 [main] INFO  RDBMS                          - Validated 1 unique key(s) for table CHANGEFILE
2006-03-28 02:08:21,464 [main] INFO  RDBMS                          - Creating foreign key constraint : SA.CHANGEFILE_FK1
2006-03-28 02:08:21,629 [main] INFO  RDBMS                          - Validated 1 unique key(s) for table BUILDDEFINITION
2006-03-28 02:08:21,646 [main] INFO  RDBMS                          - Creating foreign key constraint : SA.BUILDDEFINITKW_FK1
2006-03-28 02:08:21,714 [main] INFO  RDBMS                          - Creating foreign key constraint : SA.BUILDDEFINITKW_FK2
2006-03-28 02:08:21,881 [main] INFO  RDBMS                          - Validated 1 unique key(s) for table PROJECTNOTIFIER
2006-03-28 02:08:21,985 [main] INFO  RDBMS                          - Validated 1 unique key(s) for table CHANGESET
2006-03-28 02:08:21,999 [main] INFO  RDBMS                          - Creating foreign key constraint : SA.CHANGESET_FK1
2006-03-28 02:08:22,144 [main] INFO  RDBMS                          - Validated 1 unique key(s) for table PROJECTGROUP
2006-03-28 02:08:22,248 [main] INFO  RDBMS                          - Validated 1 unique key(s) for table SCMRESULT
2006-03-28 02:08:22,353 [main] INFO  RDBMS                          - Validated 1 unique key(s) for table BUILDRESULT
2006-03-28 02:08:22,368 [main] INFO  RDBMS                          - Creating foreign key constraint : SA.BUILDRESULT_FK1
2006-03-28 02:08:22,434 [main] INFO  RDBMS                          - Creating foreign key constraint : SA.BUILDRESULT_FK2
2006-03-28 02:08:22,588 [main] INFO  RDBMS                          - Validated 1 unique key(s) for table PROJECTDEVELOPER
2006-03-28 02:08:22,602 [main] INFO  RDBMS                          - Creating foreign key constraint : SA.PROJECTDEVELZY_FK1
2006-03-28 02:08:22,754 [main] INFO  RDBMS                          - Validated 1 unique key(s) for table SCHEDULE
2006-03-28 02:08:22,854 [main] INFO  RDBMS                          - Validated 1 unique key(s) for table INSTALLATION
2006-03-28 02:08:22,977 [main] INFO  RDBMS                          - Validated 1 unique key(s) for table PROJECT
2006-03-28 02:08:23,000 [main] INFO  RDBMS                          - Creating foreign key constraint : SA.PROJECT_FK2
2006-03-28 02:08:23,067 [main] INFO  RDBMS                          - Creating foreign key constraint : SA.PROJECT_FK3
2006-03-28 02:08:23,157 [main] INFO  RDBMS                          - Creating foreign key constraint : SA.PROJECT_FK1
2006-03-28 02:08:23,316 [main] INFO  RDBMS                          - Validated 1 unique key(s) for table PROJECTDEPENDENCY
2006-03-28 02:08:23,331 [main] INFO  RDBMS                          - Creating foreign key constraint : SA.PROJECTDEPENYB_FK1
2006-03-28 02:08:23,489 [main] INFO  RDBMS                          - Validated 1 unique key(s) for table PROFILE
2006-03-28 02:08:23,509 [main] INFO  RDBMS                          - Creating foreign key constraint : SA.PROFILE_FK2
2006-03-28 02:08:23,571 [main] INFO  RDBMS                          - Creating foreign key constraint : SA.PROFILE_FK1
2006-03-28 02:08:23,757 [main] INFO  RDBMS                          - Validated 1 unique key(s) for table PROJECT_NOTIFIERS
2006-03-28 02:08:23,778 [main] INFO  RDBMS                          - Creating foreign key constraint : SA.PROJECT_NOTIRN_FK1
2006-03-28 02:08:23,852 [main] INFO  RDBMS                          - Creating foreign key constraint : SA.PROJECT_NOTIRN_FK2
2006-03-28 02:08:24,023 [main] INFO  RDBMS                          - Validated 1 unique key(s) for table PROJECTGROUP_NOTIFIERS
2006-03-28 02:08:24,045 [main] INFO  RDBMS                          - Creating foreign key constraint : SA.PROJECTGROUP7P_FK1
2006-03-28 02:08:24,110 [main] INFO  RDBMS                          - Creating foreign key constraint : SA.PROJECTGROUP7P_FK2
2006-03-28 02:08:24,292 [main] INFO  RDBMS                          - Validated 1 unique key(s) for table PROJECTNOTIFIER_CONFIGURATION
2006-03-28 02:08:24,316 [main] INFO  RDBMS                          - Creating foreign key constraint : SA.PROJECTNOTIF24_FK1
2006-03-28 02:08:24,578 [main] INFO  RDBMS                          - Validated 1 unique key(s) for table PROJECTGROUP_BUILDDEFINITIONS
2006-03-28 02:08:24,601 [main] INFO  RDBMS                          - Creating foreign key constraint : SA.PROJECTGROUPSP_FK2
2006-03-28 02:08:24,691 [main] INFO  RDBMS                          - Creating foreign key constraint : SA.PROJECTGROUPSP_FK1
2006-03-28 02:08:24,843 [main] INFO  RDBMS                          - Validated 1 unique key(s) for table PROJECT_BUILDDEFINITIONS
2006-03-28 02:08:24,856 [main] INFO  RDBMS                          - Creating foreign key constraint : SA.PROJECT_BUILP8_FK2
2006-03-28 02:08:24,939 [main] INFO  RDBMS                          - Creating foreign key constraint : SA.PROJECT_BUILP8_FK1
2006-03-28 02:08:25,153 [main] INFO  Continuum                      - Starting Continuum.
2006-03-28 02:08:25,154 [main] INFO  Continuum                      - 
2006-03-28 02:08:25,154 [main] INFO  Continuum                      - 
2006-03-28 02:08:25,155 [main] INFO  Continuum                      - < Continuum 1.0.3-SNAPSHOT started! >
2006-03-28 02:08:25,155 [main] INFO  Continuum                      - -------------------------------------
2006-03-28 02:08:25,155 [main] INFO  Continuum                      -        \   ^__^
2006-03-28 02:08:25,155 [main] INFO  Continuum                      -         \  (oo)\_______
2006-03-28 02:08:25,155 [main] INFO  Continuum                      -            (__)\       )\/\
2006-03-28 02:08:25,155 [main] INFO  Continuum                      -                ||----w |
2006-03-28 02:08:25,155 [main] INFO  Continuum                      -                ||     ||
2006-03-28 02:08:25,155 [main] INFO  Continuum                      - 
2006-03-28 02:08:25,156 [main] INFO  Continuum                      - 
2006-03-28 02:08:25,156 [main] INFO  ContinuumInitializer           - Continuum initializer running ...
2006-03-28 02:08:25,158 [main] INFO  SCHEMA                         - Managing Persistence of Class : org.apache.maven.continuum.model.system.SystemConfiguration [Table : SYSTEMCONFIGURATION, InheritanceStrategy : new-table]
2006-03-28 02:08:25,209 [main] INFO  SCHEMA                         - No column info found for table "SYSTEMCONFIGURATION" - the table apparently doesnt yet exist in the datastore
2006-03-28 02:08:25,213 [main] INFO  RDBMS                          - Creating table SYSTEMCONFIGURATION
2006-03-28 02:08:25,492 [main] INFO  RDBMS                          - Validated 1 unique key(s) for table SYSTEMCONFIGURATION
2006-03-28 02:08:25,647 [main] INFO  RDBMS                          - Error encountered allocating block of IDs : Couldnt obtain a new sequence (unique id) : Table 'SEQUENCE_TABLE' does not exist.
2006-03-28 02:08:25,649 [main] INFO  RDBMS                          - Creating Repository for IDs in the datastore
2006-03-28 02:08:25,649 [main] INFO  RDBMS                          - Creating table SEQUENCE_TABLE
2006-03-28 02:08:25,799 [main] INFO  SCHEMA                         - Managing Persistence of Class : org.apache.maven.continuum.model.system.Permission [Table : PERMISSION, InheritanceStrategy : new-table]
2006-03-28 02:08:25,837 [main] INFO  SCHEMA                         - No column info found for table "PERMISSION" - the table apparently doesnt yet exist in the datastore
2006-03-28 02:08:25,838 [main] INFO  RDBMS                          - Creating table PERMISSION
2006-03-28 02:08:26,076 [main] INFO  RDBMS                          - Validated 1 unique key(s) for table PERMISSION
2006-03-28 02:08:26,309 [main] INFO  SCHEMA                         - Managing Persistence of Class : org.apache.maven.continuum.model.system.UserGroup [Table : USERGROUP, InheritanceStrategy : new-table]
2006-03-28 02:08:26,315 [main] INFO  SCHEMA                         - Managing Persistence of Field : org.apache.maven.continuum.model.system.UserGroup.permissions [Table : USERGROUP_PERMISSIONS]
2006-03-28 02:08:26,353 [main] INFO  SCHEMA                         - No column info found for table "USERGROUP" - the table apparently doesnt yet exist in the datastore
2006-03-28 02:08:26,354 [main] INFO  RDBMS                          - Creating table USERGROUP
2006-03-28 02:08:26,654 [main] INFO  SCHEMA                         - No column info found for table "USERGROUP_PERMISSIONS" - the table apparently doesnt yet exist in the datastore
2006-03-28 02:08:26,690 [main] INFO  RDBMS                          - Creating table USERGROUP_PERMISSIONS
2006-03-28 02:08:26,978 [main] INFO  RDBMS                          - Validated 1 unique key(s) for table USERGROUP
2006-03-28 02:08:27,100 [main] INFO  RDBMS                          - Validated 1 unique key(s) for table USERGROUP_PERMISSIONS
2006-03-28 02:08:27,113 [main] INFO  RDBMS                          - Creating foreign key constraint : SA.USERGROUP_PEKH_FK1
2006-03-28 02:08:27,193 [main] INFO  RDBMS                          - Creating foreign key constraint : SA.USERGROUP_PEKH_FK2
2006-03-28 02:08:27,487 [main] INFO  SCHEMA                         - Managing Persistence of Class : org.apache.maven.continuum.model.system.NotificationAddress [Table : NOTIFICATIONADDRESS, InheritanceStrategy : new-table]
2006-03-28 02:08:27,490 [main] INFO  SCHEMA                         - Managing Persistence of Class : org.apache.maven.continuum.model.system.ContinuumUser [Table : CONTINUUMUSER, InheritanceStrategy : new-table]
2006-03-28 02:08:27,493 [main] INFO  SCHEMA                         - Managing Persistence of Field : org.apache.maven.continuum.model.system.NotificationAddress.configuration [Table : NOTIFICATIONADDRESS_CONFIGURATION]
2006-03-28 02:08:27,498 [main] INFO  SCHEMA                         - Managing Persistence of Field : org.apache.maven.continuum.model.system.ContinuumUser.notificationAddresses [Table : CONTINUUMUSER_NOTIFICATIONADDRESSES]
2006-03-28 02:08:27,527 [main] INFO  SCHEMA                         - No column info found for table "NOTIFICATIONADDRESS" - the table apparently doesnt yet exist in the datastore
2006-03-28 02:08:27,528 [main] INFO  RDBMS                          - Creating table NOTIFICATIONADDRESS
2006-03-28 02:08:27,772 [main] INFO  SCHEMA                         - No column info found for table "CONTINUUMUSER" - the table apparently doesnt yet exist in the datastore
2006-03-28 02:08:27,804 [main] INFO  RDBMS                          - Creating table CONTINUUMUSER
2006-03-28 02:08:28,051 [main] INFO  SCHEMA                         - No column info found for table "CONTINUUMUSER_NOTIFICATIONADDRESSES" - the table apparently doesnt yet exist in the datastore
2006-03-28 02:08:28,097 [main] INFO  RDBMS                          - Creating table CONTINUUMUSER_NOTIFICATIONADDRESSES
2006-03-28 02:08:28,362 [main] INFO  SCHEMA                         - No column info found for table "NOTIFICATIONADDRESS_CONFIGURATION" - the table apparently doesnt yet exist in the datastore
2006-03-28 02:08:28,398 [main] INFO  RDBMS                          - Creating table NOTIFICATIONADDRESS_CONFIGURATION
2006-03-28 02:08:28,626 [main] INFO  RDBMS                          - Validated 1 unique key(s) for table NOTIFICATIONADDRESS
2006-03-28 02:08:28,732 [main] INFO  RDBMS                          - Validated 1 unique key(s) for table CONTINUUMUSER
2006-03-28 02:08:28,746 [main] INFO  RDBMS                          - Creating foreign key constraint : SA.CONTINUUMUSER_FK1
2006-03-28 02:08:28,894 [main] INFO  RDBMS                          - Validated 1 unique key(s) for table CONTINUUMUSER_NOTIFICATIONADDRESSES
2006-03-28 02:08:28,907 [main] INFO  RDBMS                          - Creating foreign key constraint : SA.CONTINUUMUSEI2_FK1
2006-03-28 02:08:28,973 [main] INFO  RDBMS                          - Creating foreign key constraint : SA.CONTINUUMUSEI2_FK2
2006-03-28 02:08:29,166 [main] INFO  RDBMS                          - Validated 1 unique key(s) for table NOTIFICATIONADDRESS_CONFIGURATION
2006-03-28 02:08:29,179 [main] INFO  RDBMS                          - Creating foreign key constraint : SA.NOTIFICATIONI3_FK1
2006-03-28 02:08:29,422 [main] INFO  SchedulesActivator             - Activating schedules ...
2006-03-28 02:08:29,459 [main] INFO  SchedulesActivator             - Tue Mar 28 03:00:00 PST 2006
2006-03-28 02:08:29,460 [main] INFO  PlexusContainer                - Loading on start [role,roleHint]: [org.codehaus.plexus.taskqueue.execution.TaskQueueExecutor,build-project]
2006-03-28 02:08:29,720 [main] ERROR VelocityComponent              - ResourceManager : unable to find resource 'CommonMacros.vm' in any resource loader.
2006-03-28 02:08:29,831 [main] INFO  Notifier:mail                  - The from mailbox is not configured, will use the nag email address from the project.
2006-03-28 02:08:29,832 [main] INFO  Notifier:mail                  - From name: Continuum@cheddar.simulalabs.com
2006-03-28 02:08:29,832 [main] INFO  Notifier:mail                  - Build host name: cheddar.simulalabs.com
2006-03-28 02:08:29,855 [main] INFO  RecipientSource                - To override address is not configured, will use the nag email address from the project.
2006-03-28 02:08:29,855 [main] INFO  TaskQueueExecutor:build-project - Starting task executor, thread name 'build-project'.
2006-03-28 02:08:29,856 [main] INFO  PlexusContainer                - Loading on start [role,roleHint]: [org.codehaus.plexus.taskqueue.execution.TaskQueueExecutor,check-out-project]
2006-03-28 02:08:29,858 [main] INFO  TaskQueueExecutor:check-out-project - Starting task executor, thread name 'check-out-project'.
-------------------------------------------------------------------------------
[2006.03.28 02:08:29] Integration test settings
-------------------------------------------------------------------------------
[2006.03.28 02:08:29] IT root: /home/continuum/continuum-maven/working-directory/149/target/it
[2006.03.28 02:08:29] Remoting method: jvm
[2006.03.28 02:08:29] Store implementation: class org.apache.maven.continuum.store.JdoContinuumStore
-------------------------------------------------------------------------------
[2006.03.28 02:08:29] Connecting to and starting Continuum
[2006.03.28 02:08:29] Removing all existing projects from Continuum.
[2006.03.28 02:08:30] Initializing Shell CVS project
[2006.03.28 02:08:30] Adding CVS Shell project
2006-03-28 02:08:30,612 [Thread-2] INFO  ContinuumScm                   - Checking out project: 'Shell Project', id: '1' to '/home/continuum/continuum-maven/working-directory/149/target/working-directory/1'.
2006-03-28 02:08:30,631 [Thread-2] INFO  ScmManager                     - Executing: cvs -z3 -f -d /home/continuum/continuum-maven/working-directory/149/target/it/cvs-root -q checkout -d 1 shell
2006-03-28 02:08:30,631 [Thread-2] INFO  ScmManager                     - Working directory: /home/continuum/continuum-maven/working-directory/149/target/working-directory
2006-03-28 02:08:30,663 [Thread-9] DEBUG ScmManager                     - U 1/script.sh
2006-03-28 02:08:31,003 [Thread-2] INFO  ContinuumScm                   - Checked out 1 files.
[2006.03.28 02:08:31] Building Shell project
2006-03-28 02:08:31,688 [main] INFO  Continuum                      - Enqueuing 'Shell Project' (Build definition id=1).
2006-03-28 02:08:31,755 [Thread-1] WARN  SQL                            - Object with id "0" not found !
2006-03-28 02:08:31,825 [Thread-1] INFO  ContinuumScm                   - Updating project: id: '1', name 'Shell Project'.
2006-03-28 02:08:31,836 [Thread-1] INFO  ScmManager                     - Executing: cvs -z3 -f -d /home/continuum/continuum-maven/working-directory/149/target/it/cvs-root -q update -d
2006-03-28 02:08:31,836 [Thread-1] INFO  ScmManager                     - Working directory: /home/continuum/continuum-maven/working-directory/149/target/working-directory/1
2006-03-28 02:08:31,910 [Thread-1] INFO  Action:update-project-from-working-directory - Updating project 'Shell Project' from checkout.
2006-03-28 02:08:32,012 [Thread-1] WARN  ContinuumBuildExecutor:shell   - Executable '/home/continuum/continuum-maven/working-directory/149/target/working-directory/1/script.sh'.
2006-03-28 02:08:32,012 [Thread-1] INFO  ContinuumBuildExecutor:shell   - Arguments: 
2006-03-28 02:08:32,013 [Thread-1] INFO  ContinuumBuildExecutor:shell   - Working directory: /home/continuum/continuum-maven/working-directory/149/target/working-directory/1
2006-03-28 02:08:32,079 [Thread-1] INFO  ContinuumBuildExecutor:shell   - Exit code: 0
[2006.03.28 02:08:32] Building Shell project with alternative configuration
2006-03-28 02:08:34,133 [main] INFO  Continuum                      - Enqueuing 'Shell Project' (Build definition id=1).
2006-03-28 02:08:34,268 [Thread-1] INFO  ContinuumScm                   - Updating project: id: '1', name 'Shell Project'.
2006-03-28 02:08:34,279 [Thread-1] INFO  ScmManager                     - Executing: cvs -z3 -f -d /home/continuum/continuum-maven/working-directory/149/target/it/cvs-root -q update -d
2006-03-28 02:08:34,279 [Thread-1] INFO  ScmManager                     - Working directory: /home/continuum/continuum-maven/working-directory/149/target/working-directory/1
2006-03-28 02:08:34,318 [Thread-21] DEBUG ScmManager                     - U script.sh
2006-03-28 02:08:35,003 [Thread-1] INFO  ScmManager                     - Executing: cvs -z3 -f -d /home/continuum/continuum-maven/working-directory/149/target/it/cvs-root -q log -d ">2006-03-28 02:08:31 PST"
2006-03-28 02:08:35,003 [Thread-1] INFO  ScmManager                     - Working directory: /home/continuum/continuum-maven/working-directory/149/target/working-directory/1
2006-03-28 02:08:35,053 [Thread-1] INFO  ContinuumScm                   - Updated 1 files.
2006-03-28 02:08:35,090 [Thread-1] INFO  Action:update-project-from-working-directory - Updating project 'Shell Project' from checkout.
2006-03-28 02:08:35,192 [Thread-1] WARN  ContinuumBuildExecutor:shell   - Executable '/home/continuum/continuum-maven/working-directory/149/target/working-directory/1/script.sh'.
2006-03-28 02:08:35,193 [Thread-1] INFO  ContinuumBuildExecutor:shell   - Arguments: a b
2006-03-28 02:08:35,193 [Thread-1] INFO  ContinuumBuildExecutor:shell   - Working directory: /home/continuum/continuum-maven/working-directory/149/target/working-directory/1
2006-03-28 02:08:35,269 [Thread-1] INFO  ContinuumBuildExecutor:shell   - Exit code: 0
2006-03-28 02:08:36,234 [main] INFO  Continuum                      - Remove project Shell Project(1)
2006-03-28 02:08:36,520 [main] WARN  SQL                            - Object with id "1" not found !
[2006.03.28 02:08:36] Tearing down test - ignore any interrupted exceptions
2006-03-28 02:08:36,523 [main] INFO  TaskQueueExecutor:check-out-project - Executor thread got shutdown signal.
2006-03-28 02:08:36,524 [Thread-2] INFO  TaskQueueExecutor:check-out-project - Executor thread 'check-out-project' exited.
There was no such logger 'org.apache.maven.plugin.MavenPluginCollector' 16293853.
There was no such logger 'org.apache.maven.continuum.execution.ContinuumBuildExecutor:shell' 16293853.
There was no such logger 'org.codehaus.plexus.taskqueue.TaskQueue:check-out-project' 16293853.
There was no such logger 'org.apache.maven.continuum.buildcontroller.BuildController' 16293853.
There was no such logger 'org.apache.maven.continuum.scm.ContinuumScm' 16293853.
2006-03-28 02:08:36,530 [main] INFO  TaskQueueExecutor:build-project - Executor thread got shutdown signal.
2006-03-28 02:08:36,530 [Thread-1] INFO  TaskQueueExecutor:build-project - Executor thread 'build-project' exited.
There was no such logger 'org.apache.maven.continuum.utils.WorkingDirectoryService' 16293853.
There was no such logger 'org.apache.maven.artifact.resolver.ArtifactResolver' 16293853.
There was no such logger 'org.apache.maven.continuum.execution.manager.BuildExecutorManager' 16293853.
There was no such logger 'org.codehaus.plexus.notification.RecipientSource' 16293853.
There was no such logger 'org.apache.maven.continuum.initialization.ContinuumInitializer' 16293853.
There was no such logger 'org.apache.maven.continuum.build.settings.SchedulesActivator' 16293853.
There was no such logger 'org.apache.maven.continuum.execution.ContinuumBuildExecutor:maven-1' 16293853.
There was no such logger 'org.codehaus.plexus.jdo.JdoFactory' 16293853.
There was no such logger 'org.codehaus.plexus.notification.notifier.Notifier:jabber' 16293853.
There was no such logger 'org.apache.maven.continuum.execution.maven.m1.MavenOneMetadataHelper' 16293853.
There was no such logger 'org.codehaus.plexus.action.Action:store-project' 16293853.
There was no such logger 'org.codehaus.plexus.taskqueue.TaskViabilityEvaluator:build-project' 16293853.
There was no such logger 'org.codehaus.plexus.notification.notifier.Notifier:mail' 16293853.
There was no such logger 'org.apache.maven.artifact.deployer.ArtifactDeployer' 16293853.
There was no such logger 'org.apache.maven.artifact.transform.ArtifactTransformation:snapshot' 16293853.
There was no such logger 'org.codehaus.plexus.msn.MsnClient' 16293853.
There was no such logger 'org.codehaus.plexus.action.Action:validate-project' 16293853.
There was no such logger 'org.codehaus.plexus.notification.notifier.Notifier:msn' 16293853.
There was no such logger 'org.apache.maven.artifact.manager.WagonManager' 16293853.
There was no such logger 'org.codehaus.plexus.taskqueue.execution.TaskQueueExecutor:build-project' 16293853.
There was no such logger 'org.codehaus.plexus.action.Action:check-working-directory' 16293853.
There was no such logger 'org.apache.maven.profiles.MavenProfilesBuilder' 16293853.
There was no such logger 'org.apache.maven.continuum.store.ContinuumStore:jdo' 16293853.
There was no such logger 'org.codehaus.plexus.commandline.ExecutableResolver' 16293853.
2006-03-28 02:08:36,535 [main] INFO  Continuum                      - Stopping Continuum.
2006-03-28 02:08:36,535 [main] INFO  Continuum                      - Continuum stopped.
There was no such logger 'org.apache.maven.continuum.Continuum' 16293853.
There was no such logger 'org.codehaus.plexus.taskqueue.execution.TaskExecutor:check-out-project' 16293853.
There was no such logger 'org.codehaus.plexus.action.Action:update-working-directory-from-scm' 16293853.
There was no such logger 'org.codehaus.plexus.ircbot.IrcBot' 16293853.
There was no such logger 'org.apache.maven.continuum.configuration.ConfigurationService' 16293853.
There was no such logger 'org.apache.maven.continuum.execution.maven.m2.MavenBuilderHelper' 16293853.
There was no such logger 'org.codehaus.plexus.notification.notifier.Notifier:irc' 16293853.
There was no such logger 'org.codehaus.plexus.notification.notifier.manager.NotifierManager' 16293853.
There was no such logger 'org.codehaus.plexus.velocity.VelocityComponent' 16293853.
There was no such logger 'org.codehaus.plexus.action.Action:add-project-to-checkout-queue' 16293853.
There was no such logger 'org.codehaus.plexus.action.Action:checkout-project' 16293853.
There was no such logger 'org.apache.maven.settings.MavenSettingsBuilder' 16293853.
There was no such logger 'org.codehaus.plexus.action.ActionManager' 16293853.
There was no such logger 'org.codehaus.plexus.mailsender.MailSender' 16293853.
There was no such logger 'org.apache.maven.continuum.execution.ContinuumBuildExecutor:maven2' 16293853.
There was no such logger 'org.apache.maven.project.interpolation.ModelInterpolator' 16293853.
There was no such logger 'org.codehaus.plexus.notification.notifier.Notifier:console' 16293853.
There was no such logger 'org.apache.maven.continuum.utils.shell.ShellCommandHelper' 16293853.
There was no such logger 'org.codehaus.plexus.taskqueue.execution.TaskExecutor:build-project' 16293853.
There was no such logger 'org.codehaus.plexus.action.Action:store-checkout-scm-result' 16293853.
There was no such logger 'org.codehaus.plexus.action.Action:execute-builder' 16293853.
There was no such logger 'org.apache.maven.artifact.repository.metadata.RepositoryMetadataManager' 16293853.
There was no such logger 'org.apache.maven.artifact.transform.ArtifactTransformation:release' 16293853.
There was no such logger 'org.codehaus.plexus.jabber.JabberClient' 16293853.
Mar 28, 2006 2:08:36 AM org.quartz.core.QuartzScheduler shutdown
INFO: Scheduler defaultScheduler_$_NON_CLUSTERED shutting down.
Mar 28, 2006 2:08:36 AM org.quartz.core.QuartzScheduler pause
INFO: Scheduler defaultScheduler_$_NON_CLUSTERED paused.
Mar 28, 2006 2:08:36 AM org.quartz.core.QuartzScheduler shutdown
INFO: Scheduler defaultScheduler_$_NON_CLUSTERED shutdown complete.
There was no such logger 'org.codehaus.plexus.scheduler.Scheduler' 16293853.
There was no such logger 'org.apache.maven.continuum.notification.ContinuumNotificationDispatcher' 16293853.
There was no such logger 'org.apache.maven.project.MavenProjectBuilder' 16293853.
There was no such logger 'org.codehaus.plexus.action.Action:deploy-artifact' 16293853.
There was no such logger 'org.apache.maven.scm.manager.ScmManager' 16293853.
There was no such logger 'org.codehaus.plexus.action.Action:update-project-from-working-directory' 16293853.
There was no such logger 'org.apache.maven.artifact.transform.ArtifactTransformation:latest' 16293853.
[2006.03.28 02:08:36] Used 147832ms
[surefire] Tests run: 1, Failures: 0, Errors: 0, Time elapsed: 147.872 sec
[surefire] Running org.apache.maven.continuum.it.MavenTwoIntegrationTest
2006-03-28 02:08:36,901 [main] DEBUG PlexusContainer                - Found 3 components to load on start
2006-03-28 02:08:36,901 [main] INFO  PlexusContainer                - Loading on start [role]: [org.apache.maven.continuum.Continuum]
2006-03-28 02:08:36,902 [main] INFO  JdoFactory                     - Initializing JDO.
2006-03-28 02:08:36,903 [main] INFO  JDO                            - PersistenceManagerFactory - Vendor: JPOX  Version: 1.1.0-rc-1
2006-03-28 02:08:36,903 [main] INFO  JDO                            - PersistenceManagerFactory initialised for datastore URL=jdbc:derby:/home/continuum/continuum-maven/working-directory/149/target/level1/level2/plexus-home/database;create=true driver=org.apache.derby.jdbc.EmbeddedDriver userName=sa
Mar 28, 2006 2:08:36 AM org.quartz.simpl.RAMJobStore initialize
INFO: RAMJobStore initialized.
Mar 28, 2006 2:08:36 AM org.quartz.impl.StdSchedulerFactory instantiate
INFO: Quartz scheduler 'defaultScheduler' initialized from an externally provided properties instance.
Mar 28, 2006 2:08:36 AM org.quartz.impl.StdSchedulerFactory instantiate
INFO: Quartz scheduler version: 1.4.5
Mar 28, 2006 2:08:36 AM org.quartz.core.QuartzScheduler start
INFO: Scheduler defaultScheduler_$_NON_CLUSTERED started.
2006-03-28 02:08:36,920 [main] WARN  ContinuumBuildExecutor:ant     - Could not find the executable 'ant' in the path '[]'.
2006-03-28 02:08:36,921 [main] WARN  ContinuumBuildExecutor:maven-1 - Could not find the executable 'maven' in the path '[]'.
2006-03-28 02:08:36,971 [main] DEBUG MavenSettingsBuilder           - Building Maven global-level settings from: '/usr/local/maven-2.0.3-SNAPSHOT/conf/settings.xml'
2006-03-28 02:08:36,972 [main] DEBUG MavenSettingsBuilder           - Building Maven user-level settings from: '/home/continuum/.m2/settings.xml'
2006-03-28 02:08:37,051 [main] WARN  ContinuumBuildExecutor:maven2  - Could not find the executable 'mvn' in the path '[]'.
2006-03-28 02:08:37,053 [main] INFO  BuildExecutorManager           - Build executors:
2006-03-28 02:08:37,053 [main] INFO  BuildExecutorManager           -   maven-1
2006-03-28 02:08:37,053 [main] INFO  BuildExecutorManager           -   ant
2006-03-28 02:08:37,053 [main] INFO  BuildExecutorManager           -   maven2
2006-03-28 02:08:37,053 [main] INFO  BuildExecutorManager           -   shell
2006-03-28 02:08:37,054 [main] INFO  Continuum                      - Initializing Continuum.
2006-03-28 02:08:37,054 [main] INFO  Continuum                      - Showing all projects: 
2006-03-28 02:08:37,104 [main] INFO  RDBMS                          - RDBMS Adapter initialised : CloudscapeAdapter : Apache Derby version=10.1.2.1, major=10, minor=1, revision=2
Identifier Names : UPPERCASE 
Driver name=Apache Derby Embedded JDBC Driver, version=10.1.2.1, major=10, minor=1
Identifier Max Lengths : Table=128  Column=128  Constraint=18  Index=18  Delimeters="
Identifier Support in DDL : catalog=false  schema=true
2006-03-28 02:08:37,105 [main] INFO  SCHEMA                         - Initialising Catalog "", Schema "SA" using "SchemaTable" auto-start option
2006-03-28 02:08:37,341 [main] INFO  JDO                            - Managing Persistence of org.apache.maven.continuum.model.scm.ChangeSet since it was managed previously
2006-03-28 02:08:37,341 [main] INFO  JDO                            - Managing Persistence of org.apache.maven.continuum.model.project.ProjectDeveloper since it was managed previously
2006-03-28 02:08:37,341 [main] INFO  JDO                            - Managing Persistence of org.apache.maven.continuum.model.system.UserGroup since it was managed previously
2006-03-28 02:08:37,341 [main] INFO  JDO                            - Managing Persistence of org.apache.maven.continuum.model.system.SystemConfiguration since it was managed previously
2006-03-28 02:08:37,342 [main] INFO  JDO                            - Managing Persistence of org.apache.maven.continuum.model.project.ProjectNotifier since it was managed previously
2006-03-28 02:08:37,342 [main] INFO  JDO                            - Managing Persistence of org.apache.maven.continuum.model.system.Permission since it was managed previously
2006-03-28 02:08:37,342 [main] INFO  JDO                            - Managing Persistence of org.apache.maven.continuum.model.project.BuildResult since it was managed previously
2006-03-28 02:08:37,342 [main] INFO  JDO                            - Managing Persistence of org.apache.maven.continuum.model.scm.ScmResult since it was managed previously
2006-03-28 02:08:37,342 [main] INFO  JDO                            - Managing Persistence of org.apache.maven.continuum.model.project.Schedule since it was managed previously
2006-03-28 02:08:37,342 [main] INFO  JDO                            - Managing Persistence of org.apache.maven.continuum.model.project.Project since it was managed previously
2006-03-28 02:08:37,342 [main] INFO  JDO                            - Managing Persistence of org.apache.maven.continuum.model.system.Installation since it was managed previously
2006-03-28 02:08:37,342 [main] INFO  JDO                            - Managing Persistence of org.apache.maven.continuum.model.system.NotificationAddress since it was managed previously
2006-03-28 02:08:37,342 [main] INFO  JDO                            - Managing Persistence of org.apache.maven.continuum.model.project.BuildDefinition since it was managed previously
2006-03-28 02:08:37,343 [main] INFO  JDO                            - Managing Persistence of org.apache.maven.continuum.model.project.Profile since it was managed previously
2006-03-28 02:08:37,343 [main] INFO  JDO                            - Managing Persistence of org.apache.maven.continuum.model.project.ProjectDependency since it was managed previously
2006-03-28 02:08:37,343 [main] INFO  JDO                            - Managing Persistence of org.apache.maven.continuum.model.project.ProjectGroup since it was managed previously
2006-03-28 02:08:37,343 [main] INFO  JDO                            - Managing Persistence of org.apache.maven.continuum.model.scm.ChangeFile since it was managed previously
2006-03-28 02:08:37,343 [main] INFO  JDO                            - Managing Persistence of org.apache.maven.continuum.model.system.ContinuumUser since it was managed previously
2006-03-28 02:08:37,345 [main] INFO  MetaData                       - Parsing MetaData from file "file:/home/continuum/.m2/repository/org/apache/maven/continuum/continuum-model/1.0.3-SNAPSHOT/continuum-model-1.0.3-SNAPSHOT.jar!/META-INF/package.jdo"
2006-03-28 02:08:37,755 [main] INFO  SCHEMA                         - Managing Persistence of Class : org.apache.maven.continuum.model.scm.ChangeFile [Table : CHANGEFILE, InheritanceStrategy : new-table]
2006-03-28 02:08:37,755 [main] INFO  SCHEMA                         - Managing Persistence of Class : org.apache.maven.continuum.model.scm.ChangeSet [Table : CHANGESET, InheritanceStrategy : new-table]
2006-03-28 02:08:37,756 [main] INFO  SCHEMA                         - Managing Persistence of Class : org.apache.maven.continuum.model.project.ProjectDeveloper [Table : PROJECTDEVELOPER, InheritanceStrategy : new-table]
2006-03-28 02:08:37,756 [main] INFO  SCHEMA                         - Managing Persistence of Class : org.apache.maven.continuum.model.system.Permission [Table : PERMISSION, InheritanceStrategy : new-table]
2006-03-28 02:08:37,756 [main] INFO  SCHEMA                         - Managing Persistence of Class : org.apache.maven.continuum.model.system.UserGroup [Table : USERGROUP, InheritanceStrategy : new-table]
2006-03-28 02:08:37,756 [main] INFO  SCHEMA                         - Managing Persistence of Class : org.apache.maven.continuum.model.system.SystemConfiguration [Table : SYSTEMCONFIGURATION, InheritanceStrategy : new-table]
2006-03-28 02:08:37,757 [main] INFO  SCHEMA                         - Managing Persistence of Class : org.apache.maven.continuum.model.project.ProjectNotifier [Table : PROJECTNOTIFIER, InheritanceStrategy : new-table]
2006-03-28 02:08:37,757 [main] INFO  SCHEMA                         - Managing Persistence of Class : org.apache.maven.continuum.model.system.Installation [Table : INSTALLATION, InheritanceStrategy : new-table]
2006-03-28 02:08:37,757 [main] INFO  SCHEMA                         - Managing Persistence of Class : org.apache.maven.continuum.model.project.Profile [Table : PROFILE, InheritanceStrategy : new-table]
2006-03-28 02:08:37,757 [main] INFO  SCHEMA                         - Managing Persistence of Class : org.apache.maven.continuum.model.project.Schedule [Table : SCHEDULE, InheritanceStrategy : new-table]
2006-03-28 02:08:37,758 [main] INFO  SCHEMA                         - Managing Persistence of Class : org.apache.maven.continuum.model.project.BuildDefinition [Table : BUILDDEFINITION, InheritanceStrategy : new-table]
2006-03-28 02:08:37,758 [main] INFO  SCHEMA                         - Managing Persistence of Class : org.apache.maven.continuum.model.scm.ScmResult [Table : SCMRESULT, InheritanceStrategy : new-table]
2006-03-28 02:08:37,758 [main] INFO  SCHEMA                         - Managing Persistence of Class : org.apache.maven.continuum.model.project.ProjectDependency [Table : PROJECTDEPENDENCY, InheritanceStrategy : new-table]
2006-03-28 02:08:37,758 [main] INFO  SCHEMA                         - Managing Persistence of Class : org.apache.maven.continuum.model.project.ProjectGroup [Table : PROJECTGROUP, InheritanceStrategy : new-table]
2006-03-28 02:08:37,759 [main] INFO  SCHEMA                         - Managing Persistence of Class : org.apache.maven.continuum.model.project.Project [Table : PROJECT, InheritanceStrategy : new-table]
2006-03-28 02:08:37,759 [main] INFO  SCHEMA                         - Managing Persistence of Class : org.apache.maven.continuum.model.project.BuildResult [Table : BUILDRESULT, InheritanceStrategy : new-table]
2006-03-28 02:08:37,759 [main] INFO  SCHEMA                         - Managing Persistence of Class : org.apache.maven.continuum.model.system.NotificationAddress [Table : NOTIFICATIONADDRESS, InheritanceStrategy : new-table]
2006-03-28 02:08:37,759 [main] INFO  SCHEMA                         - Managing Persistence of Class : org.apache.maven.continuum.model.system.ContinuumUser [Table : CONTINUUMUSER, InheritanceStrategy : new-table]
2006-03-28 02:08:37,760 [main] INFO  SCHEMA                         - Managing Persistence of Field : org.apache.maven.continuum.model.project.ProjectNotifier.configuration [Table : PROJECTNOTIFIER_CONFIGURATION]
2006-03-28 02:08:37,763 [main] INFO  SCHEMA                         - Managing Persistence of Field : org.apache.maven.continuum.model.system.UserGroup.permissions [Table : USERGROUP_PERMISSIONS]
2006-03-28 02:08:37,764 [main] INFO  SCHEMA                         - Managing Persistence of Field : org.apache.maven.continuum.model.project.ProjectGroup.buildDefinitions [Table : PROJECTGROUP_BUILDDEFINITIONS]
2006-03-28 02:08:37,765 [main] INFO  SCHEMA                         - Managing Persistence of Field : org.apache.maven.continuum.model.project.ProjectGroup.notifiers [Table : PROJECTGROUP_NOTIFIERS]
2006-03-28 02:08:37,766 [main] INFO  SCHEMA                         - Managing Persistence of Field : org.apache.maven.continuum.model.system.NotificationAddress.configuration [Table : NOTIFICATIONADDRESS_CONFIGURATION]
2006-03-28 02:08:37,771 [main] INFO  SCHEMA                         - Managing Persistence of Field : org.apache.maven.continuum.model.project.Project.buildDefinitions [Table : PROJECT_BUILDDEFINITIONS]
2006-03-28 02:08:37,772 [main] INFO  SCHEMA                         - Managing Persistence of Field : org.apache.maven.continuum.model.project.Project.notifiers [Table : PROJECT_NOTIFIERS]
2006-03-28 02:08:37,776 [main] INFO  SCHEMA                         - Managing Persistence of Field : org.apache.maven.continuum.model.system.ContinuumUser.notificationAddresses [Table : CONTINUUMUSER_NOTIFICATIONADDRESSES]
2006-03-28 02:08:37,849 [main] WARN  RDBMS                          - Column BUILDDEFINITION.LATEST_BUILD_ID should not allow nulls but does. You can prevent nulls by specifying "allows-null" as "false" for the <field> in the MetaData
2006-03-28 02:08:38,034 [main] INFO  RDBMS                          - Validated 1 unique key(s) for table CHANGEFILE
2006-03-28 02:08:38,061 [main] INFO  RDBMS                          - Validated 1 foreign key(s) for table CHANGEFILE
2006-03-28 02:08:38,074 [main] INFO  RDBMS                          - Validated 1 unique key(s) for table PROJECTNOTIFIER
2006-03-28 02:08:38,087 [main] INFO  RDBMS                          - Validated 1 unique key(s) for table BUILDDEFINITION
2006-03-28 02:08:38,097 [main] INFO  RDBMS                          - Validated 2 foreign key(s) for table BUILDDEFINITION
2006-03-28 02:08:38,109 [main] INFO  RDBMS                          - Validated 1 unique key(s) for table USERGROUP
2006-03-28 02:08:38,122 [main] INFO  RDBMS                          - Validated 1 unique key(s) for table CHANGESET
2006-03-28 02:08:38,128 [main] INFO  RDBMS                          - Validated 1 foreign key(s) for table CHANGESET
2006-03-28 02:08:38,139 [main] INFO  RDBMS                          - Validated 1 unique key(s) for table PROJECTGROUP
2006-03-28 02:08:38,151 [main] INFO  RDBMS                          - Validated 1 unique key(s) for table NOTIFICATIONADDRESS
2006-03-28 02:08:38,164 [main] INFO  RDBMS                          - Validated 1 unique key(s) for table BUILDRESULT
2006-03-28 02:08:38,172 [main] INFO  RDBMS                          - Validated 2 foreign key(s) for table BUILDRESULT
2006-03-28 02:08:38,188 [main] INFO  RDBMS                          - Validated 1 unique key(s) for table SCMRESULT
2006-03-28 02:08:38,198 [main] INFO  RDBMS                          - Validated 1 unique key(s) for table SYSTEMCONFIGURATION
2006-03-28 02:08:38,211 [main] INFO  RDBMS                          - Validated 1 unique key(s) for table PROJECTDEVELOPER
2006-03-28 02:08:38,218 [main] INFO  RDBMS                          - Validated 1 foreign key(s) for table PROJECTDEVELOPER
2006-03-28 02:08:38,225 [main] INFO  RDBMS                          - Validated 1 unique key(s) for table PERMISSION
2006-03-28 02:08:38,232 [main] INFO  RDBMS                          - Validated 1 unique key(s) for table SCHEDULE
2006-03-28 02:08:38,243 [main] INFO  RDBMS                          - Validated 1 unique key(s) for table PROJECT
2006-03-28 02:08:38,253 [main] INFO  RDBMS                          - Validated 3 foreign key(s) for table PROJECT
2006-03-28 02:08:38,267 [main] INFO  RDBMS                          - Validated 1 unique key(s) for table INSTALLATION
2006-03-28 02:08:38,278 [main] INFO  RDBMS                          - Validated 1 unique key(s) for table PROJECTDEPENDENCY
2006-03-28 02:08:38,292 [main] INFO  RDBMS                          - Validated 1 foreign key(s) for table PROJECTDEPENDENCY
2006-03-28 02:08:38,301 [main] INFO  RDBMS                          - Validated 1 unique key(s) for table CONTINUUMUSER
2006-03-28 02:08:38,305 [main] INFO  RDBMS                          - Validated 1 foreign key(s) for table CONTINUUMUSER
2006-03-28 02:08:38,312 [main] INFO  RDBMS                          - Validated 1 unique key(s) for table PROFILE
2006-03-28 02:08:38,317 [main] INFO  RDBMS                          - Validated 2 foreign key(s) for table PROFILE
2006-03-28 02:08:38,323 [main] INFO  RDBMS                          - Validated 1 unique key(s) for table PROJECTGROUP_NOTIFIERS
2006-03-28 02:08:38,332 [main] INFO  RDBMS                          - Validated 2 foreign key(s) for table PROJECTGROUP_NOTIFIERS
2006-03-28 02:08:38,341 [main] INFO  RDBMS                          - Validated 1 unique key(s) for table PROJECTGROUP_BUILDDEFINITIONS
2006-03-28 02:08:38,348 [main] INFO  RDBMS                          - Validated 2 foreign key(s) for table PROJECTGROUP_BUILDDEFINITIONS
2006-03-28 02:08:38,357 [main] INFO  RDBMS                          - Validated 1 unique key(s) for table CONTINUUMUSER_NOTIFICATIONADDRESSES
2006-03-28 02:08:38,362 [main] INFO  RDBMS                          - Validated 2 foreign key(s) for table CONTINUUMUSER_NOTIFICATIONADDRESSES
2006-03-28 02:08:38,369 [main] INFO  RDBMS                          - Validated 1 unique key(s) for table PROJECT_BUILDDEFINITIONS
2006-03-28 02:08:38,374 [main] INFO  RDBMS                          - Validated 2 foreign key(s) for table PROJECT_BUILDDEFINITIONS
2006-03-28 02:08:38,384 [main] INFO  RDBMS                          - Validated 1 unique key(s) for table NOTIFICATIONADDRESS_CONFIGURATION
2006-03-28 02:08:38,389 [main] INFO  RDBMS                          - Validated 1 foreign key(s) for table NOTIFICATIONADDRESS_CONFIGURATION
2006-03-28 02:08:38,399 [main] INFO  RDBMS                          - Validated 1 unique key(s) for table PROJECT_NOTIFIERS
2006-03-28 02:08:38,405 [main] INFO  RDBMS                          - Validated 2 foreign key(s) for table PROJECT_NOTIFIERS
2006-03-28 02:08:38,415 [main] INFO  RDBMS                          - Validated 1 unique key(s) for table USERGROUP_PERMISSIONS
2006-03-28 02:08:38,420 [main] INFO  RDBMS                          - Validated 2 foreign key(s) for table USERGROUP_PERMISSIONS
2006-03-28 02:08:38,426 [main] INFO  RDBMS                          - Validated 1 unique key(s) for table PROJECTNOTIFIER_CONFIGURATION
2006-03-28 02:08:38,429 [main] INFO  RDBMS                          - Validated 1 foreign key(s) for table PROJECTNOTIFIER_CONFIGURATION
2006-03-28 02:08:38,435 [main] INFO  SCHEMA                         - Catalog "", Schema "SA" initialised - managing 26 classes
2006-03-28 02:08:38,450 [main] INFO  Continuum                      - Starting Continuum.
2006-03-28 02:08:38,451 [main] INFO  Continuum                      - 
2006-03-28 02:08:38,451 [main] INFO  Continuum                      - 
2006-03-28 02:08:38,452 [main] INFO  Continuum                      - < Continuum 1.0.3-SNAPSHOT started! >
2006-03-28 02:08:38,452 [main] INFO  Continuum                      - -------------------------------------
2006-03-28 02:08:38,452 [main] INFO  Continuum                      -        \   ^__^
2006-03-28 02:08:38,452 [main] INFO  Continuum                      -         \  (oo)\_______
2006-03-28 02:08:38,453 [main] INFO  Continuum                      -            (__)\       )\/\
2006-03-28 02:08:38,453 [main] INFO  Continuum                      -                ||----w |
2006-03-28 02:08:38,453 [main] INFO  Continuum                      -                ||     ||
2006-03-28 02:08:38,453 [main] INFO  Continuum                      - 
2006-03-28 02:08:38,453 [main] INFO  Continuum                      - 
2006-03-28 02:08:38,453 [main] INFO  ContinuumInitializer           - Continuum initializer running ...
2006-03-28 02:08:38,675 [main] INFO  SchedulesActivator             - Activating schedules ...
2006-03-28 02:08:38,680 [main] INFO  SchedulesActivator             - Tue Mar 28 03:00:00 PST 2006
2006-03-28 02:08:38,680 [main] INFO  PlexusContainer                - Loading on start [role,roleHint]: [org.codehaus.plexus.taskqueue.execution.TaskQueueExecutor,build-project]
2006-03-28 02:08:38,699 [main] ERROR VelocityComponent              - ResourceManager : unable to find resource 'CommonMacros.vm' in any resource loader.
2006-03-28 02:08:38,701 [main] INFO  Notifier:mail                  - The from mailbox is not configured, will use the nag email address from the project.
2006-03-28 02:08:38,701 [main] INFO  Notifier:mail                  - From name: Continuum@cheddar.simulalabs.com
2006-03-28 02:08:38,701 [main] INFO  Notifier:mail                  - Build host name: cheddar.simulalabs.com
2006-03-28 02:08:38,703 [main] INFO  RecipientSource                - To override address is not configured, will use the nag email address from the project.
2006-03-28 02:08:38,704 [main] INFO  TaskQueueExecutor:build-project - Starting task executor, thread name 'build-project'.
2006-03-28 02:08:38,704 [main] INFO  PlexusContainer                - Loading on start [role,roleHint]: [org.codehaus.plexus.taskqueue.execution.TaskQueueExecutor,check-out-project]
2006-03-28 02:08:38,705 [main] INFO  TaskQueueExecutor:check-out-project - Starting task executor, thread name 'check-out-project'.
-------------------------------------------------------------------------------
[2006.03.28 02:08:38] Integration test settings
-------------------------------------------------------------------------------
[2006.03.28 02:08:38] IT root: /home/continuum/continuum-maven/working-directory/149/target/it
[2006.03.28 02:08:38] Remoting method: jvm
[2006.03.28 02:08:38] Store implementation: class org.apache.maven.continuum.store.JdoContinuumStore
-------------------------------------------------------------------------------
[2006.03.28 02:08:38] Connecting to and starting Continuum
[2006.03.28 02:08:38] Removing all existing projects from Continuum.
[2006.03.28 02:08:38] Initializing Maven 2 CVS project
[2006.03.28 02:08:38] Adding Maven 2 project
2006-03-28 02:08:38,842 [main] INFO  ContinuumProjectBuilder:maven-two-builder - Downloading file:/home/continuum/continuum-maven/working-directory/149/target/it/maven-two/pom.xml
2006-03-28 02:08:38,943 [main] INFO  Continuum                      - Created 1 projects.
2006-03-28 02:08:38,944 [main] INFO  Continuum                      - Created 1 project groups.
2006-03-28 02:08:38,944 [main] INFO  Continuum                      - 0 warnings.
2006-03-28 02:08:38,947 [main] INFO  Continuum                      - Creating project group with the group id: 'continuum'.
2006-03-28 02:08:39,524 [Thread-28] INFO  ContinuumScm                   - Checking out project: 'Maven 2 Project', id: '6' to '/home/continuum/continuum-maven/working-directory/149/target/working-directory/6'.
2006-03-28 02:08:39,525 [Thread-28] INFO  ScmManager                     - Executing: cvs -z3 -f -d /home/continuum/continuum-maven/working-directory/149/target/it/cvs-root -q checkout -d 6 maven-two
2006-03-28 02:08:39,526 [Thread-28] INFO  ScmManager                     - Working directory: /home/continuum/continuum-maven/working-directory/149/target/working-directory
2006-03-28 02:08:39,561 [Thread-33] DEBUG ScmManager                     - U 6/pom.xml
2006-03-28 02:08:39,564 [Thread-33] DEBUG ScmManager                     - U 6/src/main/java/Foo.java
2006-03-28 02:08:40,001 [Thread-28] INFO  ContinuumScm                   - Checked out 2 files.
[2006.03.28 02:08:40] Building Maven 2 project
2006-03-28 02:08:40,469 [main] INFO  Continuum                      - Enqueuing 'Maven 2 Project' (Build definition id=6).
2006-03-28 02:08:40,568 [Thread-27] WARN  SQL                            - Object with id "0" not found !
2006-03-28 02:08:40,630 [Thread-27] INFO  ContinuumScm                   - Updating project: id: '6', name 'Maven 2 Project'.
2006-03-28 02:08:40,636 [Thread-27] INFO  ScmManager                     - Executing: cvs -z3 -f -d /home/continuum/continuum-maven/working-directory/149/target/it/cvs-root -q update -d
2006-03-28 02:08:40,637 [Thread-27] INFO  ScmManager                     - Working directory: /home/continuum/continuum-maven/working-directory/149/target/working-directory/6
2006-03-28 02:08:40,732 [Thread-27] INFO  Action:update-project-from-working-directory - Updating project 'Maven 2 Project' from checkout.
2006-03-28 02:08:40,997 [Thread-27] WARN  ContinuumBuildExecutor:maven2  - Could not find the executable 'mvn' in this path: 
2006-03-28 02:08:40,998 [Thread-27] WARN  ContinuumBuildExecutor:maven2  - Executable 'mvn'.
2006-03-28 02:08:40,998 [Thread-27] INFO  ContinuumBuildExecutor:maven2  - Arguments: --batch-mode --non-recursive clean install
2006-03-28 02:08:40,998 [Thread-27] INFO  ContinuumBuildExecutor:maven2  - Working directory: /home/continuum/continuum-maven/working-directory/149/target/working-directory/6
2006-03-28 02:08:44,760 [Thread-27] INFO  ContinuumBuildExecutor:maven2  - Exit code: 0
2006-03-28 02:08:44,947 [Thread-27] INFO  Notifier:mail                  - Sending message: From '"Continuum@cheddar.simulalabs.com" <continuum@localhost>'.
2006-03-28 02:08:44,947 [Thread-27] INFO  Notifier:mail                  - Recipient: To '<continuum@localhost>'.
DEBUG: JavaMail version 1.3.2
DEBUG: java.io.FileNotFoundException: /usr/local/jdk1.5.0_03/jre/lib/javamail.providers (No such file or directory)
DEBUG: !anyLoaded
DEBUG: not loading resource: /META-INF/javamail.providers
DEBUG: successfully loaded resource: /META-INF/javamail.default.providers
DEBUG: Tables of loaded providers
DEBUG: Providers Listed By Class Name: {com.sun.mail.smtp.SMTPSSLTransport=javax.mail.Provider[TRANSPORT,smtps,com.sun.mail.smtp.SMTPSSLTransport,Sun Microsystems, Inc], com.sun.mail.smtp.SMTPTransport=javax.mail.Provider[TRANSPORT,smtp,com.sun.mail.smtp.SMTPTransport,Sun Microsystems, Inc], com.sun.mail.imap.IMAPSSLStore=javax.mail.Provider[STORE,imaps,com.sun.mail.imap.IMAPSSLStore,Sun Microsystems, Inc], com.sun.mail.pop3.POP3SSLStore=javax.mail.Provider[STORE,pop3s,com.sun.mail.pop3.POP3SSLStore,Sun Microsystems, Inc], com.sun.mail.imap.IMAPStore=javax.mail.Provider[STORE,imap,com.sun.mail.imap.IMAPStore,Sun Microsystems, Inc], com.sun.mail.pop3.POP3Store=javax.mail.Provider[STORE,pop3,com.sun.mail.pop3.POP3Store,Sun Microsystems, Inc]}
DEBUG: Providers Listed By Protocol: {imaps=javax.mail.Provider[STORE,imaps,com.sun.mail.imap.IMAPSSLStore,Sun Microsystems, Inc], imap=javax.mail.Provider[STORE,imap,com.sun.mail.imap.IMAPStore,Sun Microsystems, Inc], smtps=javax.mail.Provider[TRANSPORT,smtps,com.sun.mail.smtp.SMTPSSLTransport,Sun Microsystems, Inc], pop3=javax.mail.Provider[STORE,pop3,com.sun.mail.pop3.POP3Store,Sun Microsystems, Inc], pop3s=javax.mail.Provider[STORE,pop3s,com.sun.mail.pop3.POP3SSLStore,Sun Microsystems, Inc], smtp=javax.mail.Provider[TRANSPORT,smtp,com.sun.mail.smtp.SMTPTransport,Sun Microsystems, Inc]}
DEBUG: successfully loaded resource: /META-INF/javamail.default.address.map
DEBUG: !anyLoaded
DEBUG: not loading resource: /META-INF/javamail.address.map
DEBUG: java.io.FileNotFoundException: /usr/local/jdk1.5.0_03/jre/lib/javamail.address.map (No such file or directory)
DEBUG: setDebug: JavaMail version 1.3.2
DEBUG: getProvider() returning javax.mail.Provider[TRANSPORT,smtp,com.sun.mail.smtp.SMTPTransport,Sun Microsystems, Inc]
DEBUG SMTP: useEhlo true, useAuth false
DEBUG SMTP: trying to connect to host "localhost", port 25, isSSL false
220 ci.codehaus.org ESMTP
DEBUG SMTP: connected to host "localhost", port: 25

EHLO cheddar.simulalabs.com
250-ci.codehaus.org
250-PIPELINING
250 8BITMIME
DEBUG SMTP: Found extension "PIPELINING", arg ""
DEBUG SMTP: Found extension "8BITMIME", arg ""
DEBUG SMTP: use8bit false
MAIL FROM:<continuum@localhost>
250 ok
RCPT TO:<continuum@localhost>
250 ok
DEBUG SMTP: Verified Addresses
DEBUG SMTP:   continuum@localhost
DATA
354 go ahead
Message-ID: <13833753.1143540525125.JavaMail.continuum@cheddar.simulalabs.com>
Date: Tue, 28 Mar 06 02:08:45 -0800
From: "Continuum@cheddar.simulalabs.com" <continuum@localhost>
To: continuum@localhost
Subject: [continuum] BUILD SUCCESSFUL: Maven 2 Project
MIME-Version: 1.0
Content-Type: text/plain; charset=us-ascii
Content-Transfer-Encoding: 7bit

Online report : /target/ProjectBuild.vm/view/ProjectBuild/id/6/buildId/6
Build statistics:
  State: Ok
  Previous Build: No previous build.
  Started at: Tue, 28 Mar 2006 02:08:40 -0800
  Finished at: Tue, 28 Mar 2006 02:08:44 -0800
  Total time: 3s
  Build Trigger: Schedule
  Exit code: 0
  Building machine hostname: cheddar.simulalabs.com
  Operating system : Linux(unknown)
  Java version : 1.5.0_03(Sun Microsystems Inc.)

Changes
      No files changed
  
****************************************************************************
Output:
****************************************************************************
[INFO] Scanning for projects...
[INFO] ----------------------------------------------------------------------------
[INFO] Building Maven 2 Project
[INFO]    task-segment: [clean, install]
[INFO] ----------------------------------------------------------------------------
[INFO] [clean:clean]
[INFO] Deleting directory /home/continuum/continuum-maven/working-directory/149/target/working-directory/6/target
[INFO] Deleting directory /home/continuum/continuum-maven/working-directory/149/target/working-directory/6/target/classes
[INFO] Deleting directory /home/continuum/continuum-maven/working-directory/149/target/working-directory/6/target/test-classes
[INFO] [resources:resources]
[INFO] Using default encoding to copy filtered resources.
[INFO] [compiler:compile]
Compiling 1 source file to /home/continuum/continuum-maven/working-directory/149/target/working-directory/6/target/classes
[INFO] [resources:testResources]
[INFO] Using default encoding to copy filtered resources.
[INFO] [compiler:testCompile]
[INFO] No sources to compile
[INFO] [surefire:test]
[INFO] No tests to run.
[INFO] [jar:jar]
[INFO] Building jar: /home/continuum/continuum-maven/working-directory/149/target/working-directory/6/target/maven-two-2.0-SNAPSHOT.jar
[INFO] [install:install]
[INFO] Installing /home/continuum/continuum-maven/working-directory/149/target/working-directory/6/target/maven-two-2.0-SNAPSHOT.jar to /home/continuum/.m2/repository/continuum/maven-two/2.0-SNAPSHOT/maven-two-2.0-SNAPSHOT.jar
[INFO] ----------------------------------------------------------------------------
[INFO] BUILD SUCCESSFUL
[INFO] ----------------------------------------------------------------------------
[INFO] Total time: 2 seconds
[INFO] Finished at: Tue Mar 28 02:08:44 PST 2006
[INFO] Final Memory: 7M/122M
[INFO] ----------------------------------------------------------------------------

****************************************************************************


.
250 ok 1143540525 qp 3037
QUIT
2006-03-28 02:08:45,514 [Thread-27] INFO  IrcBot                         - irc: 'privmsg #test :BUILD SUCCESSFUL: Maven 2 Project /target/ProjectBuild.vm/view/ProjectBuild/id/6/buildId/6'
2006-03-28 02:08:45,514 [Thread-27] INFO  IrcBot                         - irc: 'quit terminating'
[2006.03.28 02:08:45] Test that a build without any files changed won't execute the executor
2006-03-28 02:08:45,591 [main] INFO  Continuum                      - Enqueuing 'Maven 2 Project' (Build definition id=6).
2006-03-28 02:08:45,706 [Thread-27] INFO  ContinuumScm                   - Updating project: id: '6', name 'Maven 2 Project'.
2006-03-28 02:08:45,730 [Thread-27] INFO  ScmManager                     - Executing: cvs -z3 -f -d /home/continuum/continuum-maven/working-directory/149/target/it/cvs-root -q update -d
2006-03-28 02:08:45,730 [Thread-27] INFO  ScmManager                     - Working directory: /home/continuum/continuum-maven/working-directory/149/target/working-directory/6
2006-03-28 02:08:45,764 [Thread-39] DEBUG ScmManager                     - ? target
2006-03-28 02:08:45,766 [Thread-27] INFO  ScmManager                     - Executing: cvs -z3 -f -d /home/continuum/continuum-maven/working-directory/149/target/it/cvs-root -q log -d ">2006-03-28 02:08:40 PST"
2006-03-28 02:08:45,766 [Thread-27] INFO  ScmManager                     - Working directory: /home/continuum/continuum-maven/working-directory/149/target/working-directory/6
2006-03-28 02:08:45,949 [Thread-27] INFO  ContinuumScm                   - Updated 1 files.
2006-03-28 02:08:45,977 [Thread-27] INFO  BuildController                - The project was not built because all changes are unknown.
[2006.03.28 02:08:48] Test that a forced build without any files changed executes the executor
2006-03-28 02:08:48,642 [main] INFO  Continuum                      - Enqueuing 'Maven 2 Project' (Build definition id=6).
2006-03-28 02:08:48,735 [Thread-27] INFO  ContinuumScm                   - Updating project: id: '6', name 'Maven 2 Project'.
2006-03-28 02:08:48,747 [Thread-27] INFO  ScmManager                     - Executing: cvs -z3 -f -d /home/continuum/continuum-maven/working-directory/149/target/it/cvs-root -q update -d
2006-03-28 02:08:48,747 [Thread-27] INFO  ScmManager                     - Working directory: /home/continuum/continuum-maven/working-directory/149/target/working-directory/6
2006-03-28 02:08:48,781 [Thread-43] DEBUG ScmManager                     - ? target
2006-03-28 02:08:48,782 [Thread-27] INFO  ScmManager                     - Executing: cvs -z3 -f -d /home/continuum/continuum-maven/working-directory/149/target/it/cvs-root -q log -d ">2006-03-28 02:08:40 PST"
2006-03-28 02:08:48,782 [Thread-27] INFO  ScmManager                     - Working directory: /home/continuum/continuum-maven/working-directory/149/target/working-directory/6
2006-03-28 02:08:48,816 [Thread-27] INFO  ContinuumScm                   - Updated 1 files.
2006-03-28 02:08:48,867 [Thread-27] INFO  Action:update-project-from-working-directory - Updating project 'Maven 2 Project' from checkout.
2006-03-28 02:08:49,020 [Thread-27] WARN  ContinuumBuildExecutor:maven2  - Could not find the executable 'mvn' in this path: 
2006-03-28 02:08:49,020 [Thread-27] WARN  ContinuumBuildExecutor:maven2  - Executable 'mvn'.
2006-03-28 02:08:49,020 [Thread-27] INFO  ContinuumBuildExecutor:maven2  - Arguments: --batch-mode --non-recursive clean install
2006-03-28 02:08:49,021 [Thread-27] INFO  ContinuumBuildExecutor:maven2  - Working directory: /home/continuum/continuum-maven/working-directory/149/target/working-directory/6
2006-03-28 02:08:52,690 [Thread-27] INFO  ContinuumBuildExecutor:maven2  - Exit code: 0
[2006.03.28 02:08:52] Test that a forced build with a pom deleted executes the executor
2006-03-28 02:08:52,810 [Thread-27] DEBUG Notifier:mail                  - Current build state: 2, previous build state: 2
2006-03-28 02:08:52,810 [Thread-27] INFO  Notifier:mail                  - Same state, not sending message.
2006-03-28 02:08:52,830 [Thread-27] DEBUG Notifier:irc                   - Current build state: 2, previous build state: 2
2006-03-28 02:08:52,831 [Thread-27] INFO  Notifier:irc                   - Same state, not sending message.
2006-03-28 02:08:52,868 [main] INFO  Continuum                      - Enqueuing 'Maven 2 Project' (Build definition id=6).
2006-03-28 02:08:52,998 [Thread-27] INFO  ContinuumScm                   - Updating project: id: '6', name 'Maven 2 Project'.
2006-03-28 02:08:53,007 [Thread-27] INFO  ScmManager                     - Executing: cvs -z3 -f -d /home/continuum/continuum-maven/working-directory/149/target/it/cvs-root -q update -d
2006-03-28 02:08:53,007 [Thread-27] INFO  ScmManager                     - Working directory: /home/continuum/continuum-maven/working-directory/149/target/working-directory/6
2006-03-28 02:08:53,040 [Thread-49] DEBUG ScmManager                     - U pom.xml
2006-03-28 02:08:53,042 [Thread-49] DEBUG ScmManager                     - ? target
2006-03-28 02:08:54,002 [Thread-27] INFO  ScmManager                     - Executing: cvs -z3 -f -d /home/continuum/continuum-maven/working-directory/149/target/it/cvs-root -q log -d ">2006-03-28 02:08:48 PST"
2006-03-28 02:08:54,002 [Thread-27] INFO  ScmManager                     - Working directory: /home/continuum/continuum-maven/working-directory/149/target/working-directory/6
2006-03-28 02:08:54,035 [Thread-27] INFO  ContinuumScm                   - Updated 2 files.
2006-03-28 02:08:54,083 [Thread-27] INFO  Action:update-project-from-working-directory - Updating project 'Maven 2 Project' from checkout.
2006-03-28 02:08:54,191 [Thread-27] WARN  ContinuumBuildExecutor:maven2  - Could not find the executable 'mvn' in this path: 
2006-03-28 02:08:54,191 [Thread-27] WARN  ContinuumBuildExecutor:maven2  - Executable 'mvn'.
2006-03-28 02:08:54,191 [Thread-27] INFO  ContinuumBuildExecutor:maven2  - Arguments: --batch-mode --non-recursive clean install
2006-03-28 02:08:54,191 [Thread-27] INFO  ContinuumBuildExecutor:maven2  - Working directory: /home/continuum/continuum-maven/working-directory/149/target/working-directory/6
2006-03-28 02:08:57,680 [Thread-27] INFO  ContinuumBuildExecutor:maven2  - Exit code: 0
2006-03-28 02:08:57,777 [Thread-27] DEBUG Notifier:mail                  - Current build state: 2, previous build state: 2
2006-03-28 02:08:57,777 [Thread-27] INFO  Notifier:mail                  - Same state, not sending message.
2006-03-28 02:08:57,792 [Thread-27] DEBUG Notifier:irc                   - Current build state: 2, previous build state: 2
2006-03-28 02:08:57,792 [Thread-27] INFO  Notifier:irc                   - Same state, not sending message.
[2006.03.28 02:09:00] Test with two build definition, the second receive scm result from the first.
2006-03-28 02:09:04,047 [main] INFO  Continuum                      - Enqueuing 'Maven 2 Project' (Build definition id=7).
2006-03-28 02:09:04,125 [Thread-27] WARN  SQL                            - Object with id "0" not found !
2006-03-28 02:09:04,174 [Thread-27] INFO  ContinuumScm                   - Updating project: id: '6', name 'Maven 2 Project'.
2006-03-28 02:09:04,183 [Thread-27] INFO  ScmManager                     - Executing: cvs -z3 -f -d /home/continuum/continuum-maven/working-directory/149/target/it/cvs-root -q update -d
2006-03-28 02:09:04,183 [Thread-27] INFO  ScmManager                     - Working directory: /home/continuum/continuum-maven/working-directory/149/target/working-directory/6
2006-03-28 02:09:04,216 [Thread-55] DEBUG ScmManager                     - ? target
2006-03-28 02:09:04,218 [Thread-27] INFO  ScmManager                     - Executing: cvs -z3 -f -d /home/continuum/continuum-maven/working-directory/149/target/it/cvs-root -q log -d ">2006-03-28 02:08:54 PST"
2006-03-28 02:09:04,218 [Thread-27] INFO  ScmManager                     - Working directory: /home/continuum/continuum-maven/working-directory/149/target/working-directory/6
2006-03-28 02:09:04,250 [Thread-27] INFO  ContinuumScm                   - Updated 1 files.
2006-03-28 02:09:04,284 [Thread-27] INFO  Action:update-project-from-working-directory - Updating project 'Maven 2 Project' from checkout.
2006-03-28 02:09:04,382 [Thread-27] WARN  ContinuumBuildExecutor:maven2  - Could not find the executable 'mvn' in this path: 
2006-03-28 02:09:04,382 [Thread-27] WARN  ContinuumBuildExecutor:maven2  - Executable 'mvn'.
2006-03-28 02:09:04,382 [Thread-27] INFO  ContinuumBuildExecutor:maven2  - Arguments:  clean
2006-03-28 02:09:04,382 [Thread-27] INFO  ContinuumBuildExecutor:maven2  - Working directory: /home/continuum/continuum-maven/working-directory/149/target/working-directory/6
-------------------------------------------------------------------------------
CHANGESET
-------------------------------------------------------------------------------
null
0
target
null
-------------------------------------------------------------------------------
2006-03-28 02:09:06,003 [Thread-27] INFO  ContinuumBuildExecutor:maven2  - Exit code: 0
2006-03-28 02:09:06,088 [Thread-27] DEBUG Notifier:mail                  - Current build state: 2, previous build state: 2
2006-03-28 02:09:06,088 [Thread-27] INFO  Notifier:mail                  - Same state, not sending message.
2006-03-28 02:09:06,103 [Thread-27] DEBUG Notifier:irc                   - Current build state: 2, previous build state: 2
2006-03-28 02:09:06,103 [Thread-27] INFO  Notifier:irc                   - Same state, not sending message.
2006-03-28 02:09:08,182 [main] INFO  Continuum                      - Enqueuing 'Maven 2 Project' (Build definition id=6).
2006-03-28 02:09:08,312 [Thread-27] INFO  ContinuumScm                   - Updating project: id: '6', name 'Maven 2 Project'.
2006-03-28 02:09:08,321 [Thread-27] INFO  ScmManager                     - Executing: cvs -z3 -f -d /home/continuum/continuum-maven/working-directory/149/target/it/cvs-root -q update -d
2006-03-28 02:09:08,321 [Thread-27] INFO  ScmManager                     - Working directory: /home/continuum/continuum-maven/working-directory/149/target/working-directory/6
2006-03-28 02:09:08,358 [Thread-61] DEBUG ScmManager                     - U src/main/java/Foo.java
2006-03-28 02:09:09,004 [Thread-27] INFO  ScmManager                     - Executing: cvs -z3 -f -d /home/continuum/continuum-maven/working-directory/149/target/it/cvs-root -q log -d ">2006-03-28 02:09:04 PST"
2006-03-28 02:09:09,004 [Thread-27] INFO  ScmManager                     - Working directory: /home/continuum/continuum-maven/working-directory/149/target/working-directory/6
2006-03-28 02:09:09,038 [Thread-27] INFO  ContinuumScm                   - Updated 1 files.
2006-03-28 02:09:09,071 [Thread-27] INFO  Action:update-project-from-working-directory - Updating project 'Maven 2 Project' from checkout.
2006-03-28 02:09:09,169 [Thread-27] WARN  ContinuumBuildExecutor:maven2  - Could not find the executable 'mvn' in this path: 
2006-03-28 02:09:09,169 [Thread-27] WARN  ContinuumBuildExecutor:maven2  - Executable 'mvn'.
2006-03-28 02:09:09,169 [Thread-27] INFO  ContinuumBuildExecutor:maven2  - Arguments: --batch-mode --non-recursive clean install
2006-03-28 02:09:09,169 [Thread-27] INFO  ContinuumBuildExecutor:maven2  - Working directory: /home/continuum/continuum-maven/working-directory/149/target/working-directory/6
2006-03-28 02:09:12,821 [Thread-27] INFO  ContinuumBuildExecutor:maven2  - Exit code: 0
2006-03-28 02:09:13,028 [Thread-27] DEBUG Notifier:mail                  - Current build state: 2, previous build state: 2
2006-03-28 02:09:13,028 [Thread-27] INFO  Notifier:mail                  - Same state, not sending message.
2006-03-28 02:09:13,040 [Thread-27] DEBUG Notifier:irc                   - Current build state: 2, previous build state: 2
2006-03-28 02:09:13,040 [Thread-27] INFO  Notifier:irc                   - Same state, not sending message.
-------------------------------------------------------------------------------
CHANGESET
-------------------------------------------------------------------------------
null
-------------------------------------------------------------------------------
0
src/main/java/Foo.java
null
2006-03-28 02:09:16,375 [main] INFO  Continuum                      - Enqueuing 'Maven 2 Project' (Build definition id=7).
2006-03-28 02:09:16,473 [Thread-27] INFO  ContinuumScm                   - Updating project: id: '6', name 'Maven 2 Project'.
2006-03-28 02:09:16,481 [Thread-27] INFO  ScmManager                     - Executing: cvs -z3 -f -d /home/continuum/continuum-maven/working-directory/149/target/it/cvs-root -q update -d
2006-03-28 02:09:16,481 [Thread-27] INFO  ScmManager                     - Working directory: /home/continuum/continuum-maven/working-directory/149/target/working-directory/6
2006-03-28 02:09:16,517 [Thread-67] DEBUG ScmManager                     - ? target
2006-03-28 02:09:16,518 [Thread-27] INFO  ScmManager                     - Executing: cvs -z3 -f -d /home/continuum/continuum-maven/working-directory/149/target/it/cvs-root -q log -d ">2006-03-28 02:09:09 PST"
2006-03-28 02:09:16,518 [Thread-27] INFO  ScmManager                     - Working directory: /home/continuum/continuum-maven/working-directory/149/target/working-directory/6
2006-03-28 02:09:16,552 [Thread-27] INFO  ContinuumScm                   - Updated 1 files.
2006-03-28 02:09:16,585 [Thread-27] INFO  Action:update-project-from-working-directory - Updating project 'Maven 2 Project' from checkout.
2006-03-28 02:09:16,720 [Thread-27] WARN  ContinuumBuildExecutor:maven2  - Could not find the executable 'mvn' in this path: 
2006-03-28 02:09:16,720 [Thread-27] WARN  ContinuumBuildExecutor:maven2  - Executable 'mvn'.
2006-03-28 02:09:16,720 [Thread-27] INFO  ContinuumBuildExecutor:maven2  - Arguments:  clean
2006-03-28 02:09:16,721 [Thread-27] INFO  ContinuumBuildExecutor:maven2  - Working directory: /home/continuum/continuum-maven/working-directory/149/target/working-directory/6
2006-03-28 02:09:18,507 [Thread-27] INFO  ContinuumBuildExecutor:maven2  - Exit code: 0
2006-03-28 02:09:18,602 [Thread-27] DEBUG Notifier:mail                  - Current build state: 2, previous build state: 2
2006-03-28 02:09:18,603 [Thread-27] INFO  Notifier:mail                  - Same state, not sending message.
2006-03-28 02:09:18,614 [Thread-27] DEBUG Notifier:irc                   - Current build state: 2, previous build state: 2
2006-03-28 02:09:18,614 [Thread-27] INFO  Notifier:irc                   - Same state, not sending message.
2006-03-28 02:09:20,416 [main] INFO  Continuum                      - Remove project Maven 2 Project(6)
2006-03-28 02:09:20,746 [main] WARN  SQL                            - Object with id "6" not found !
[2006.03.28 02:09:20] Tearing down test - ignore any interrupted exceptions
2006-03-28 02:09:20,748 [main] INFO  TaskQueueExecutor:check-out-project - Executor thread got shutdown signal.
2006-03-28 02:09:20,748 [Thread-28] INFO  TaskQueueExecutor:check-out-project - Executor thread 'check-out-project' exited.
There was no such logger 'org.apache.maven.plugin.MavenPluginCollector' 5025481.
There was no such logger 'org.apache.maven.continuum.execution.ContinuumBuildExecutor:shell' 5025481.
There was no such logger 'org.codehaus.plexus.taskqueue.TaskQueue:check-out-project' 5025481.
There was no such logger 'org.apache.maven.continuum.buildcontroller.BuildController' 5025481.
There was no such logger 'org.apache.maven.continuum.scm.ContinuumScm' 5025481.
There was no such logger 'org.apache.maven.continuum.utils.WorkingDirectoryService' 5025481.
There was no such logger 'org.apache.maven.artifact.resolver.ArtifactResolver' 5025481.
There was no such logger 'org.apache.maven.continuum.project.builder.ContinuumProjectBuilder:maven-two-builder' 5025481.
There was no such logger 'org.apache.maven.continuum.execution.manager.BuildExecutorManager' 5025481.
There was no such logger 'org.codehaus.plexus.notification.RecipientSource' 5025481.
There was no such logger 'org.apache.maven.continuum.initialization.ContinuumInitializer' 5025481.
There was no such logger 'org.apache.maven.continuum.build.settings.SchedulesActivator' 5025481.
There was no such logger 'org.apache.maven.continuum.execution.ContinuumBuildExecutor:maven-1' 5025481.
There was no such logger 'org.codehaus.plexus.jdo.JdoFactory' 5025481.
There was no such logger 'org.codehaus.plexus.notification.notifier.Notifier:jabber' 5025481.
There was no such logger 'org.apache.maven.continuum.execution.maven.m1.MavenOneMetadataHelper' 5025481.
There was no such logger 'org.codehaus.plexus.taskqueue.TaskViabilityEvaluator:build-project' 5025481.
There was no such logger 'org.apache.maven.artifact.deployer.ArtifactDeployer' 5025481.
There was no such logger 'org.codehaus.plexus.notification.notifier.Notifier:mail' 5025481.
There was no such logger 'org.apache.maven.artifact.transform.ArtifactTransformation:snapshot' 5025481.
There was no such logger 'org.codehaus.plexus.msn.MsnClient' 5025481.
There was no such logger 'org.codehaus.plexus.notification.notifier.Notifier:msn' 5025481.
There was no such logger 'org.apache.maven.artifact.manager.WagonManager' 5025481.
2006-03-28 02:09:20,758 [main] INFO  TaskQueueExecutor:build-project - Executor thread got shutdown signal.
2006-03-28 02:09:20,758 [Thread-27] INFO  TaskQueueExecutor:build-project - Executor thread 'build-project' exited.
There was no such logger 'org.codehaus.plexus.taskqueue.execution.TaskQueueExecutor:build-project' 5025481.
There was no such logger 'org.codehaus.plexus.action.Action:check-working-directory' 5025481.
There was no such logger 'org.apache.maven.profiles.MavenProfilesBuilder' 5025481.
There was no such logger 'org.apache.maven.continuum.store.ContinuumStore:jdo' 5025481.
There was no such logger 'org.codehaus.plexus.commandline.ExecutableResolver' 5025481.
2006-03-28 02:09:20,784 [main] INFO  Continuum                      - Stopping Continuum.
2006-03-28 02:09:20,784 [main] INFO  Continuum                      - Continuum stopped.
There was no such logger 'org.apache.maven.continuum.Continuum' 5025481.
There was no such logger 'org.codehaus.plexus.action.Action:create-projects-from-metadata' 5025481.
There was no such logger 'org.codehaus.plexus.taskqueue.execution.TaskExecutor:check-out-project' 5025481.
There was no such logger 'org.codehaus.plexus.action.Action:update-working-directory-from-scm' 5025481.
There was no such logger 'org.codehaus.plexus.ircbot.IrcBot' 5025481.
There was no such logger 'org.apache.maven.continuum.configuration.ConfigurationService' 5025481.
There was no such logger 'org.apache.maven.continuum.execution.maven.m2.MavenBuilderHelper' 5025481.
There was no such logger 'org.apache.maven.continuum.project.builder.manager.ContinuumProjectBuilderManager' 5025481.
There was no such logger 'org.codehaus.plexus.notification.notifier.Notifier:irc' 5025481.
There was no such logger 'org.apache.maven.continuum.project.builder.ContinuumProjectBuilder:maven-one-builder' 5025481.
There was no such logger 'org.codehaus.plexus.notification.notifier.manager.NotifierManager' 5025481.
There was no such logger 'org.codehaus.plexus.velocity.VelocityComponent' 5025481.
There was no such logger 'org.codehaus.plexus.action.Action:add-project-to-checkout-queue' 5025481.
There was no such logger 'org.codehaus.plexus.action.Action:checkout-project' 5025481.
There was no such logger 'org.apache.maven.settings.MavenSettingsBuilder' 5025481.
There was no such logger 'org.codehaus.plexus.action.ActionManager' 5025481.
There was no such logger 'org.codehaus.plexus.mailsender.MailSender' 5025481.
There was no such logger 'org.apache.maven.continuum.execution.ContinuumBuildExecutor:maven2' 5025481.
There was no such logger 'org.apache.maven.project.interpolation.ModelInterpolator' 5025481.
There was no such logger 'org.codehaus.plexus.notification.notifier.Notifier:console' 5025481.
There was no such logger 'org.apache.maven.continuum.utils.shell.ShellCommandHelper' 5025481.
There was no such logger 'org.codehaus.plexus.taskqueue.execution.TaskExecutor:build-project' 5025481.
There was no such logger 'org.codehaus.plexus.action.Action:store-checkout-scm-result' 5025481.
There was no such logger 'org.codehaus.plexus.action.Action:store-project-group' 5025481.
There was no such logger 'org.codehaus.plexus.action.Action:execute-builder' 5025481.
There was no such logger 'org.apache.maven.artifact.repository.metadata.RepositoryMetadataManager' 5025481.
There was no such logger 'org.apache.maven.artifact.transform.ArtifactTransformation:release' 5025481.
There was no such logger 'org.codehaus.plexus.jabber.JabberClient' 5025481.
Mar 28, 2006 2:09:20 AM org.quartz.core.QuartzScheduler shutdown
INFO: Scheduler defaultScheduler_$_NON_CLUSTERED shutting down.
Mar 28, 2006 2:09:20 AM org.quartz.core.QuartzScheduler pause
INFO: Scheduler defaultScheduler_$_NON_CLUSTERED paused.
Mar 28, 2006 2:09:20 AM org.quartz.core.QuartzScheduler shutdown
INFO: Scheduler defaultScheduler_$_NON_CLUSTERED shutdown complete.
There was no such logger 'org.codehaus.plexus.scheduler.Scheduler' 5025481.
There was no such logger 'org.apache.maven.continuum.notification.ContinuumNotificationDispatcher' 5025481.
There was no such logger 'org.codehaus.plexus.action.Action:deploy-artifact' 5025481.
There was no such logger 'org.apache.maven.project.MavenProjectBuilder' 5025481.
There was no such logger 'org.apache.maven.scm.manager.ScmManager' 5025481.
There was no such logger 'org.codehaus.plexus.action.Action:update-project-from-working-directory' 5025481.
There was no such logger 'org.apache.maven.artifact.transform.ArtifactTransformation:latest' 5025481.
[2006.03.28 02:09:20] Used 44122ms
[surefire] Tests run: 1, Failures: 0, Errors: 0, Time elapsed: 44.167 sec
[surefire] Running org.apache.maven.continuum.it.MavenOneIntegrationTest
2006-03-28 02:09:20,992 [main] DEBUG PlexusContainer                - Found 3 components to load on start
2006-03-28 02:09:20,992 [main] INFO  PlexusContainer                - Loading on start [role]: [org.apache.maven.continuum.Continuum]
2006-03-28 02:09:20,993 [main] INFO  JdoFactory                     - Initializing JDO.
2006-03-28 02:09:20,994 [main] INFO  JDO                            - PersistenceManagerFactory - Vendor: JPOX  Version: 1.1.0-rc-1
2006-03-28 02:09:20,994 [main] INFO  JDO                            - PersistenceManagerFactory initialised for datastore URL=jdbc:derby:/home/continuum/continuum-maven/working-directory/149/target/level1/level2/plexus-home/database;create=true driver=org.apache.derby.jdbc.EmbeddedDriver userName=sa
Mar 28, 2006 2:09:21 AM org.quartz.simpl.RAMJobStore initialize
INFO: RAMJobStore initialized.
Mar 28, 2006 2:09:21 AM org.quartz.impl.StdSchedulerFactory instantiate
INFO: Quartz scheduler 'defaultScheduler' initialized from an externally provided properties instance.
Mar 28, 2006 2:09:21 AM org.quartz.impl.StdSchedulerFactory instantiate
INFO: Quartz scheduler version: 1.4.5
Mar 28, 2006 2:09:21 AM org.quartz.core.QuartzScheduler start
INFO: Scheduler defaultScheduler_$_NON_CLUSTERED started.
2006-03-28 02:09:21,005 [main] WARN  ContinuumBuildExecutor:ant     - Could not find the executable 'ant' in the path '[]'.
2006-03-28 02:09:21,005 [main] WARN  ContinuumBuildExecutor:maven-1 - Could not find the executable 'maven' in the path '[]'.
2006-03-28 02:09:21,042 [main] DEBUG MavenSettingsBuilder           - Building Maven global-level settings from: '/usr/local/maven-2.0.3-SNAPSHOT/conf/settings.xml'
2006-03-28 02:09:21,043 [main] DEBUG MavenSettingsBuilder           - Building Maven user-level settings from: '/home/continuum/.m2/settings.xml'
2006-03-28 02:09:21,105 [main] WARN  ContinuumBuildExecutor:maven2  - Could not find the executable 'mvn' in the path '[]'.
2006-03-28 02:09:21,106 [main] INFO  BuildExecutorManager           - Build executors:
2006-03-28 02:09:21,106 [main] INFO  BuildExecutorManager           -   maven-1
2006-03-28 02:09:21,106 [main] INFO  BuildExecutorManager           -   ant
2006-03-28 02:09:21,106 [main] INFO  BuildExecutorManager           -   maven2
2006-03-28 02:09:21,106 [main] INFO  BuildExecutorManager           -   shell
2006-03-28 02:09:21,106 [main] INFO  Continuum                      - Initializing Continuum.
2006-03-28 02:09:21,106 [main] INFO  Continuum                      - Showing all projects: 
2006-03-28 02:09:21,162 [main] INFO  RDBMS                          - RDBMS Adapter initialised : CloudscapeAdapter : Apache Derby version=10.1.2.1, major=10, minor=1, revision=2
Identifier Names : UPPERCASE 
Driver name=Apache Derby Embedded JDBC Driver, version=10.1.2.1, major=10, minor=1
Identifier Max Lengths : Table=128  Column=128  Constraint=18  Index=18  Delimeters="
Identifier Support in DDL : catalog=false  schema=true
2006-03-28 02:09:21,163 [main] INFO  SCHEMA                         - Initialising Catalog "", Schema "SA" using "SchemaTable" auto-start option
2006-03-28 02:09:21,287 [main] INFO  JDO                            - Managing Persistence of org.apache.maven.continuum.model.project.Project since it was managed previously
2006-03-28 02:09:21,287 [main] INFO  JDO                            - Managing Persistence of org.apache.maven.continuum.model.system.Permission since it was managed previously
2006-03-28 02:09:21,287 [main] INFO  JDO                            - Managing Persistence of org.apache.maven.continuum.model.project.ProjectNotifier since it was managed previously
2006-03-28 02:09:21,288 [main] INFO  JDO                            - Managing Persistence of org.apache.maven.continuum.model.project.BuildDefinition since it was managed previously
2006-03-28 02:09:21,288 [main] INFO  JDO                            - Managing Persistence of org.apache.maven.continuum.model.system.ContinuumUser since it was managed previously
2006-03-28 02:09:21,288 [main] INFO  JDO                            - Managing Persistence of org.apache.maven.continuum.model.scm.ScmResult since it was managed previously
2006-03-28 02:09:21,288 [main] INFO  JDO                            - Managing Persistence of org.apache.maven.continuum.model.scm.ChangeSet since it was managed previously
2006-03-28 02:09:21,288 [main] INFO  JDO                            - Managing Persistence of org.apache.maven.continuum.model.system.SystemConfiguration since it was managed previously
2006-03-28 02:09:21,288 [main] INFO  JDO                            - Managing Persistence of org.apache.maven.continuum.model.project.Profile since it was managed previously
2006-03-28 02:09:21,288 [main] INFO  JDO                            - Managing Persistence of org.apache.maven.continuum.model.project.BuildResult since it was managed previously
2006-03-28 02:09:21,289 [main] INFO  JDO                            - Managing Persistence of org.apache.maven.continuum.model.project.ProjectDependency since it was managed previously
2006-03-28 02:09:21,289 [main] INFO  JDO                            - Managing Persistence of org.apache.maven.continuum.model.scm.ChangeFile since it was managed previously
2006-03-28 02:09:21,289 [main] INFO  JDO                            - Managing Persistence of org.apache.maven.continuum.model.project.ProjectDeveloper since it was managed previously
2006-03-28 02:09:21,289 [main] INFO  JDO                            - Managing Persistence of org.apache.maven.continuum.model.project.Schedule since it was managed previously
2006-03-28 02:09:21,289 [main] INFO  JDO                            - Managing Persistence of org.apache.maven.continuum.model.project.ProjectGroup since it was managed previously
2006-03-28 02:09:21,289 [main] INFO  JDO                            - Managing Persistence of org.apache.maven.continuum.model.system.NotificationAddress since it was managed previously
2006-03-28 02:09:21,289 [main] INFO  JDO                            - Managing Persistence of org.apache.maven.continuum.model.system.Installation since it was managed previously
2006-03-28 02:09:21,290 [main] INFO  JDO                            - Managing Persistence of org.apache.maven.continuum.model.system.UserGroup since it was managed previously
2006-03-28 02:09:21,291 [main] INFO  MetaData                       - Parsing MetaData from file "file:/home/continuum/.m2/repository/org/apache/maven/continuum/continuum-model/1.0.3-SNAPSHOT/continuum-model-1.0.3-SNAPSHOT.jar!/META-INF/package.jdo"
2006-03-28 02:09:21,592 [main] INFO  SCHEMA                         - Managing Persistence of Class : org.apache.maven.continuum.model.system.Installation [Table : INSTALLATION, InheritanceStrategy : new-table]
2006-03-28 02:09:21,593 [main] INFO  SCHEMA                         - Managing Persistence of Class : org.apache.maven.continuum.model.project.Profile [Table : PROFILE, InheritanceStrategy : new-table]
2006-03-28 02:09:21,593 [main] INFO  SCHEMA                         - Managing Persistence of Class : org.apache.maven.continuum.model.project.Schedule [Table : SCHEDULE, InheritanceStrategy : new-table]
2006-03-28 02:09:21,594 [main] INFO  SCHEMA                         - Managing Persistence of Class : org.apache.maven.continuum.model.project.BuildDefinition [Table : BUILDDEFINITION, InheritanceStrategy : new-table]
2006-03-28 02:09:21,594 [main] INFO  SCHEMA                         - Managing Persistence of Class : org.apache.maven.continuum.model.scm.ChangeFile [Table : CHANGEFILE, InheritanceStrategy : new-table]
2006-03-28 02:09:21,595 [main] INFO  SCHEMA                         - Managing Persistence of Class : org.apache.maven.continuum.model.scm.ChangeSet [Table : CHANGESET, InheritanceStrategy : new-table]
2006-03-28 02:09:21,595 [main] INFO  SCHEMA                         - Managing Persistence of Class : org.apache.maven.continuum.model.scm.ScmResult [Table : SCMRESULT, InheritanceStrategy : new-table]
2006-03-28 02:09:21,595 [main] INFO  SCHEMA                         - Managing Persistence of Class : org.apache.maven.continuum.model.project.BuildResult [Table : BUILDRESULT, InheritanceStrategy : new-table]
2006-03-28 02:09:21,596 [main] INFO  SCHEMA                         - Managing Persistence of Class : org.apache.maven.continuum.model.project.ProjectDependency [Table : PROJECTDEPENDENCY, InheritanceStrategy : new-table]
2006-03-28 02:09:21,596 [main] INFO  SCHEMA                         - Managing Persistence of Class : org.apache.maven.continuum.model.project.ProjectDeveloper [Table : PROJECTDEVELOPER, InheritanceStrategy : new-table]
2006-03-28 02:09:21,597 [main] INFO  SCHEMA                         - Managing Persistence of Class : org.apache.maven.continuum.model.project.ProjectNotifier [Table : PROJECTNOTIFIER, InheritanceStrategy : new-table]
2006-03-28 02:09:21,597 [main] INFO  SCHEMA                         - Managing Persistence of Class : org.apache.maven.continuum.model.project.ProjectGroup [Table : PROJECTGROUP, InheritanceStrategy : new-table]
2006-03-28 02:09:21,598 [main] INFO  SCHEMA                         - Managing Persistence of Class : org.apache.maven.continuum.model.project.Project [Table : PROJECT, InheritanceStrategy : new-table]
2006-03-28 02:09:21,598 [main] INFO  SCHEMA                         - Managing Persistence of Class : org.apache.maven.continuum.model.system.Permission [Table : PERMISSION, InheritanceStrategy : new-table]
2006-03-28 02:09:21,599 [main] INFO  SCHEMA                         - Managing Persistence of Class : org.apache.maven.continuum.model.system.UserGroup [Table : USERGROUP, InheritanceStrategy : new-table]
2006-03-28 02:09:21,599 [main] INFO  SCHEMA                         - Managing Persistence of Class : org.apache.maven.continuum.model.system.NotificationAddress [Table : NOTIFICATIONADDRESS, InheritanceStrategy : new-table]
2006-03-28 02:09:21,601 [main] INFO  SCHEMA                         - Managing Persistence of Class : org.apache.maven.continuum.model.system.ContinuumUser [Table : CONTINUUMUSER, InheritanceStrategy : new-table]
2006-03-28 02:09:21,602 [main] INFO  SCHEMA                         - Managing Persistence of Class : org.apache.maven.continuum.model.system.SystemConfiguration [Table : SYSTEMCONFIGURATION, InheritanceStrategy : new-table]
2006-03-28 02:09:21,604 [main] INFO  SCHEMA                         - Managing Persistence of Field : org.apache.maven.continuum.model.project.ProjectNotifier.configuration [Table : PROJECTNOTIFIER_CONFIGURATION]
2006-03-28 02:09:21,606 [main] INFO  SCHEMA                         - Managing Persistence of Field : org.apache.maven.continuum.model.system.UserGroup.permissions [Table : USERGROUP_PERMISSIONS]
2006-03-28 02:09:21,608 [main] INFO  SCHEMA                         - Managing Persistence of Field : org.apache.maven.continuum.model.project.ProjectGroup.buildDefinitions [Table : PROJECTGROUP_BUILDDEFINITIONS]
2006-03-28 02:09:21,608 [main] INFO  SCHEMA                         - Managing Persistence of Field : org.apache.maven.continuum.model.project.ProjectGroup.notifiers [Table : PROJECTGROUP_NOTIFIERS]
2006-03-28 02:09:21,609 [main] INFO  SCHEMA                         - Managing Persistence of Field : org.apache.maven.continuum.model.system.NotificationAddress.configuration [Table : NOTIFICATIONADDRESS_CONFIGURATION]
2006-03-28 02:09:21,693 [main] INFO  SCHEMA                         - Managing Persistence of Field : org.apache.maven.continuum.model.project.Project.buildDefinitions [Table : PROJECT_BUILDDEFINITIONS]
2006-03-28 02:09:21,696 [main] INFO  SCHEMA                         - Managing Persistence of Field : org.apache.maven.continuum.model.project.Project.notifiers [Table : PROJECT_NOTIFIERS]
2006-03-28 02:09:21,698 [main] INFO  SCHEMA                         - Managing Persistence of Field : org.apache.maven.continuum.model.system.ContinuumUser.notificationAddresses [Table : CONTINUUMUSER_NOTIFICATIONADDRESSES]
2006-03-28 02:09:21,754 [main] WARN  RDBMS                          - Column BUILDDEFINITION.LATEST_BUILD_ID should not allow nulls but does. You can prevent nulls by specifying "allows-null" as "false" for the <field> in the MetaData
2006-03-28 02:09:21,929 [main] INFO  RDBMS                          - Validated 1 unique key(s) for table CHANGEFILE
2006-03-28 02:09:21,945 [main] INFO  RDBMS                          - Validated 1 foreign key(s) for table CHANGEFILE
2006-03-28 02:09:21,955 [main] INFO  RDBMS                          - Validated 1 unique key(s) for table BUILDDEFINITION
2006-03-28 02:09:21,965 [main] INFO  RDBMS                          - Validated 2 foreign key(s) for table BUILDDEFINITION
2006-03-28 02:09:21,979 [main] INFO  RDBMS                          - Validated 1 unique key(s) for table PROJECTNOTIFIER
2006-03-28 02:09:21,990 [main] INFO  RDBMS                          - Validated 1 unique key(s) for table USERGROUP
2006-03-28 02:09:22,002 [main] INFO  RDBMS                          - Validated 1 unique key(s) for table CHANGESET
2006-03-28 02:09:22,008 [main] INFO  RDBMS                          - Validated 1 foreign key(s) for table CHANGESET
2006-03-28 02:09:22,021 [main] INFO  RDBMS                          - Validated 1 unique key(s) for table PROJECTGROUP
2006-03-28 02:09:22,034 [main] INFO  RDBMS                          - Validated 1 unique key(s) for table NOTIFICATIONADDRESS
2006-03-28 02:09:22,046 [main] INFO  RDBMS                          - Validated 1 unique key(s) for table SCMRESULT
2006-03-28 02:09:22,065 [main] INFO  RDBMS                          - Validated 1 unique key(s) for table BUILDRESULT
2006-03-28 02:09:22,075 [main] INFO  RDBMS                          - Validated 2 foreign key(s) for table BUILDRESULT
2006-03-28 02:09:22,087 [main] INFO  RDBMS                          - Validated 1 unique key(s) for table SYSTEMCONFIGURATION
2006-03-28 02:09:22,111 [main] INFO  RDBMS                          - Validated 1 unique key(s) for table PROJECTDEVELOPER
2006-03-28 02:09:22,119 [main] INFO  RDBMS                          - Validated 1 foreign key(s) for table PROJECTDEVELOPER
2006-03-28 02:09:22,128 [main] INFO  RDBMS                          - Validated 1 unique key(s) for table PERMISSION
2006-03-28 02:09:22,139 [main] INFO  RDBMS                          - Validated 1 unique key(s) for table SCHEDULE
2006-03-28 02:09:22,150 [main] INFO  RDBMS                          - Validated 1 unique key(s) for table INSTALLATION
2006-03-28 02:09:22,162 [main] INFO  RDBMS                          - Validated 1 unique key(s) for table PROJECT
2006-03-28 02:09:22,172 [main] INFO  RDBMS                          - Validated 3 foreign key(s) for table PROJECT
2006-03-28 02:09:22,183 [main] INFO  RDBMS                          - Validated 1 unique key(s) for table PROJECTDEPENDENCY
2006-03-28 02:09:22,194 [main] INFO  RDBMS                          - Validated 1 foreign key(s) for table PROJECTDEPENDENCY
2006-03-28 02:09:22,201 [main] INFO  RDBMS                          - Validated 1 unique key(s) for table CONTINUUMUSER
2006-03-28 02:09:22,205 [main] INFO  RDBMS                          - Validated 1 foreign key(s) for table CONTINUUMUSER
2006-03-28 02:09:22,212 [main] INFO  RDBMS                          - Validated 1 unique key(s) for table PROFILE
2006-03-28 02:09:22,219 [main] INFO  RDBMS                          - Validated 2 foreign key(s) for table PROFILE
2006-03-28 02:09:22,227 [main] INFO  RDBMS                          - Validated 1 unique key(s) for table CONTINUUMUSER_NOTIFICATIONADDRESSES
2006-03-28 02:09:22,235 [main] INFO  RDBMS                          - Validated 2 foreign key(s) for table CONTINUUMUSER_NOTIFICATIONADDRESSES
2006-03-28 02:09:22,244 [main] INFO  RDBMS                          - Validated 1 unique key(s) for table PROJECT_NOTIFIERS
2006-03-28 02:09:22,253 [main] INFO  RDBMS                          - Validated 2 foreign key(s) for table PROJECT_NOTIFIERS
2006-03-28 02:09:22,268 [main] INFO  RDBMS                          - Validated 1 unique key(s) for table PROJECT_BUILDDEFINITIONS
2006-03-28 02:09:22,276 [main] INFO  RDBMS                          - Validated 2 foreign key(s) for table PROJECT_BUILDDEFINITIONS
2006-03-28 02:09:22,287 [main] INFO  RDBMS                          - Validated 1 unique key(s) for table USERGROUP_PERMISSIONS
2006-03-28 02:09:22,291 [main] INFO  RDBMS                          - Validated 2 foreign key(s) for table USERGROUP_PERMISSIONS
2006-03-28 02:09:22,298 [main] INFO  RDBMS                          - Validated 1 unique key(s) for table NOTIFICATIONADDRESS_CONFIGURATION
2006-03-28 02:09:22,301 [main] INFO  RDBMS                          - Validated 1 foreign key(s) for table NOTIFICATIONADDRESS_CONFIGURATION
2006-03-28 02:09:22,308 [main] INFO  RDBMS                          - Validated 1 unique key(s) for table PROJECTNOTIFIER_CONFIGURATION
2006-03-28 02:09:22,313 [main] INFO  RDBMS                          - Validated 1 foreign key(s) for table PROJECTNOTIFIER_CONFIGURATION
2006-03-28 02:09:22,323 [main] INFO  RDBMS                          - Validated 1 unique key(s) for table PROJECTGROUP_NOTIFIERS
2006-03-28 02:09:22,328 [main] INFO  RDBMS                          - Validated 2 foreign key(s) for table PROJECTGROUP_NOTIFIERS
2006-03-28 02:09:22,335 [main] INFO  RDBMS                          - Validated 1 unique key(s) for table PROJECTGROUP_BUILDDEFINITIONS
2006-03-28 02:09:22,339 [main] INFO  RDBMS                          - Validated 2 foreign key(s) for table PROJECTGROUP_BUILDDEFINITIONS
2006-03-28 02:09:22,344 [main] INFO  SCHEMA                         - Catalog "", Schema "SA" initialised - managing 26 classes
2006-03-28 02:09:22,357 [main] INFO  Continuum                      - Starting Continuum.
2006-03-28 02:09:22,358 [main] INFO  Continuum                      - 
2006-03-28 02:09:22,358 [main] INFO  Continuum                      - 
2006-03-28 02:09:22,359 [main] INFO  Continuum                      - < Continuum 1.0.3-SNAPSHOT started! >
2006-03-28 02:09:22,359 [main] INFO  Continuum                      - -------------------------------------
2006-03-28 02:09:22,359 [main] INFO  Continuum                      -        \   ^__^
2006-03-28 02:09:22,359 [main] INFO  Continuum                      -         \  (oo)\_______
2006-03-28 02:09:22,359 [main] INFO  Continuum                      -            (__)\       )\/\
2006-03-28 02:09:22,359 [main] INFO  Continuum                      -                ||----w |
2006-03-28 02:09:22,359 [main] INFO  Continuum                      -                ||     ||
2006-03-28 02:09:22,360 [main] INFO  Continuum                      - 
2006-03-28 02:09:22,360 [main] INFO  Continuum                      - 
2006-03-28 02:09:22,360 [main] INFO  ContinuumInitializer           - Continuum initializer running ...
2006-03-28 02:09:22,523 [main] INFO  SchedulesActivator             - Activating schedules ...
2006-03-28 02:09:22,534 [main] INFO  SchedulesActivator             - Tue Mar 28 03:00:00 PST 2006
2006-03-28 02:09:22,534 [main] INFO  PlexusContainer                - Loading on start [role,roleHint]: [org.codehaus.plexus.taskqueue.execution.TaskQueueExecutor,build-project]
2006-03-28 02:09:22,553 [main] ERROR VelocityComponent              - ResourceManager : unable to find resource 'CommonMacros.vm' in any resource loader.
2006-03-28 02:09:22,555 [main] INFO  Notifier:mail                  - The from mailbox is not configured, will use the nag email address from the project.
2006-03-28 02:09:22,555 [main] INFO  Notifier:mail                  - From name: Continuum@cheddar.simulalabs.com
2006-03-28 02:09:22,555 [main] INFO  Notifier:mail                  - Build host name: cheddar.simulalabs.com
2006-03-28 02:09:22,557 [main] INFO  RecipientSource                - To override address is not configured, will use the nag email address from the project.
2006-03-28 02:09:22,557 [main] INFO  TaskQueueExecutor:build-project - Starting task executor, thread name 'build-project'.
2006-03-28 02:09:22,557 [main] INFO  PlexusContainer                - Loading on start [role,roleHint]: [org.codehaus.plexus.taskqueue.execution.TaskQueueExecutor,check-out-project]
2006-03-28 02:09:22,558 [main] INFO  TaskQueueExecutor:check-out-project - Starting task executor, thread name 'check-out-project'.
-------------------------------------------------------------------------------
[2006.03.28 02:09:22] Integration test settings
-------------------------------------------------------------------------------
[2006.03.28 02:09:22] IT root: /home/continuum/continuum-maven/working-directory/149/target/it
[2006.03.28 02:09:22] Remoting method: jvm
[2006.03.28 02:09:22] Store implementation: class org.apache.maven.continuum.store.JdoContinuumStore
-------------------------------------------------------------------------------
[2006.03.28 02:09:22] Connecting to and starting Continuum
[2006.03.28 02:09:22] Removing all existing projects from Continuum.
[2006.03.28 02:09:22] Initializing Maven 1 CVS project
[2006.03.28 02:09:22] Adding Maven 1 project
2006-03-28 02:09:22,648 [main] INFO  ContinuumProjectBuilder:maven-one-builder - Downloading file:/home/continuum/continuum-maven/working-directory/149/target/it/maven-1/project.xml
2006-03-28 02:09:22,654 [main] INFO  Continuum                      - Created 1 projects.
2006-03-28 02:09:22,655 [main] INFO  Continuum                      - Created 1 project groups.
2006-03-28 02:09:22,655 [main] INFO  Continuum                      - 0 warnings.
2006-03-28 02:09:22,667 [main] INFO  Continuum                      - Using existing project group with the group id: 'continuum'.
2006-03-28 02:09:23,109 [Thread-74] INFO  ContinuumScm                   - Checking out project: 'Maven 1 Project', id: '11' to '/home/continuum/continuum-maven/working-directory/149/target/working-directory/11'.
2006-03-28 02:09:23,110 [Thread-74] INFO  ScmManager                     - Executing: cvs -z3 -f -d /home/continuum/continuum-maven/working-directory/149/target/it/cvs-root -q checkout -d 11 maven-1
2006-03-28 02:09:23,111 [Thread-74] INFO  ScmManager                     - Working directory: /home/continuum/continuum-maven/working-directory/149/target/working-directory
2006-03-28 02:09:23,151 [Thread-79] DEBUG ScmManager                     - U 11/project.xml
2006-03-28 02:09:23,155 [Thread-79] DEBUG ScmManager                     - U 11/src/main/java/Foo.java
2006-03-28 02:09:24,001 [Thread-74] INFO  ContinuumScm                   - Checked out 2 files.
[2006.03.28 02:09:25] Building Maven 1 project
2006-03-28 02:09:25,057 [main] INFO  Continuum                      - Enqueuing 'Maven 1 Project' (Build definition id=11).
2006-03-28 02:09:25,135 [Thread-73] WARN  SQL                            - Object with id "0" not found !
2006-03-28 02:09:25,197 [Thread-73] INFO  ContinuumScm                   - Updating project: id: '11', name 'Maven 1 Project'.
2006-03-28 02:09:25,203 [Thread-73] INFO  ScmManager                     - Executing: cvs -z3 -f -d /home/continuum/continuum-maven/working-directory/149/target/it/cvs-root -q update -d
2006-03-28 02:09:25,203 [Thread-73] INFO  ScmManager                     - Working directory: /home/continuum/continuum-maven/working-directory/149/target/working-directory/11
2006-03-28 02:09:25,270 [Thread-73] INFO  Action:update-project-from-working-directory - Updating project 'Maven 1 Project' from checkout.
2006-03-28 02:09:25,459 [Thread-73] WARN  ContinuumBuildExecutor:maven-1 - Could not find the executable 'maven' in this path: 
2006-03-28 02:09:25,460 [Thread-73] WARN  ContinuumBuildExecutor:maven-1 - Executable 'maven'.
2006-03-28 02:09:25,460 [Thread-73] INFO  ContinuumBuildExecutor:maven-1 - Arguments:  clean:clean jar:install
2006-03-28 02:09:25,460 [Thread-73] INFO  ContinuumBuildExecutor:maven-1 - Working directory: /home/continuum/continuum-maven/working-directory/149/target/working-directory/11
2006-03-28 02:09:30,042 [Thread-73] INFO  ContinuumBuildExecutor:maven-1 - Exit code: 0
[2006.03.28 02:09:30] Testing that the POM is updated before each build.
2006-03-28 02:09:30,189 [Thread-73] INFO  Notifier:mail                  - Sending message: From '"Continuum@cheddar.simulalabs.com" <continuum@localhost>'.
2006-03-28 02:09:30,189 [Thread-73] INFO  Notifier:mail                  - Recipient: To '<continuum@localhost>'.
DEBUG: setDebug: JavaMail version 1.3.2
DEBUG: getProvider() returning javax.mail.Provider[TRANSPORT,smtp,com.sun.mail.smtp.SMTPTransport,Sun Microsystems, Inc]
DEBUG SMTP: useEhlo true, useAuth false
DEBUG SMTP: trying to connect to host "localhost", port 25, isSSL false
220 ci.codehaus.org ESMTP
DEBUG SMTP: connected to host "localhost", port: 25

EHLO cheddar.simulalabs.com
250-ci.codehaus.org
250-PIPELINING
250 8BITMIME
DEBUG SMTP: Found extension "PIPELINING", arg ""
DEBUG SMTP: Found extension "8BITMIME", arg ""
DEBUG SMTP: use8bit false
MAIL FROM:<continuum@localhost>
250 ok
RCPT TO:<continuum@localhost>
250 ok
DEBUG SMTP: Verified Addresses
DEBUG SMTP:   continuum@localhost
DATA
354 go ahead
Message-ID: <7306220.1143540570199.JavaMail.continuum@cheddar.simulalabs.com>
Date: Tue, 28 Mar 06 02:09:30 -0800
From: "Continuum@cheddar.simulalabs.com" <continuum@localhost>
To: continuum@localhost
Subject: [continuum] BUILD SUCCESSFUL: Maven 1 Project
MIME-Version: 1.0
Content-Type: text/plain; charset=us-ascii
Content-Transfer-Encoding: 7bit

Online report : /target/ProjectBuild.vm/view/ProjectBuild/id/11/buildId/16
Build statistics:
  State: Ok
  Previous Build: No previous build.
  Started at: Tue, 28 Mar 2006 02:09:25 -0800
  Finished at: Tue, 28 Mar 2006 02:09:30 -0800
  Total time: 4s
  Build Trigger: Schedule
  Exit code: 0
  Building machine hostname: cheddar.simulalabs.com
  Operating system : Linux(unknown)
  Java version : 1.5.0_03(Sun Microsystems Inc.)

Changes
      No files changed
  
****************************************************************************
Output:
****************************************************************************
 __  __
|  \/  |__ _Apache__ ___
| |\/| / _` \ V / -_) ' \  ~ intelligent projects ~
|_|  |_\__,_|\_/\___|_||_|  v. 1.0.2

[MethodExpression] Cannot evaluate expression
java.lang.reflect.InvocationTargetException
	at sun.reflect.NativeMethodAccessorImpl.invoke0(Native Method)
	at sun.reflect.NativeMethodAccessorImpl.invoke(NativeMethodAccessorImpl.java:39)
	at sun.reflect.DelegatingMethodAccessorImpl.invoke(DelegatingMethodAccessorImpl.java:25)
	at java.lang.reflect.Method.invoke(Method.java:585)
	at org.apache.commons.betwixt.expression.MethodExpression.evaluate(MethodExpression.java:96)
	at org.apache.commons.betwixt.io.AbstractBeanWriter.writeContent(AbstractBeanWriter.java:658)
	at org.apache.commons.betwixt.io.AbstractBeanWriter.writeRestOfElement(AbstractBeanWriter.java:539)
	at org.apache.commons.betwixt.io.AbstractBeanWriter.write(AbstractBeanWriter.java:481)
	at org.apache.commons.betwixt.io.AbstractBeanWriter.writeContent(AbstractBeanWriter.java:643)
	at org.apache.commons.betwixt.io.AbstractBeanWriter.writeRestOfElement(AbstractBeanWriter.java:539)
	at org.apache.commons.betwixt.io.AbstractBeanWriter.write(AbstractBeanWriter.java:513)
	at org.apache.commons.betwixt.io.AbstractBeanWriter.write(AbstractBeanWriter.java:233)
	at org.apache.commons.betwixt.io.AbstractBeanWriter.writeContent(AbstractBeanWriter.java:630)
	at org.apache.commons.betwixt.io.AbstractBeanWriter.writeRestOfElement(AbstractBeanWriter.java:539)
	at org.apache.commons.betwixt.io.AbstractBeanWriter.write(AbstractBeanWriter.java:513)
	at org.apache.commons.betwixt.io.AbstractBeanWriter.write(AbstractBeanWriter.java:233)
	at org.apache.commons.betwixt.io.AbstractBeanWriter.write(AbstractBeanWriter.java:162)
	at org.apache.commons.betwixt.io.BeanWriter.write(BeanWriter.java:217)
	at org.apache.maven.MavenUtils.getProjectString(MavenUtils.java:432)
	at org.apache.maven.MavenUtils.getInterpolatedPOM(MavenUtils.java:383)
	at org.apache.maven.MavenUtils.getJellyProject(MavenUtils.java:360)
	at org.apache.maven.MavenUtils.getProject(MavenUtils.java:144)
	at org.apache.maven.MavenUtils.getProject(MavenUtils.java:122)
	at org.apache.maven.MavenSession.initializeRootProject(MavenSession.java:232)
	at org.apache.maven.MavenSession.initialize(MavenSession.java:172)
	at org.apache.maven.cli.App.doMain(App.java:475)
	at org.apache.maven.cli.App.main(App.java:1239)
	at sun.reflect.NativeMethodAccessorImpl.invoke0(Native Method)
	at sun.reflect.NativeMethodAccessorImpl.invoke(NativeMethodAccessorImpl.java:39)
	at sun.reflect.DelegatingMethodAccessorImpl.invoke(DelegatingMethodAccessorImpl.java:25)
	at java.lang.reflect.Method.invoke(Method.java:585)
	at com.werken.forehead.Forehead.run(Forehead.java:551)
	at com.werken.forehead.Forehead.main(Forehead.java:581)
Caused by: java.lang.IllegalArgumentException: cvs repository connection string doesn't contain six tokens
	at org.apache.maven.project.Repository.splitSCMConnection(Repository.java:258)
	at org.apache.maven.project.Repository.getCvsModule(Repository.java:216)
	at org.apache.maven.project.Repository.getCvsModule(Repository.java:144)
	... 33 more
[MethodExpression] Cannot evaluate expression
java.lang.reflect.InvocationTargetException
	at sun.reflect.NativeMethodAccessorImpl.invoke0(Native Method)
	at sun.reflect.NativeMethodAccessorImpl.invoke(NativeMethodAccessorImpl.java:39)
	at sun.reflect.DelegatingMethodAccessorImpl.invoke(DelegatingMethodAccessorImpl.java:25)
	at java.lang.reflect.Method.invoke(Method.java:585)
	at org.apache.commons.betwixt.expression.MethodExpression.evaluate(MethodExpression.java:96)
	at org.apache.commons.betwixt.io.AbstractBeanWriter.writeContent(AbstractBeanWriter.java:658)
	at org.apache.commons.betwixt.io.AbstractBeanWriter.writeRestOfElement(AbstractBeanWriter.java:539)
	at org.apache.commons.betwixt.io.AbstractBeanWriter.write(AbstractBeanWriter.java:481)
	at org.apache.commons.betwixt.io.AbstractBeanWriter.writeContent(AbstractBeanWriter.java:643)
	at org.apache.commons.betwixt.io.AbstractBeanWriter.writeRestOfElement(AbstractBeanWriter.java:539)
	at org.apache.commons.betwixt.io.AbstractBeanWriter.write(AbstractBeanWriter.java:513)
	at org.apache.commons.betwixt.io.AbstractBeanWriter.write(AbstractBeanWriter.java:233)
	at org.apache.commons.betwixt.io.AbstractBeanWriter.writeContent(AbstractBeanWriter.java:630)
	at org.apache.commons.betwixt.io.AbstractBeanWriter.writeRestOfElement(AbstractBeanWriter.java:539)
	at org.apache.commons.betwixt.io.AbstractBeanWriter.write(AbstractBeanWriter.java:513)
	at org.apache.commons.betwixt.io.AbstractBeanWriter.write(AbstractBeanWriter.java:233)
	at org.apache.commons.betwixt.io.AbstractBeanWriter.write(AbstractBeanWriter.java:162)
	at org.apache.commons.betwixt.io.BeanWriter.write(BeanWriter.java:217)
	at org.apache.maven.MavenUtils.getProjectString(MavenUtils.java:432)
	at org.apache.maven.MavenUtils.getInterpolatedPOM(MavenUtils.java:383)
	at org.apache.maven.MavenUtils.getJellyProject(MavenUtils.java:360)
	at org.apache.maven.MavenUtils.getProject(MavenUtils.java:144)
	at org.apache.maven.MavenUtils.getProject(MavenUtils.java:122)
	at org.apache.maven.MavenSession.initializeRootProject(MavenSession.java:232)
	at org.apache.maven.MavenSession.initialize(MavenSession.java:172)
	at org.apache.maven.cli.App.doMain(App.java:475)
	at org.apache.maven.cli.App.main(App.java:1239)
	at sun.reflect.NativeMethodAccessorImpl.invoke0(Native Method)
	at sun.reflect.NativeMethodAccessorImpl.invoke(NativeMethodAccessorImpl.java:39)
	at sun.reflect.DelegatingMethodAccessorImpl.invoke(DelegatingMethodAccessorImpl.java:25)
	at java.lang.reflect.Method.invoke(Method.java:585)
	at com.werken.forehead.Forehead.run(Forehead.java:551)
	at com.werken.forehead.Forehead.main(Forehead.java:581)
Caused by: java.lang.IllegalArgumentException: cvs repository connection string doesn't contain six tokens
	at org.apache.maven.project.Repository.splitSCMConnection(Repository.java:258)
	at org.apache.maven.project.Repository.getCvsRoot(Repository.java:187)
	at org.apache.maven.project.Repository.getCvsRoot(Repository.java:129)
	... 33 more
[MethodExpression] Cannot evaluate expression
java.lang.reflect.InvocationTargetException
	at sun.reflect.NativeMethodAccessorImpl.invoke0(Native Method)
	at sun.reflect.NativeMethodAccessorImpl.invoke(NativeMethodAccessorImpl.java:39)
	at sun.reflect.DelegatingMethodAccessorImpl.invoke(DelegatingMethodAccessorImpl.java:25)
	at java.lang.reflect.Method.invoke(Method.java:585)
	at org.apache.commons.betwixt.expression.MethodExpression.evaluate(MethodExpression.java:96)
	at org.apache.commons.betwixt.io.AbstractBeanWriter.writeContent(AbstractBeanWriter.java:658)
	at org.apache.commons.betwixt.io.AbstractBeanWriter.writeRestOfElement(AbstractBeanWriter.java:539)
	at org.apache.commons.betwixt.io.AbstractBeanWriter.write(AbstractBeanWriter.java:481)
	at org.apache.commons.betwixt.io.AbstractBeanWriter.writeContent(AbstractBeanWriter.java:643)
	at org.apache.commons.betwixt.io.AbstractBeanWriter.writeRestOfElement(AbstractBeanWriter.java:539)
	at org.apache.commons.betwixt.io.AbstractBeanWriter.write(AbstractBeanWriter.java:513)
	at org.apache.commons.betwixt.io.AbstractBeanWriter.write(AbstractBeanWriter.java:233)
	at org.apache.commons.betwixt.io.AbstractBeanWriter.writeContent(AbstractBeanWriter.java:630)
	at org.apache.commons.betwixt.io.AbstractBeanWriter.writeRestOfElement(AbstractBeanWriter.java:539)
	at org.apache.commons.betwixt.io.AbstractBeanWriter.write(AbstractBeanWriter.java:513)
	at org.apache.commons.betwixt.io.AbstractBeanWriter.write(AbstractBeanWriter.java:233)
	at org.apache.commons.betwixt.io.AbstractBeanWriter.write(AbstractBeanWriter.java:162)
	at org.apache.commons.betwixt.io.BeanWriter.write(BeanWriter.java:217)
	at org.apache.maven.MavenUtils.getProjectString(MavenUtils.java:432)
	at org.apache.maven.MavenUtils.getInterpolatedPOM(MavenUtils.java:383)
	at org.apache.maven.MavenUtils.getJellyProject(MavenUtils.java:360)
	at org.apache.maven.MavenUtils.getProject(MavenUtils.java:144)
	at org.apache.maven.MavenUtils.getProject(MavenUtils.java:122)
	at org.apache.maven.MavenSession.initializeRootProject(MavenSession.java:232)
	at org.apache.maven.MavenSession.initialize(MavenSession.java:172)
	at org.apache.maven.cli.App.doMain(App.java:475)
	at org.apache.maven.cli.App.main(App.java:1239)
	at sun.reflect.NativeMethodAccessorImpl.invoke0(Native Method)
	at sun.reflect.NativeMethodAccessorImpl.invoke(NativeMethodAccessorImpl.java:39)
	at sun.reflect.DelegatingMethodAccessorImpl.invoke(DelegatingMethodAccessorImpl.java:25)
	at java.lang.reflect.Method.invoke(Method.java:585)
	at com.werken.forehead.Forehead.run(Forehead.java:551)
	at com.werken.forehead.Forehead.main(Forehead.java:581)
Caused by: java.lang.IllegalArgumentException: cvs repository connection string doesn't contain six tokens
	at org.apache.maven.project.Repository.splitSCMConnection(Repository.java:258)
	at org.apache.maven.project.Repository.getScmType(Repository.java:115)
	... 33 more
build:start:

clean:clean:

java:prepare-filesystem:
    [mkdir] Created dir: /home/continuum/continuum-maven/working-directory/149/target/working-directory/11/target/classes

java:compile:
    [echo] Compiling to /home/continuum/continuum-maven/working-directory/149/target/working-directory/11/target/classes
    [echo] No java source files to compile.

java:jar-resources:

test:prepare-filesystem:
    [mkdir] Created dir: /home/continuum/continuum-maven/working-directory/149/target/working-directory/11/target/test-classes
    [mkdir] Created dir: /home/continuum/continuum-maven/working-directory/149/target/working-directory/11/target/test-reports

test:test-resources:

test:compile:
    [echo] No test source files to compile.

test:test:
    [echo] No tests to run.

jar:jar:
    [jar] Building jar: /home/continuum/continuum-maven/working-directory/149/target/working-directory/11/target/maven-1-1.0.jar
Copying: from '/home/continuum/continuum-maven/working-directory/149/target/working-directory/11/target/maven-1-1.0.jar' to: '/usr/local/maven_home_local/repository/continuum/jars/maven-1-1.0.jar'
Copying: from '/home/continuum/continuum-maven/working-directory/149/target/working-directory/11/project.xml' to: '/usr/local/maven_home_local/repository/continuum/poms/maven-1-1.0.pom'
BUILD SUCCESSFUL
Total time: 3 seconds
Finished at: Tue Mar 28 02:09:29 PST 2006


****************************************************************************


.
250 ok 1143540570 qp 3294
QUIT
2006-03-28 02:09:32,008 [main] INFO  Continuum                      - Remove project Maven 1 Project(11)
2006-03-28 02:09:32,185 [main] WARN  SQL                            - Object with id "11" not found !
[2006.03.28 02:09:32] Tearing down test - ignore any interrupted exceptions
2006-03-28 02:09:32,186 [main] INFO  TaskQueueExecutor:check-out-project - Executor thread got shutdown signal.
2006-03-28 02:09:32,187 [Thread-74] INFO  TaskQueueExecutor:check-out-project - Executor thread 'check-out-project' exited.
There was no such logger 'org.apache.maven.plugin.MavenPluginCollector' 7724461.
There was no such logger 'org.apache.maven.continuum.execution.ContinuumBuildExecutor:shell' 7724461.
There was no such logger 'org.codehaus.plexus.taskqueue.TaskQueue:check-out-project' 7724461.
There was no such logger 'org.apache.maven.continuum.buildcontroller.BuildController' 7724461.
There was no such logger 'org.apache.maven.continuum.scm.ContinuumScm' 7724461.
There was no such logger 'org.apache.maven.continuum.utils.WorkingDirectoryService' 7724461.
There was no such logger 'org.apache.maven.artifact.resolver.ArtifactResolver' 7724461.
There was no such logger 'org.apache.maven.continuum.project.builder.ContinuumProjectBuilder:maven-two-builder' 7724461.
There was no such logger 'org.apache.maven.continuum.execution.manager.BuildExecutorManager' 7724461.
There was no such logger 'org.codehaus.plexus.notification.RecipientSource' 7724461.
There was no such logger 'org.apache.maven.continuum.initialization.ContinuumInitializer' 7724461.
There was no such logger 'org.apache.maven.continuum.build.settings.SchedulesActivator' 7724461.
There was no such logger 'org.apache.maven.continuum.execution.ContinuumBuildExecutor:maven-1' 7724461.
There was no such logger 'org.codehaus.plexus.jdo.JdoFactory' 7724461.
There was no such logger 'org.codehaus.plexus.notification.notifier.Notifier:jabber' 7724461.
There was no such logger 'org.apache.maven.continuum.execution.maven.m1.MavenOneMetadataHelper' 7724461.
There was no such logger 'org.codehaus.plexus.taskqueue.TaskViabilityEvaluator:build-project' 7724461.
There was no such logger 'org.apache.maven.artifact.deployer.ArtifactDeployer' 7724461.
There was no such logger 'org.codehaus.plexus.notification.notifier.Notifier:mail' 7724461.
There was no such logger 'org.apache.maven.artifact.transform.ArtifactTransformation:snapshot' 7724461.
There was no such logger 'org.codehaus.plexus.msn.MsnClient' 7724461.
There was no such logger 'org.codehaus.plexus.notification.notifier.Notifier:msn' 7724461.
There was no such logger 'org.apache.maven.artifact.manager.WagonManager' 7724461.
2006-03-28 02:09:32,193 [main] INFO  TaskQueueExecutor:build-project - Executor thread got shutdown signal.
2006-03-28 02:09:32,194 [Thread-73] INFO  TaskQueueExecutor:build-project - Executor thread 'build-project' exited.
There was no such logger 'org.codehaus.plexus.taskqueue.execution.TaskQueueExecutor:build-project' 7724461.
There was no such logger 'org.codehaus.plexus.action.Action:check-working-directory' 7724461.
There was no such logger 'org.apache.maven.profiles.MavenProfilesBuilder' 7724461.
There was no such logger 'org.apache.maven.continuum.store.ContinuumStore:jdo' 7724461.
There was no such logger 'org.codehaus.plexus.commandline.ExecutableResolver' 7724461.
2006-03-28 02:09:32,198 [main] INFO  Continuum                      - Stopping Continuum.
2006-03-28 02:09:32,198 [main] INFO  Continuum                      - Continuum stopped.
There was no such logger 'org.apache.maven.continuum.Continuum' 7724461.
There was no such logger 'org.codehaus.plexus.action.Action:create-projects-from-metadata' 7724461.
There was no such logger 'org.codehaus.plexus.taskqueue.execution.TaskExecutor:check-out-project' 7724461.
There was no such logger 'org.codehaus.plexus.action.Action:update-working-directory-from-scm' 7724461.
There was no such logger 'org.codehaus.plexus.ircbot.IrcBot' 7724461.
There was no such logger 'org.apache.maven.continuum.configuration.ConfigurationService' 7724461.
There was no such logger 'org.apache.maven.continuum.execution.maven.m2.MavenBuilderHelper' 7724461.
There was no such logger 'org.apache.maven.continuum.project.builder.manager.ContinuumProjectBuilderManager' 7724461.
There was no such logger 'org.codehaus.plexus.notification.notifier.Notifier:irc' 7724461.
There was no such logger 'org.apache.maven.continuum.project.builder.ContinuumProjectBuilder:maven-one-builder' 7724461.
There was no such logger 'org.codehaus.plexus.notification.notifier.manager.NotifierManager' 7724461.
There was no such logger 'org.codehaus.plexus.velocity.VelocityComponent' 7724461.
There was no such logger 'org.codehaus.plexus.action.Action:add-project-to-checkout-queue' 7724461.
There was no such logger 'org.codehaus.plexus.action.Action:checkout-project' 7724461.
There was no such logger 'org.apache.maven.settings.MavenSettingsBuilder' 7724461.
There was no such logger 'org.codehaus.plexus.action.ActionManager' 7724461.
There was no such logger 'org.codehaus.plexus.mailsender.MailSender' 7724461.
There was no such logger 'org.apache.maven.continuum.execution.ContinuumBuildExecutor:maven2' 7724461.
There was no such logger 'org.apache.maven.project.interpolation.ModelInterpolator' 7724461.
There was no such logger 'org.codehaus.plexus.notification.notifier.Notifier:console' 7724461.
There was no such logger 'org.apache.maven.continuum.utils.shell.ShellCommandHelper' 7724461.
There was no such logger 'org.codehaus.plexus.taskqueue.execution.TaskExecutor:build-project' 7724461.
There was no such logger 'org.codehaus.plexus.action.Action:store-checkout-scm-result' 7724461.
There was no such logger 'org.codehaus.plexus.action.Action:execute-builder' 7724461.
There was no such logger 'org.apache.maven.artifact.repository.metadata.RepositoryMetadataManager' 7724461.
There was no such logger 'org.apache.maven.artifact.transform.ArtifactTransformation:release' 7724461.
There was no such logger 'org.codehaus.plexus.jabber.JabberClient' 7724461.
Mar 28, 2006 2:09:32 AM org.quartz.core.QuartzScheduler shutdown
INFO: Scheduler defaultScheduler_$_NON_CLUSTERED shutting down.
Mar 28, 2006 2:09:32 AM org.quartz.core.QuartzScheduler pause
INFO: Scheduler defaultScheduler_$_NON_CLUSTERED paused.
Mar 28, 2006 2:09:32 AM org.quartz.core.QuartzScheduler shutdown
INFO: Scheduler defaultScheduler_$_NON_CLUSTERED shutdown complete.
There was no such logger 'org.codehaus.plexus.scheduler.Scheduler' 7724461.
There was no such logger 'org.apache.maven.continuum.notification.ContinuumNotificationDispatcher' 7724461.
There was no such logger 'org.codehaus.plexus.action.Action:deploy-artifact' 7724461.
There was no such logger 'org.apache.maven.project.MavenProjectBuilder' 7724461.
There was no such logger 'org.apache.maven.scm.manager.ScmManager' 7724461.
There was no such logger 'org.codehaus.plexus.action.Action:update-project-from-working-directory' 7724461.
There was no such logger 'org.apache.maven.artifact.transform.ArtifactTransformation:latest' 7724461.
[2006.03.28 02:09:32] Used 11359ms
[surefire] Tests run: 1, Failures: 0, Errors: 0, Time elapsed: 11.382 sec
[surefire] Running org.apache.maven.continuum.it.AntIntegrationTest
2006-03-28 02:09:32,404 [main] DEBUG PlexusContainer                - Found 3 components to load on start
2006-03-28 02:09:32,404 [main] INFO  PlexusContainer                - Loading on start [role]: [org.apache.maven.continuum.Continuum]
2006-03-28 02:09:32,405 [main] INFO  JdoFactory                     - Initializing JDO.
2006-03-28 02:09:32,405 [main] INFO  JDO                            - PersistenceManagerFactory - Vendor: JPOX  Version: 1.1.0-rc-1
2006-03-28 02:09:32,406 [main] INFO  JDO                            - PersistenceManagerFactory initialised for datastore URL=jdbc:derby:/home/continuum/continuum-maven/working-directory/149/target/level1/level2/plexus-home/database;create=true driver=org.apache.derby.jdbc.EmbeddedDriver userName=sa
Mar 28, 2006 2:09:32 AM org.quartz.simpl.RAMJobStore initialize
INFO: RAMJobStore initialized.
Mar 28, 2006 2:09:32 AM org.quartz.impl.StdSchedulerFactory instantiate
INFO: Quartz scheduler 'defaultScheduler' initialized from an externally provided properties instance.
Mar 28, 2006 2:09:32 AM org.quartz.impl.StdSchedulerFactory instantiate
INFO: Quartz scheduler version: 1.4.5
Mar 28, 2006 2:09:32 AM org.quartz.core.QuartzScheduler start
INFO: Scheduler defaultScheduler_$_NON_CLUSTERED started.
2006-03-28 02:09:32,417 [main] WARN  ContinuumBuildExecutor:ant     - Could not find the executable 'ant' in the path '[]'.
2006-03-28 02:09:32,418 [main] WARN  ContinuumBuildExecutor:maven-1 - Could not find the executable 'maven' in the path '[]'.
2006-03-28 02:09:32,457 [main] DEBUG MavenSettingsBuilder           - Building Maven global-level settings from: '/usr/local/maven-2.0.3-SNAPSHOT/conf/settings.xml'
2006-03-28 02:09:32,458 [main] DEBUG MavenSettingsBuilder           - Building Maven user-level settings from: '/home/continuum/.m2/settings.xml'
2006-03-28 02:09:32,532 [main] WARN  ContinuumBuildExecutor:maven2  - Could not find the executable 'mvn' in the path '[]'.
2006-03-28 02:09:32,533 [main] INFO  BuildExecutorManager           - Build executors:
2006-03-28 02:09:32,533 [main] INFO  BuildExecutorManager           -   maven-1
2006-03-28 02:09:32,533 [main] INFO  BuildExecutorManager           -   ant
2006-03-28 02:09:32,533 [main] INFO  BuildExecutorManager           -   maven2
2006-03-28 02:09:32,533 [main] INFO  BuildExecutorManager           -   shell
2006-03-28 02:09:32,533 [main] INFO  Continuum                      - Initializing Continuum.
2006-03-28 02:09:32,534 [main] INFO  Continuum                      - Showing all projects: 
2006-03-28 02:09:32,570 [main] INFO  RDBMS                          - RDBMS Adapter initialised : CloudscapeAdapter : Apache Derby version=10.1.2.1, major=10, minor=1, revision=2
Identifier Names : UPPERCASE 
Driver name=Apache Derby Embedded JDBC Driver, version=10.1.2.1, major=10, minor=1
Identifier Max Lengths : Table=128  Column=128  Constraint=18  Index=18  Delimeters="
Identifier Support in DDL : catalog=false  schema=true
2006-03-28 02:09:32,571 [main] INFO  SCHEMA                         - Initialising Catalog "", Schema "SA" using "SchemaTable" auto-start option
2006-03-28 02:09:32,784 [main] INFO  JDO                            - Managing Persistence of org.apache.maven.continuum.model.scm.ChangeFile since it was managed previously
2006-03-28 02:09:32,784 [main] INFO  JDO                            - Managing Persistence of org.apache.maven.continuum.model.project.BuildDefinition since it was managed previously
2006-03-28 02:09:32,784 [main] INFO  JDO                            - Managing Persistence of org.apache.maven.continuum.model.system.Permission since it was managed previously
2006-03-28 02:09:32,785 [main] INFO  JDO                            - Managing Persistence of org.apache.maven.continuum.model.system.Installation since it was managed previously
2006-03-28 02:09:32,785 [main] INFO  JDO                            - Managing Persistence of org.apache.maven.continuum.model.project.ProjectDependency since it was managed previously
2006-03-28 02:09:32,785 [main] INFO  JDO                            - Managing Persistence of org.apache.maven.continuum.model.scm.ScmResult since it was managed previously
2006-03-28 02:09:32,785 [main] INFO  JDO                            - Managing Persistence of org.apache.maven.continuum.model.project.Schedule since it was managed previously
2006-03-28 02:09:32,785 [main] INFO  JDO                            - Managing Persistence of org.apache.maven.continuum.model.project.ProjectNotifier since it was managed previously
2006-03-28 02:09:32,785 [main] INFO  JDO                            - Managing Persistence of org.apache.maven.continuum.model.system.NotificationAddress since it was managed previously
2006-03-28 02:09:32,785 [main] INFO  JDO                            - Managing Persistence of org.apache.maven.continuum.model.project.ProjectDeveloper since it was managed previously
2006-03-28 02:09:32,785 [main] INFO  JDO                            - Managing Persistence of org.apache.maven.continuum.model.system.UserGroup since it was managed previously
2006-03-28 02:09:32,786 [main] INFO  JDO                            - Managing Persistence of org.apache.maven.continuum.model.scm.ChangeSet since it was managed previously
2006-03-28 02:09:32,786 [main] INFO  JDO                            - Managing Persistence of org.apache.maven.continuum.model.project.ProjectGroup since it was managed previously
2006-03-28 02:09:32,786 [main] INFO  JDO                            - Managing Persistence of org.apache.maven.continuum.model.project.Profile since it was managed previously
2006-03-28 02:09:32,786 [main] INFO  JDO                            - Managing Persistence of org.apache.maven.continuum.model.system.ContinuumUser since it was managed previously
2006-03-28 02:09:32,786 [main] INFO  JDO                            - Managing Persistence of org.apache.maven.continuum.model.project.Project since it was managed previously
2006-03-28 02:09:32,786 [main] INFO  JDO                            - Managing Persistence of org.apache.maven.continuum.model.project.BuildResult since it was managed previously
2006-03-28 02:09:32,786 [main] INFO  JDO                            - Managing Persistence of org.apache.maven.continuum.model.system.SystemConfiguration since it was managed previously
2006-03-28 02:09:32,787 [main] INFO  MetaData                       - Parsing MetaData from file "file:/home/continuum/.m2/repository/org/apache/maven/continuum/continuum-model/1.0.3-SNAPSHOT/continuum-model-1.0.3-SNAPSHOT.jar!/META-INF/package.jdo"
2006-03-28 02:09:33,081 [main] INFO  SCHEMA                         - Managing Persistence of Class : org.apache.maven.continuum.model.scm.ChangeFile [Table : CHANGEFILE, InheritanceStrategy : new-table]
2006-03-28 02:09:33,082 [main] INFO  SCHEMA                         - Managing Persistence of Class : org.apache.maven.continuum.model.system.Installation [Table : INSTALLATION, InheritanceStrategy : new-table]
2006-03-28 02:09:33,082 [main] INFO  SCHEMA                         - Managing Persistence of Class : org.apache.maven.continuum.model.project.Profile [Table : PROFILE, InheritanceStrategy : new-table]
2006-03-28 02:09:33,082 [main] INFO  SCHEMA                         - Managing Persistence of Class : org.apache.maven.continuum.model.project.Schedule [Table : SCHEDULE, InheritanceStrategy : new-table]
2006-03-28 02:09:33,083 [main] INFO  SCHEMA                         - Managing Persistence of Class : org.apache.maven.continuum.model.project.BuildDefinition [Table : BUILDDEFINITION, InheritanceStrategy : new-table]
2006-03-28 02:09:33,083 [main] INFO  SCHEMA                         - Managing Persistence of Class : org.apache.maven.continuum.model.system.Permission [Table : PERMISSION, InheritanceStrategy : new-table]
2006-03-28 02:09:33,083 [main] INFO  SCHEMA                         - Managing Persistence of Class : org.apache.maven.continuum.model.project.ProjectDependency [Table : PROJECTDEPENDENCY, InheritanceStrategy : new-table]
2006-03-28 02:09:33,083 [main] INFO  SCHEMA                         - Managing Persistence of Class : org.apache.maven.continuum.model.scm.ChangeSet [Table : CHANGESET, InheritanceStrategy : new-table]
2006-03-28 02:09:33,083 [main] INFO  SCHEMA                         - Managing Persistence of Class : org.apache.maven.continuum.model.scm.ScmResult [Table : SCMRESULT, InheritanceStrategy : new-table]
2006-03-28 02:09:33,084 [main] INFO  SCHEMA                         - Managing Persistence of Class : org.apache.maven.continuum.model.project.ProjectNotifier [Table : PROJECTNOTIFIER, InheritanceStrategy : new-table]
2006-03-28 02:09:33,084 [main] INFO  SCHEMA                         - Managing Persistence of Class : org.apache.maven.continuum.model.system.NotificationAddress [Table : NOTIFICATIONADDRESS, InheritanceStrategy : new-table]
2006-03-28 02:09:33,084 [main] INFO  SCHEMA                         - Managing Persistence of Class : org.apache.maven.continuum.model.project.ProjectDeveloper [Table : PROJECTDEVELOPER, InheritanceStrategy : new-table]
2006-03-28 02:09:33,084 [main] INFO  SCHEMA                         - Managing Persistence of Class : org.apache.maven.continuum.model.system.UserGroup [Table : USERGROUP, InheritanceStrategy : new-table]
2006-03-28 02:09:33,084 [main] INFO  SCHEMA                         - Managing Persistence of Class : org.apache.maven.continuum.model.project.BuildResult [Table : BUILDRESULT, InheritanceStrategy : new-table]
2006-03-28 02:09:33,085 [main] INFO  SCHEMA                         - Managing Persistence of Class : org.apache.maven.continuum.model.project.Project [Table : PROJECT, InheritanceStrategy : new-table]
2006-03-28 02:09:33,085 [main] INFO  SCHEMA                         - Managing Persistence of Class : org.apache.maven.continuum.model.project.ProjectGroup [Table : PROJECTGROUP, InheritanceStrategy : new-table]
2006-03-28 02:09:33,085 [main] INFO  SCHEMA                         - Managing Persistence of Class : org.apache.maven.continuum.model.system.ContinuumUser [Table : CONTINUUMUSER, InheritanceStrategy : new-table]
2006-03-28 02:09:33,085 [main] INFO  SCHEMA                         - Managing Persistence of Class : org.apache.maven.continuum.model.system.SystemConfiguration [Table : SYSTEMCONFIGURATION, InheritanceStrategy : new-table]
2006-03-28 02:09:33,087 [main] INFO  SCHEMA                         - Managing Persistence of Field : org.apache.maven.continuum.model.project.ProjectNotifier.configuration [Table : PROJECTNOTIFIER_CONFIGURATION]
2006-03-28 02:09:33,088 [main] INFO  SCHEMA                         - Managing Persistence of Field : org.apache.maven.continuum.model.system.UserGroup.permissions [Table : USERGROUP_PERMISSIONS]
2006-03-28 02:09:33,089 [main] INFO  SCHEMA                         - Managing Persistence of Field : org.apache.maven.continuum.model.project.ProjectGroup.buildDefinitions [Table : PROJECTGROUP_BUILDDEFINITIONS]
2006-03-28 02:09:33,089 [main] INFO  SCHEMA                         - Managing Persistence of Field : org.apache.maven.continuum.model.project.ProjectGroup.notifiers [Table : PROJECTGROUP_NOTIFIERS]
2006-03-28 02:09:33,091 [main] INFO  SCHEMA                         - Managing Persistence of Field : org.apache.maven.continuum.model.system.NotificationAddress.configuration [Table : NOTIFICATIONADDRESS_CONFIGURATION]
2006-03-28 02:09:33,093 [main] INFO  SCHEMA                         - Managing Persistence of Field : org.apache.maven.continuum.model.project.Project.buildDefinitions [Table : PROJECT_BUILDDEFINITIONS]
2006-03-28 02:09:33,095 [main] INFO  SCHEMA                         - Managing Persistence of Field : org.apache.maven.continuum.model.project.Project.notifiers [Table : PROJECT_NOTIFIERS]
2006-03-28 02:09:33,097 [main] INFO  SCHEMA                         - Managing Persistence of Field : org.apache.maven.continuum.model.system.ContinuumUser.notificationAddresses [Table : CONTINUUMUSER_NOTIFICATIONADDRESSES]
2006-03-28 02:09:33,136 [main] WARN  RDBMS                          - Column BUILDDEFINITION.LATEST_BUILD_ID should not allow nulls but does. You can prevent nulls by specifying "allows-null" as "false" for the <field> in the MetaData
2006-03-28 02:09:33,278 [main] INFO  RDBMS                          - Validated 1 unique key(s) for table CHANGEFILE
2006-03-28 02:09:33,293 [main] INFO  RDBMS                          - Validated 1 foreign key(s) for table CHANGEFILE
2006-03-28 02:09:33,300 [main] INFO  RDBMS                          - Validated 1 unique key(s) for table BUILDDEFINITION
2006-03-28 02:09:33,306 [main] INFO  RDBMS                          - Validated 2 foreign key(s) for table BUILDDEFINITION
2006-03-28 02:09:33,313 [main] INFO  RDBMS                          - Validated 1 unique key(s) for table PROJECTNOTIFIER
2006-03-28 02:09:33,329 [main] INFO  RDBMS                          - Validated 1 unique key(s) for table USERGROUP
2006-03-28 02:09:33,337 [main] INFO  RDBMS                          - Validated 1 unique key(s) for table CHANGESET
2006-03-28 02:09:33,340 [main] INFO  RDBMS                          - Validated 1 foreign key(s) for table CHANGESET
2006-03-28 02:09:33,346 [main] INFO  RDBMS                          - Validated 1 unique key(s) for table PROJECTGROUP
2006-03-28 02:09:33,355 [main] INFO  RDBMS                          - Validated 1 unique key(s) for table BUILDRESULT
2006-03-28 02:09:33,360 [main] INFO  RDBMS                          - Validated 2 foreign key(s) for table BUILDRESULT
2006-03-28 02:09:33,366 [main] INFO  RDBMS                          - Validated 1 unique key(s) for table SCMRESULT
2006-03-28 02:09:33,376 [main] INFO  RDBMS                          - Validated 1 unique key(s) for table NOTIFICATIONADDRESS
2006-03-28 02:09:33,382 [main] INFO  RDBMS                          - Validated 1 unique key(s) for table SYSTEMCONFIGURATION
2006-03-28 02:09:33,388 [main] INFO  RDBMS                          - Validated 1 unique key(s) for table PROJECTDEVELOPER
2006-03-28 02:09:33,392 [main] INFO  RDBMS                          - Validated 1 foreign key(s) for table PROJECTDEVELOPER
2006-03-28 02:09:33,398 [main] INFO  RDBMS                          - Validated 1 unique key(s) for table PERMISSION
2006-03-28 02:09:33,407 [main] INFO  RDBMS                          - Validated 1 unique key(s) for table SCHEDULE
2006-03-28 02:09:33,422 [main] INFO  RDBMS                          - Validated 1 unique key(s) for table PROJECT
2006-03-28 02:09:33,432 [main] INFO  RDBMS                          - Validated 3 foreign key(s) for table PROJECT
2006-03-28 02:09:33,442 [main] INFO  RDBMS                          - Validated 1 unique key(s) for table INSTALLATION
2006-03-28 02:09:33,449 [main] INFO  RDBMS                          - Validated 1 unique key(s) for table PROJECTDEPENDENCY
2006-03-28 02:09:33,466 [main] INFO  RDBMS                          - Validated 1 foreign key(s) for table PROJECTDEPENDENCY
2006-03-28 02:09:33,474 [main] INFO  RDBMS                          - Validated 1 unique key(s) for table CONTINUUMUSER
2006-03-28 02:09:33,477 [main] INFO  RDBMS                          - Validated 1 foreign key(s) for table CONTINUUMUSER
2006-03-28 02:09:33,483 [main] INFO  RDBMS                          - Validated 1 unique key(s) for table PROFILE
2006-03-28 02:09:33,487 [main] INFO  RDBMS                          - Validated 2 foreign key(s) for table PROFILE
2006-03-28 02:09:33,493 [main] INFO  RDBMS                          - Validated 1 unique key(s) for table PROJECTGROUP_NOTIFIERS
2006-03-28 02:09:33,501 [main] INFO  RDBMS                          - Validated 2 foreign key(s) for table PROJECTGROUP_NOTIFIERS
2006-03-28 02:09:33,508 [main] INFO  RDBMS                          - Validated 1 unique key(s) for table PROJECT_NOTIFIERS
2006-03-28 02:09:33,512 [main] INFO  RDBMS                          - Validated 2 foreign key(s) for table PROJECT_NOTIFIERS
2006-03-28 02:09:33,519 [main] INFO  RDBMS                          - Validated 1 unique key(s) for table USERGROUP_PERMISSIONS
2006-03-28 02:09:33,522 [main] INFO  RDBMS                          - Validated 2 foreign key(s) for table USERGROUP_PERMISSIONS
2006-03-28 02:09:33,529 [main] INFO  RDBMS                          - Validated 1 unique key(s) for table PROJECT_BUILDDEFINITIONS
2006-03-28 02:09:33,533 [main] INFO  RDBMS                          - Validated 2 foreign key(s) for table PROJECT_BUILDDEFINITIONS
2006-03-28 02:09:33,540 [main] INFO  RDBMS                          - Validated 1 unique key(s) for table CONTINUUMUSER_NOTIFICATIONADDRESSES
2006-03-28 02:09:33,543 [main] INFO  RDBMS                          - Validated 2 foreign key(s) for table CONTINUUMUSER_NOTIFICATIONADDRESSES
2006-03-28 02:09:33,549 [main] INFO  RDBMS                          - Validated 1 unique key(s) for table PROJECTGROUP_BUILDDEFINITIONS
2006-03-28 02:09:33,553 [main] INFO  RDBMS                          - Validated 2 foreign key(s) for table PROJECTGROUP_BUILDDEFINITIONS
2006-03-28 02:09:33,559 [main] INFO  RDBMS                          - Validated 1 unique key(s) for table PROJECTNOTIFIER_CONFIGURATION
2006-03-28 02:09:33,561 [main] INFO  RDBMS                          - Validated 1 foreign key(s) for table PROJECTNOTIFIER_CONFIGURATION
2006-03-28 02:09:33,567 [main] INFO  RDBMS                          - Validated 1 unique key(s) for table NOTIFICATIONADDRESS_CONFIGURATION
2006-03-28 02:09:33,570 [main] INFO  RDBMS                          - Validated 1 foreign key(s) for table NOTIFICATIONADDRESS_CONFIGURATION
2006-03-28 02:09:33,578 [main] INFO  SCHEMA                         - Catalog "", Schema "SA" initialised - managing 26 classes
2006-03-28 02:09:33,597 [main] INFO  Continuum                      - Starting Continuum.
2006-03-28 02:09:33,598 [main] INFO  Continuum                      - 
2006-03-28 02:09:33,598 [main] INFO  Continuum                      - 
2006-03-28 02:09:33,599 [main] INFO  Continuum                      - < Continuum 1.0.3-SNAPSHOT started! >
2006-03-28 02:09:33,599 [main] INFO  Continuum                      - -------------------------------------
2006-03-28 02:09:33,600 [main] INFO  Continuum                      -        \   ^__^
2006-03-28 02:09:33,600 [main] INFO  Continuum                      -         \  (oo)\_______
2006-03-28 02:09:33,600 [main] INFO  Continuum                      -            (__)\       )\/\
2006-03-28 02:09:33,600 [main] INFO  Continuum                      -                ||----w |
2006-03-28 02:09:33,600 [main] INFO  Continuum                      -                ||     ||
2006-03-28 02:09:33,600 [main] INFO  Continuum                      - 
2006-03-28 02:09:33,601 [main] INFO  Continuum                      - 
2006-03-28 02:09:33,601 [main] INFO  ContinuumInitializer           - Continuum initializer running ...
2006-03-28 02:09:33,803 [main] INFO  SchedulesActivator             - Activating schedules ...
2006-03-28 02:09:33,819 [main] INFO  SchedulesActivator             - Tue Mar 28 03:00:00 PST 2006
2006-03-28 02:09:33,820 [main] INFO  PlexusContainer                - Loading on start [role,roleHint]: [org.codehaus.plexus.taskqueue.execution.TaskQueueExecutor,build-project]
2006-03-28 02:09:33,850 [main] ERROR VelocityComponent              - ResourceManager : unable to find resource 'CommonMacros.vm' in any resource loader.
2006-03-28 02:09:33,853 [main] INFO  Notifier:mail                  - The from mailbox is not configured, will use the nag email address from the project.
2006-03-28 02:09:33,853 [main] INFO  Notifier:mail                  - From name: Continuum@cheddar.simulalabs.com
2006-03-28 02:09:33,853 [main] INFO  Notifier:mail                  - Build host name: cheddar.simulalabs.com
2006-03-28 02:09:33,855 [main] INFO  RecipientSource                - To override address is not configured, will use the nag email address from the project.
2006-03-28 02:09:33,856 [main] INFO  TaskQueueExecutor:build-project - Starting task executor, thread name 'build-project'.
2006-03-28 02:09:33,857 [main] INFO  PlexusContainer                - Loading on start [role,roleHint]: [org.codehaus.plexus.taskqueue.execution.TaskQueueExecutor,check-out-project]
2006-03-28 02:09:33,858 [main] INFO  TaskQueueExecutor:check-out-project - Starting task executor, thread name 'check-out-project'.
-------------------------------------------------------------------------------
[2006.03.28 02:09:33] Integration test settings
-------------------------------------------------------------------------------
[2006.03.28 02:09:33] IT root: /home/continuum/continuum-maven/working-directory/149/target/it
[2006.03.28 02:09:33] Remoting method: jvm
[2006.03.28 02:09:33] Store implementation: class org.apache.maven.continuum.store.JdoContinuumStore
-------------------------------------------------------------------------------
[2006.03.28 02:09:33] Connecting to and starting Continuum
[2006.03.28 02:09:33] Removing all existing projects from Continuum.
[2006.03.28 02:09:33] Initializing Ant SVN project
[2006.03.28 02:09:34] Adding Ant SVN project
2006-03-28 02:09:34,593 [Thread-90] INFO  ContinuumScm                   - Checking out project: 'Ant SVN Project', id: '16' to '/home/continuum/continuum-maven/working-directory/149/target/working-directory/16'.
2006-03-28 02:09:34,601 [Thread-90] INFO  ScmManager                     - Executing: svn --non-interactive checkout file:///home/continuum/continuum-maven/working-directory/149/target/it/svn-root/ant-svn 16
2006-03-28 02:09:34,601 [Thread-90] INFO  ScmManager                     - Working directory: /home/continuum/continuum-maven/working-directory/149/target/working-directory
2006-03-28 02:09:35,100 [Thread-95] DEBUG ScmManager                     - A    16/src
2006-03-28 02:09:35,101 [Thread-95] DEBUG ScmManager                     - Skipping non-file: 16/src
2006-03-28 02:09:35,101 [Thread-95] DEBUG ScmManager                     - A    16/src/main
2006-03-28 02:09:35,101 [Thread-95] DEBUG ScmManager                     - Skipping non-file: 16/src/main
2006-03-28 02:09:35,101 [Thread-95] DEBUG ScmManager                     - A    16/src/main/java
2006-03-28 02:09:35,101 [Thread-95] DEBUG ScmManager                     - Skipping non-file: 16/src/main/java
2006-03-28 02:09:35,101 [Thread-95] DEBUG ScmManager                     - A    16/src/main/java/Foo.java
2006-03-28 02:09:35,101 [Thread-95] DEBUG ScmManager                     - A    16/build.xml
2006-03-28 02:09:35,102 [Thread-95] DEBUG ScmManager                     - Checked out revision 1.
2006-03-28 02:09:35,102 [Thread-90] INFO  ContinuumScm                   - Checked out 2 files.
[2006.03.28 02:09:35] Building SVN Ant project
2006-03-28 02:09:35,477 [main] INFO  Continuum                      - Enqueuing 'Ant SVN Project' (Build definition id=16).
2006-03-28 02:09:35,516 [Thread-89] WARN  SQL                            - Object with id "0" not found !
2006-03-28 02:09:35,561 [Thread-89] INFO  ContinuumScm                   - Updating project: id: '16', name 'Ant SVN Project'.
2006-03-28 02:09:35,571 [Thread-89] INFO  ScmManager                     - Executing: svn --non-interactive update
2006-03-28 02:09:35,571 [Thread-89] INFO  ScmManager                     - Working directory: /home/continuum/continuum-maven/working-directory/149/target/working-directory/16
2006-03-28 02:09:36,100 [Thread-97] DEBUG ScmManager                     - At revision 1.
2006-03-28 02:09:36,134 [Thread-89] INFO  Action:update-project-from-working-directory - Updating project 'Ant SVN Project' from checkout.
2006-03-28 02:09:36,217 [Thread-89] WARN  ContinuumBuildExecutor:ant     - Could not find the executable 'ant' in this path: 
2006-03-28 02:09:36,217 [Thread-89] WARN  ContinuumBuildExecutor:ant     - Executable 'ant'.
2006-03-28 02:09:36,218 [Thread-89] INFO  ContinuumBuildExecutor:ant     - Arguments: -f build.xml -v clean build
2006-03-28 02:09:36,218 [Thread-89] INFO  ContinuumBuildExecutor:ant     - Working directory: /home/continuum/continuum-maven/working-directory/149/target/working-directory/16
2006-03-28 02:09:38,146 [Thread-89] INFO  ContinuumBuildExecutor:ant     - Exit code: 0
2006-03-28 02:09:38,527 [main] INFO  Continuum                      - Remove project Ant SVN Project(16)
2006-03-28 02:09:38,590 [main] WARN  SQL                            - Object with id "16" not found !
[2006.03.28 02:09:38] Tearing down test - ignore any interrupted exceptions
2006-03-28 02:09:38,591 [main] INFO  TaskQueueExecutor:check-out-project - Executor thread got shutdown signal.
2006-03-28 02:09:38,591 [main] INFO  TaskQueueExecutor:check-out-project - Waiting until task executor 'check-out-project' is idling...
2006-03-28 02:09:38,591 [Thread-90] INFO  TaskQueueExecutor:check-out-project - Executor thread 'check-out-project' exited.
There was no such logger 'org.apache.maven.plugin.MavenPluginCollector' 32620783.
There was no such logger 'org.apache.maven.continuum.execution.ContinuumBuildExecutor:shell' 32620783.
There was no such logger 'org.codehaus.plexus.taskqueue.TaskQueue:check-out-project' 32620783.
There was no such logger 'org.apache.maven.continuum.buildcontroller.BuildController' 32620783.
There was no such logger 'org.apache.maven.continuum.scm.ContinuumScm' 32620783.
There was no such logger 'org.apache.maven.continuum.utils.WorkingDirectoryService' 32620783.
There was no such logger 'org.apache.maven.artifact.resolver.ArtifactResolver' 32620783.
There was no such logger 'org.apache.maven.continuum.execution.manager.BuildExecutorManager' 32620783.
There was no such logger 'org.codehaus.plexus.notification.RecipientSource' 32620783.
There was no such logger 'org.apache.maven.continuum.initialization.ContinuumInitializer' 32620783.
There was no such logger 'org.apache.maven.continuum.build.settings.SchedulesActivator' 32620783.
There was no such logger 'org.apache.maven.continuum.execution.ContinuumBuildExecutor:maven-1' 32620783.
There was no such logger 'org.codehaus.plexus.jdo.JdoFactory' 32620783.
There was no such logger 'org.codehaus.plexus.notification.notifier.Notifier:jabber' 32620783.
There was no such logger 'org.apache.maven.continuum.execution.maven.m1.MavenOneMetadataHelper' 32620783.
There was no such logger 'org.codehaus.plexus.action.Action:store-project' 32620783.
There was no such logger 'org.codehaus.plexus.taskqueue.TaskViabilityEvaluator:build-project' 32620783.
There was no such logger 'org.codehaus.plexus.notification.notifier.Notifier:mail' 32620783.
There was no such logger 'org.apache.maven.artifact.deployer.ArtifactDeployer' 32620783.
There was no such logger 'org.apache.maven.artifact.transform.ArtifactTransformation:snapshot' 32620783.
There was no such logger 'org.codehaus.plexus.msn.MsnClient' 32620783.
There was no such logger 'org.codehaus.plexus.action.Action:validate-project' 32620783.
There was no such logger 'org.codehaus.plexus.notification.notifier.Notifier:msn' 32620783.
There was no such logger 'org.apache.maven.artifact.manager.WagonManager' 32620783.
There was no such logger 'org.codehaus.plexus.taskqueue.execution.TaskQueueExecutor:build-project' 32620783.
There was no such logger 'org.codehaus.plexus.action.Action:check-working-directory' 32620783.
There was no such logger 'org.apache.maven.profiles.MavenProfilesBuilder' 32620783.
There was no such logger 'org.apache.maven.continuum.store.ContinuumStore:jdo' 32620783.
There was no such logger 'org.codehaus.plexus.commandline.ExecutableResolver' 32620783.
2006-03-28 02:09:38,599 [main] INFO  TaskQueueExecutor:build-project - Executor thread got shutdown signal.
2006-03-28 02:09:38,600 [main] INFO  TaskQueueExecutor:build-project - Waiting until task executor 'build-project' is idling...
2006-03-28 02:09:38,600 [Thread-89] INFO  TaskQueueExecutor:build-project - Executor thread 'build-project' exited.
2006-03-28 02:09:38,603 [main] INFO  Continuum                      - Stopping Continuum.
2006-03-28 02:09:38,603 [main] INFO  Continuum                      - Continuum stopped.
There was no such logger 'org.apache.maven.continuum.Continuum' 32620783.
There was no such logger 'org.codehaus.plexus.taskqueue.execution.TaskExecutor:check-out-project' 32620783.
There was no such logger 'org.codehaus.plexus.action.Action:update-working-directory-from-scm' 32620783.
There was no such logger 'org.codehaus.plexus.ircbot.IrcBot' 32620783.
There was no such logger 'org.apache.maven.continuum.configuration.ConfigurationService' 32620783.
There was no such logger 'org.apache.maven.continuum.execution.maven.m2.MavenBuilderHelper' 32620783.
There was no such logger 'org.codehaus.plexus.notification.notifier.Notifier:irc' 32620783.
There was no such logger 'org.codehaus.plexus.notification.notifier.manager.NotifierManager' 32620783.
There was no such logger 'org.codehaus.plexus.velocity.VelocityComponent' 32620783.
There was no such logger 'org.codehaus.plexus.action.Action:add-project-to-checkout-queue' 32620783.
There was no such logger 'org.codehaus.plexus.action.Action:checkout-project' 32620783.
There was no such logger 'org.apache.maven.settings.MavenSettingsBuilder' 32620783.
There was no such logger 'org.codehaus.plexus.action.ActionManager' 32620783.
There was no such logger 'org.codehaus.plexus.mailsender.MailSender' 32620783.
There was no such logger 'org.apache.maven.continuum.execution.ContinuumBuildExecutor:maven2' 32620783.
There was no such logger 'org.apache.maven.project.interpolation.ModelInterpolator' 32620783.
There was no such logger 'org.codehaus.plexus.notification.notifier.Notifier:console' 32620783.
There was no such logger 'org.apache.maven.continuum.utils.shell.ShellCommandHelper' 32620783.
There was no such logger 'org.codehaus.plexus.taskqueue.execution.TaskExecutor:build-project' 32620783.
There was no such logger 'org.codehaus.plexus.action.Action:store-checkout-scm-result' 32620783.
There was no such logger 'org.codehaus.plexus.action.Action:execute-builder' 32620783.
There was no such logger 'org.apache.maven.artifact.repository.metadata.RepositoryMetadataManager' 32620783.
There was no such logger 'org.apache.maven.artifact.transform.ArtifactTransformation:release' 32620783.
There was no such logger 'org.codehaus.plexus.jabber.JabberClient' 32620783.
Mar 28, 2006 2:09:38 AM org.quartz.core.QuartzScheduler shutdown
INFO: Scheduler defaultScheduler_$_NON_CLUSTERED shutting down.
Mar 28, 2006 2:09:38 AM org.quartz.core.QuartzScheduler pause
INFO: Scheduler defaultScheduler_$_NON_CLUSTERED paused.
Mar 28, 2006 2:09:38 AM org.quartz.core.QuartzScheduler shutdown
INFO: Scheduler defaultScheduler_$_NON_CLUSTERED shutdown complete.
There was no such logger 'org.codehaus.plexus.scheduler.Scheduler' 32620783.
There was no such logger 'org.apache.maven.continuum.notification.ContinuumNotificationDispatcher' 32620783.
There was no such logger 'org.apache.maven.project.MavenProjectBuilder' 32620783.
There was no such logger 'org.codehaus.plexus.action.Action:deploy-artifact' 32620783.
There was no such logger 'org.apache.maven.scm.manager.ScmManager' 32620783.
There was no such logger 'org.codehaus.plexus.action.Action:update-project-from-working-directory' 32620783.
There was no such logger 'org.apache.maven.artifact.transform.ArtifactTransformation:latest' 32620783.
[2006.03.28 02:09:38] Used 6268ms
2006-03-28 02:09:38,683 [main] DEBUG PlexusContainer                - Found 3 components to load on start
2006-03-28 02:09:38,683 [main] INFO  PlexusContainer                - Loading on start [role]: [org.apache.maven.continuum.Continuum]
2006-03-28 02:09:38,684 [main] INFO  JdoFactory                     - Initializing JDO.
2006-03-28 02:09:38,685 [main] INFO  JDO                            - PersistenceManagerFactory - Vendor: JPOX  Version: 1.1.0-rc-1
2006-03-28 02:09:38,685 [main] INFO  JDO                            - PersistenceManagerFactory initialised for datastore URL=jdbc:derby:/home/continuum/continuum-maven/working-directory/149/target/level1/level2/plexus-home/database;create=true driver=org.apache.derby.jdbc.EmbeddedDriver userName=sa
Mar 28, 2006 2:09:38 AM org.quartz.simpl.RAMJobStore initialize
INFO: RAMJobStore initialized.
Mar 28, 2006 2:09:38 AM org.quartz.impl.StdSchedulerFactory instantiate
INFO: Quartz scheduler 'defaultScheduler' initialized from an externally provided properties instance.
Mar 28, 2006 2:09:38 AM org.quartz.impl.StdSchedulerFactory instantiate
INFO: Quartz scheduler version: 1.4.5
Mar 28, 2006 2:09:38 AM org.quartz.core.QuartzScheduler start
INFO: Scheduler defaultScheduler_$_NON_CLUSTERED started.
2006-03-28 02:09:38,701 [main] WARN  ContinuumBuildExecutor:ant     - Could not find the executable 'ant' in the path '[]'.
2006-03-28 02:09:38,702 [main] WARN  ContinuumBuildExecutor:maven-1 - Could not find the executable 'maven' in the path '[]'.
2006-03-28 02:09:38,743 [main] DEBUG MavenSettingsBuilder           - Building Maven global-level settings from: '/usr/local/maven-2.0.3-SNAPSHOT/conf/settings.xml'
2006-03-28 02:09:38,743 [main] DEBUG MavenSettingsBuilder           - Building Maven user-level settings from: '/home/continuum/.m2/settings.xml'
2006-03-28 02:09:38,806 [main] WARN  ContinuumBuildExecutor:maven2  - Could not find the executable 'mvn' in the path '[]'.
2006-03-28 02:09:38,807 [main] INFO  BuildExecutorManager           - Build executors:
2006-03-28 02:09:38,807 [main] INFO  BuildExecutorManager           -   maven-1
2006-03-28 02:09:38,807 [main] INFO  BuildExecutorManager           -   ant
2006-03-28 02:09:38,807 [main] INFO  BuildExecutorManager           -   maven2
2006-03-28 02:09:38,807 [main] INFO  BuildExecutorManager           -   shell
2006-03-28 02:09:38,807 [main] INFO  Continuum                      - Initializing Continuum.
2006-03-28 02:09:38,807 [main] INFO  Continuum                      - Showing all projects: 
2006-03-28 02:09:38,826 [main] INFO  RDBMS                          - RDBMS Adapter initialised : CloudscapeAdapter : Apache Derby version=10.1.2.1, major=10, minor=1, revision=2
Identifier Names : UPPERCASE 
Driver name=Apache Derby Embedded JDBC Driver, version=10.1.2.1, major=10, minor=1
Identifier Max Lengths : Table=128  Column=128  Constraint=18  Index=18  Delimeters="
Identifier Support in DDL : catalog=false  schema=true
2006-03-28 02:09:38,826 [main] INFO  SCHEMA                         - Initialising Catalog "", Schema "SA" using "SchemaTable" auto-start option
2006-03-28 02:09:38,908 [main] INFO  JDO                            - Managing Persistence of org.apache.maven.continuum.model.scm.ChangeSet since it was managed previously
2006-03-28 02:09:38,908 [main] INFO  JDO                            - Managing Persistence of org.apache.maven.continuum.model.project.Profile since it was managed previously
2006-03-28 02:09:38,908 [main] INFO  JDO                            - Managing Persistence of org.apache.maven.continuum.model.system.Installation since it was managed previously
2006-03-28 02:09:38,909 [main] INFO  JDO                            - Managing Persistence of org.apache.maven.continuum.model.project.Project since it was managed previously
2006-03-28 02:09:38,909 [main] INFO  JDO                            - Managing Persistence of org.apache.maven.continuum.model.system.UserGroup since it was managed previously
2006-03-28 02:09:38,909 [main] INFO  JDO                            - Managing Persistence of org.apache.maven.continuum.model.project.BuildResult since it was managed previously
2006-03-28 02:09:38,909 [main] INFO  JDO                            - Managing Persistence of org.apache.maven.continuum.model.system.ContinuumUser since it was managed previously
2006-03-28 02:09:38,910 [main] INFO  JDO                            - Managing Persistence of org.apache.maven.continuum.model.scm.ChangeFile since it was managed previously
2006-03-28 02:09:38,910 [main] INFO  JDO                            - Managing Persistence of org.apache.maven.continuum.model.system.SystemConfiguration since it was managed previously
2006-03-28 02:09:38,910 [main] INFO  JDO                            - Managing Persistence of org.apache.maven.continuum.model.project.ProjectDependency since it was managed previously
2006-03-28 02:09:38,910 [main] INFO  JDO                            - Managing Persistence of org.apache.maven.continuum.model.project.ProjectDeveloper since it was managed previously
2006-03-28 02:09:38,910 [main] INFO  JDO                            - Managing Persistence of org.apache.maven.continuum.model.project.BuildDefinition since it was managed previously
2006-03-28 02:09:38,911 [main] INFO  JDO                            - Managing Persistence of org.apache.maven.continuum.model.scm.ScmResult since it was managed previously
2006-03-28 02:09:38,911 [main] INFO  JDO                            - Managing Persistence of org.apache.maven.continuum.model.project.Schedule since it was managed previously
2006-03-28 02:09:38,911 [main] INFO  JDO                            - Managing Persistence of org.apache.maven.continuum.model.system.Permission since it was managed previously
2006-03-28 02:09:38,911 [main] INFO  JDO                            - Managing Persistence of org.apache.maven.continuum.model.project.ProjectNotifier since it was managed previously
2006-03-28 02:09:38,912 [main] INFO  JDO                            - Managing Persistence of org.apache.maven.continuum.model.system.NotificationAddress since it was managed previously
2006-03-28 02:09:38,912 [main] INFO  JDO                            - Managing Persistence of org.apache.maven.continuum.model.project.ProjectGroup since it was managed previously
2006-03-28 02:09:38,913 [main] INFO  MetaData                       - Parsing MetaData from file "file:/home/continuum/.m2/repository/org/apache/maven/continuum/continuum-model/1.0.3-SNAPSHOT/continuum-model-1.0.3-SNAPSHOT.jar!/META-INF/package.jdo"
2006-03-28 02:09:39,376 [main] INFO  SCHEMA                         - Managing Persistence of Class : org.apache.maven.continuum.model.scm.ChangeFile [Table : CHANGEFILE, InheritanceStrategy : new-table]
2006-03-28 02:09:39,377 [main] INFO  SCHEMA                         - Managing Persistence of Class : org.apache.maven.continuum.model.scm.ChangeSet [Table : CHANGESET, InheritanceStrategy : new-table]
2006-03-28 02:09:39,377 [main] INFO  SCHEMA                         - Managing Persistence of Class : org.apache.maven.continuum.model.system.Installation [Table : INSTALLATION, InheritanceStrategy : new-table]
2006-03-28 02:09:39,377 [main] INFO  SCHEMA                         - Managing Persistence of Class : org.apache.maven.continuum.model.project.Profile [Table : PROFILE, InheritanceStrategy : new-table]
2006-03-28 02:09:39,377 [main] INFO  SCHEMA                         - Managing Persistence of Class : org.apache.maven.continuum.model.project.Schedule [Table : SCHEDULE, InheritanceStrategy : new-table]
2006-03-28 02:09:39,378 [main] INFO  SCHEMA                         - Managing Persistence of Class : org.apache.maven.continuum.model.project.BuildDefinition [Table : BUILDDEFINITION, InheritanceStrategy : new-table]
2006-03-28 02:09:39,378 [main] INFO  SCHEMA                         - Managing Persistence of Class : org.apache.maven.continuum.model.scm.ScmResult [Table : SCMRESULT, InheritanceStrategy : new-table]
2006-03-28 02:09:39,378 [main] INFO  SCHEMA                         - Managing Persistence of Class : org.apache.maven.continuum.model.project.BuildResult [Table : BUILDRESULT, InheritanceStrategy : new-table]
2006-03-28 02:09:39,379 [main] INFO  SCHEMA                         - Managing Persistence of Class : org.apache.maven.continuum.model.project.ProjectDependency [Table : PROJECTDEPENDENCY, InheritanceStrategy : new-table]
2006-03-28 02:09:39,379 [main] INFO  SCHEMA                         - Managing Persistence of Class : org.apache.maven.continuum.model.project.ProjectDeveloper [Table : PROJECTDEVELOPER, InheritanceStrategy : new-table]
2006-03-28 02:09:39,379 [main] INFO  SCHEMA                         - Managing Persistence of Class : org.apache.maven.continuum.model.project.ProjectNotifier [Table : PROJECTNOTIFIER, InheritanceStrategy : new-table]
2006-03-28 02:09:39,379 [main] INFO  SCHEMA                         - Managing Persistence of Class : org.apache.maven.continuum.model.project.ProjectGroup [Table : PROJECTGROUP, InheritanceStrategy : new-table]
2006-03-28 02:09:39,379 [main] INFO  SCHEMA                         - Managing Persistence of Class : org.apache.maven.continuum.model.project.Project [Table : PROJECT, InheritanceStrategy : new-table]
2006-03-28 02:09:39,380 [main] INFO  SCHEMA                         - Managing Persistence of Class : org.apache.maven.continuum.model.system.Permission [Table : PERMISSION, InheritanceStrategy : new-table]
2006-03-28 02:09:39,380 [main] INFO  SCHEMA                         - Managing Persistence of Class : org.apache.maven.continuum.model.system.UserGroup [Table : USERGROUP, InheritanceStrategy : new-table]
2006-03-28 02:09:39,380 [main] INFO  SCHEMA                         - Managing Persistence of Class : org.apache.maven.continuum.model.system.NotificationAddress [Table : NOTIFICATIONADDRESS, InheritanceStrategy : new-table]
2006-03-28 02:09:39,381 [main] INFO  SCHEMA                         - Managing Persistence of Class : org.apache.maven.continuum.model.system.ContinuumUser [Table : CONTINUUMUSER, InheritanceStrategy : new-table]
2006-03-28 02:09:39,381 [main] INFO  SCHEMA                         - Managing Persistence of Class : org.apache.maven.continuum.model.system.SystemConfiguration [Table : SYSTEMCONFIGURATION, InheritanceStrategy : new-table]
2006-03-28 02:09:39,382 [main] INFO  SCHEMA                         - Managing Persistence of Field : org.apache.maven.continuum.model.project.ProjectNotifier.configuration [Table : PROJECTNOTIFIER_CONFIGURATION]
2006-03-28 02:09:39,383 [main] INFO  SCHEMA                         - Managing Persistence of Field : org.apache.maven.continuum.model.system.UserGroup.permissions [Table : USERGROUP_PERMISSIONS]
2006-03-28 02:09:39,384 [main] INFO  SCHEMA                         - Managing Persistence of Field : org.apache.maven.continuum.model.project.ProjectGroup.buildDefinitions [Table : PROJECTGROUP_BUILDDEFINITIONS]
2006-03-28 02:09:39,385 [main] INFO  SCHEMA                         - Managing Persistence of Field : org.apache.maven.continuum.model.project.ProjectGroup.notifiers [Table : PROJECTGROUP_NOTIFIERS]
2006-03-28 02:09:39,385 [main] INFO  SCHEMA                         - Managing Persistence of Field : org.apache.maven.continuum.model.system.NotificationAddress.configuration [Table : NOTIFICATIONADDRESS_CONFIGURATION]
2006-03-28 02:09:39,390 [main] INFO  SCHEMA                         - Managing Persistence of Field : org.apache.maven.continuum.model.project.Project.buildDefinitions [Table : PROJECT_BUILDDEFINITIONS]
2006-03-28 02:09:39,391 [main] INFO  SCHEMA                         - Managing Persistence of Field : org.apache.maven.continuum.model.project.Project.notifiers [Table : PROJECT_NOTIFIERS]
2006-03-28 02:09:39,393 [main] INFO  SCHEMA                         - Managing Persistence of Field : org.apache.maven.continuum.model.system.ContinuumUser.notificationAddresses [Table : CONTINUUMUSER_NOTIFICATIONADDRESSES]
2006-03-28 02:09:39,425 [main] WARN  RDBMS                          - Column BUILDDEFINITION.LATEST_BUILD_ID should not allow nulls but does. You can prevent nulls by specifying "allows-null" as "false" for the <field> in the MetaData
2006-03-28 02:09:39,595 [main] INFO  RDBMS                          - Validated 1 unique key(s) for table CHANGEFILE
2006-03-28 02:09:39,601 [main] INFO  RDBMS                          - Validated 1 foreign key(s) for table CHANGEFILE
2006-03-28 02:09:39,607 [main] INFO  RDBMS                          - Validated 1 unique key(s) for table BUILDDEFINITION
2006-03-28 02:09:39,610 [main] INFO  RDBMS                          - Validated 2 foreign key(s) for table BUILDDEFINITION
2006-03-28 02:09:39,615 [main] INFO  RDBMS                          - Validated 1 unique key(s) for table PROJECTNOTIFIER
2006-03-28 02:09:39,621 [main] INFO  RDBMS                          - Validated 1 unique key(s) for table USERGROUP
2006-03-28 02:09:39,626 [main] INFO  RDBMS                          - Validated 1 unique key(s) for table CHANGESET
2006-03-28 02:09:39,628 [main] INFO  RDBMS                          - Validated 1 foreign key(s) for table CHANGESET
2006-03-28 02:09:39,633 [main] INFO  RDBMS                          - Validated 1 unique key(s) for table PROJECTGROUP
2006-03-28 02:09:39,638 [main] INFO  RDBMS                          - Validated 1 unique key(s) for table NOTIFICATIONADDRESS
2006-03-28 02:09:39,643 [main] INFO  RDBMS                          - Validated 1 unique key(s) for table SCMRESULT
2006-03-28 02:09:39,649 [main] INFO  RDBMS                          - Validated 1 unique key(s) for table BUILDRESULT
2006-03-28 02:09:39,653 [main] INFO  RDBMS                          - Validated 2 foreign key(s) for table BUILDRESULT
2006-03-28 02:09:39,658 [main] INFO  RDBMS                          - Validated 1 unique key(s) for table SYSTEMCONFIGURATION
2006-03-28 02:09:39,664 [main] INFO  RDBMS                          - Validated 1 unique key(s) for table PROJECTDEVELOPER
2006-03-28 02:09:39,666 [main] INFO  RDBMS                          - Validated 1 foreign key(s) for table PROJECTDEVELOPER
2006-03-28 02:09:39,671 [main] INFO  RDBMS                          - Validated 1 unique key(s) for table PERMISSION
2006-03-28 02:09:39,676 [main] INFO  RDBMS                          - Validated 1 unique key(s) for table SCHEDULE
2006-03-28 02:09:39,681 [main] INFO  RDBMS                          - Validated 1 unique key(s) for table INSTALLATION
2006-03-28 02:09:39,689 [main] INFO  RDBMS                          - Validated 1 unique key(s) for table PROJECT
2006-03-28 02:09:39,695 [main] INFO  RDBMS                          - Validated 3 foreign key(s) for table PROJECT
2006-03-28 02:09:39,703 [main] INFO  RDBMS                          - Validated 1 unique key(s) for table PROJECTDEPENDENCY
2006-03-28 02:09:39,705 [main] INFO  RDBMS                          - Validated 1 foreign key(s) for table PROJECTDEPENDENCY
2006-03-28 02:09:39,711 [main] INFO  RDBMS                          - Validated 1 unique key(s) for table CONTINUUMUSER
2006-03-28 02:09:39,714 [main] INFO  RDBMS                          - Validated 1 foreign key(s) for table CONTINUUMUSER
2006-03-28 02:09:39,720 [main] INFO  RDBMS                          - Validated 1 unique key(s) for table PROFILE
2006-03-28 02:09:39,724 [main] INFO  RDBMS                          - Validated 2 foreign key(s) for table PROFILE
2006-03-28 02:09:39,730 [main] INFO  RDBMS                          - Validated 1 unique key(s) for table PROJECTGROUP_BUILDDEFINITIONS
2006-03-28 02:09:39,734 [main] INFO  RDBMS                          - Validated 2 foreign key(s) for table PROJECTGROUP_BUILDDEFINITIONS
2006-03-28 02:09:39,739 [main] INFO  RDBMS                          - Validated 1 unique key(s) for table PROJECTNOTIFIER_CONFIGURATION
2006-03-28 02:09:39,741 [main] INFO  RDBMS                          - Validated 1 foreign key(s) for table PROJECTNOTIFIER_CONFIGURATION
2006-03-28 02:09:39,746 [main] INFO  RDBMS                          - Validated 1 unique key(s) for table CONTINUUMUSER_NOTIFICATIONADDRESSES
2006-03-28 02:09:39,749 [main] INFO  RDBMS                          - Validated 2 foreign key(s) for table CONTINUUMUSER_NOTIFICATIONADDRESSES
2006-03-28 02:09:39,755 [main] INFO  RDBMS                          - Validated 1 unique key(s) for table NOTIFICATIONADDRESS_CONFIGURATION
2006-03-28 02:09:39,758 [main] INFO  RDBMS                          - Validated 1 foreign key(s) for table NOTIFICATIONADDRESS_CONFIGURATION
2006-03-28 02:09:39,764 [main] INFO  RDBMS                          - Validated 1 unique key(s) for table PROJECT_NOTIFIERS
2006-03-28 02:09:39,769 [main] INFO  RDBMS                          - Validated 2 foreign key(s) for table PROJECT_NOTIFIERS
2006-03-28 02:09:39,778 [main] INFO  RDBMS                          - Validated 1 unique key(s) for table USERGROUP_PERMISSIONS
2006-03-28 02:09:39,783 [main] INFO  RDBMS                          - Validated 2 foreign key(s) for table USERGROUP_PERMISSIONS
2006-03-28 02:09:39,789 [main] INFO  RDBMS                          - Validated 1 unique key(s) for table PROJECT_BUILDDEFINITIONS
2006-03-28 02:09:39,793 [main] INFO  RDBMS                          - Validated 2 foreign key(s) for table PROJECT_BUILDDEFINITIONS
2006-03-28 02:09:39,799 [main] INFO  RDBMS                          - Validated 1 unique key(s) for table PROJECTGROUP_NOTIFIERS
2006-03-28 02:09:39,802 [main] INFO  RDBMS                          - Validated 2 foreign key(s) for table PROJECTGROUP_NOTIFIERS
2006-03-28 02:09:39,806 [main] INFO  SCHEMA                         - Catalog "", Schema "SA" initialised - managing 26 classes
2006-03-28 02:09:39,811 [main] INFO  Continuum                      - Starting Continuum.
2006-03-28 02:09:39,812 [main] INFO  Continuum                      - 
2006-03-28 02:09:39,812 [main] INFO  Continuum                      - 
2006-03-28 02:09:39,813 [main] INFO  Continuum                      - < Continuum 1.0.3-SNAPSHOT started! >
2006-03-28 02:09:39,813 [main] INFO  Continuum                      - -------------------------------------
2006-03-28 02:09:39,813 [main] INFO  Continuum                      -        \   ^__^
2006-03-28 02:09:39,813 [main] INFO  Continuum                      -         \  (oo)\_______
2006-03-28 02:09:39,814 [main] INFO  Continuum                      -            (__)\       )\/\
2006-03-28 02:09:39,814 [main] INFO  Continuum                      -                ||----w |
2006-03-28 02:09:39,814 [main] INFO  Continuum                      -                ||     ||
2006-03-28 02:09:39,814 [main] INFO  Continuum                      - 
2006-03-28 02:09:39,814 [main] INFO  Continuum                      - 
2006-03-28 02:09:39,814 [main] INFO  ContinuumInitializer           - Continuum initializer running ...
2006-03-28 02:09:39,870 [main] INFO  SchedulesActivator             - Activating schedules ...
2006-03-28 02:09:39,875 [main] INFO  SchedulesActivator             - Tue Mar 28 03:00:00 PST 2006
2006-03-28 02:09:39,875 [main] INFO  PlexusContainer                - Loading on start [role,roleHint]: [org.codehaus.plexus.taskqueue.execution.TaskQueueExecutor,build-project]
2006-03-28 02:09:39,892 [main] ERROR VelocityComponent              - ResourceManager : unable to find resource 'CommonMacros.vm' in any resource loader.
2006-03-28 02:09:39,894 [main] INFO  Notifier:mail                  - The from mailbox is not configured, will use the nag email address from the project.
2006-03-28 02:09:39,894 [main] INFO  Notifier:mail                  - From name: Continuum@cheddar.simulalabs.com
2006-03-28 02:09:39,894 [main] INFO  Notifier:mail                  - Build host name: cheddar.simulalabs.com
2006-03-28 02:09:39,896 [main] INFO  RecipientSource                - To override address is not configured, will use the nag email address from the project.
2006-03-28 02:09:39,896 [main] INFO  TaskQueueExecutor:build-project - Starting task executor, thread name 'build-project'.
2006-03-28 02:09:39,897 [main] INFO  PlexusContainer                - Loading on start [role,roleHint]: [org.codehaus.plexus.taskqueue.execution.TaskQueueExecutor,check-out-project]
2006-03-28 02:09:39,897 [main] INFO  TaskQueueExecutor:check-out-project - Starting task executor, thread name 'check-out-project'.
-------------------------------------------------------------------------------
[2006.03.28 02:09:39] Integration test settings
-------------------------------------------------------------------------------
[2006.03.28 02:09:39] IT root: /home/continuum/continuum-maven/working-directory/149/target/it
[2006.03.28 02:09:39] Remoting method: jvm
[2006.03.28 02:09:39] Store implementation: class org.apache.maven.continuum.store.JdoContinuumStore
-------------------------------------------------------------------------------
[2006.03.28 02:09:39] Connecting to and starting Continuum
[2006.03.28 02:09:39] Removing all existing projects from Continuum.
[2006.03.28 02:09:39] Initializing Ant CVS project
2006-03-28 02:09:40,139 [Thread-102] INFO  ContinuumScm                   - Checking out project: 'Ant CVS Project', id: '21' to '/home/continuum/continuum-maven/working-directory/149/target/working-directory/21'.
2006-03-28 02:09:40,141 [Thread-102] INFO  ScmManager                     - Executing: cvs -z3 -f -d /home/continuum/continuum-maven/working-directory/149/target/it/cvs-root -q checkout -d 21 ant-cvs
2006-03-28 02:09:40,141 [Thread-102] INFO  ScmManager                     - Working directory: /home/continuum/continuum-maven/working-directory/149/target/working-directory
2006-03-28 02:09:40,182 [Thread-107] DEBUG ScmManager                     - U 21/build.xml
2006-03-28 02:09:40,186 [Thread-107] DEBUG ScmManager                     - U 21/src/main/java/Foo.java
2006-03-28 02:09:41,001 [Thread-102] INFO  ContinuumScm                   - Checked out 2 files.
[2006.03.28 02:09:41] Building CVS Ant project
2006-03-28 02:09:41,115 [main] INFO  Continuum                      - Enqueuing 'Ant CVS Project' (Build definition id=21).
2006-03-28 02:09:41,129 [Thread-101] WARN  SQL                            - Object with id "0" not found !
2006-03-28 02:09:41,166 [Thread-101] INFO  ContinuumScm                   - Updating project: id: '21', name 'Ant CVS Project'.
2006-03-28 02:09:41,169 [Thread-101] INFO  ScmManager                     - Executing: cvs -z3 -f -d /home/continuum/continuum-maven/working-directory/149/target/it/cvs-root -q update -d
2006-03-28 02:09:41,169 [Thread-101] INFO  ScmManager                     - Working directory: /home/continuum/continuum-maven/working-directory/149/target/working-directory/21
2006-03-28 02:09:41,231 [Thread-101] INFO  Action:update-project-from-working-directory - Updating project 'Ant CVS Project' from checkout.
2006-03-28 02:09:41,289 [Thread-101] WARN  ContinuumBuildExecutor:ant     - Could not find the executable 'ant' in this path: 
2006-03-28 02:09:41,289 [Thread-101] WARN  ContinuumBuildExecutor:ant     - Executable 'ant'.
2006-03-28 02:09:41,289 [Thread-101] INFO  ContinuumBuildExecutor:ant     - Arguments: -f build.xml -debug clean build
2006-03-28 02:09:41,290 [Thread-101] INFO  ContinuumBuildExecutor:ant     - Working directory: /home/continuum/continuum-maven/working-directory/149/target/working-directory/21
2006-03-28 02:09:42,946 [Thread-101] INFO  ContinuumBuildExecutor:ant     - Exit code: 0
2006-03-28 02:09:43,156 [main] INFO  Continuum                      - Remove project Ant CVS Project(21)
2006-03-28 02:09:43,202 [main] WARN  SQL                            - Object with id "21" not found !
[2006.03.28 02:09:43] Tearing down test - ignore any interrupted exceptions
2006-03-28 02:09:43,203 [main] INFO  TaskQueueExecutor:check-out-project - Executor thread got shutdown signal.
2006-03-28 02:09:43,203 [main] INFO  TaskQueueExecutor:check-out-project - Waiting until task executor 'check-out-project' is idling...
2006-03-28 02:09:43,203 [Thread-102] INFO  TaskQueueExecutor:check-out-project - Executor thread 'check-out-project' exited.
There was no such logger 'org.apache.maven.plugin.MavenPluginCollector' 2628846.
There was no such logger 'org.apache.maven.continuum.execution.ContinuumBuildExecutor:shell' 2628846.
There was no such logger 'org.codehaus.plexus.taskqueue.TaskQueue:check-out-project' 2628846.
There was no such logger 'org.apache.maven.continuum.buildcontroller.BuildController' 2628846.
There was no such logger 'org.apache.maven.continuum.scm.ContinuumScm' 2628846.
There was no such logger 'org.apache.maven.continuum.utils.WorkingDirectoryService' 2628846.
There was no such logger 'org.apache.maven.artifact.resolver.ArtifactResolver' 2628846.
There was no such logger 'org.apache.maven.continuum.execution.manager.BuildExecutorManager' 2628846.
There was no such logger 'org.codehaus.plexus.notification.RecipientSource' 2628846.
There was no such logger 'org.apache.maven.continuum.initialization.ContinuumInitializer' 2628846.
There was no such logger 'org.apache.maven.continuum.build.settings.SchedulesActivator' 2628846.
There was no such logger 'org.apache.maven.continuum.execution.ContinuumBuildExecutor:maven-1' 2628846.
There was no such logger 'org.codehaus.plexus.jdo.JdoFactory' 2628846.
There was no such logger 'org.codehaus.plexus.notification.notifier.Notifier:jabber' 2628846.
There was no such logger 'org.apache.maven.continuum.execution.maven.m1.MavenOneMetadataHelper' 2628846.
There was no such logger 'org.codehaus.plexus.action.Action:store-project' 2628846.
There was no such logger 'org.codehaus.plexus.taskqueue.TaskViabilityEvaluator:build-project' 2628846.
There was no such logger 'org.codehaus.plexus.notification.notifier.Notifier:mail' 2628846.
There was no such logger 'org.apache.maven.artifact.deployer.ArtifactDeployer' 2628846.
There was no such logger 'org.apache.maven.artifact.transform.ArtifactTransformation:snapshot' 2628846.
There was no such logger 'org.codehaus.plexus.msn.MsnClient' 2628846.
There was no such logger 'org.codehaus.plexus.action.Action:validate-project' 2628846.
There was no such logger 'org.codehaus.plexus.notification.notifier.Notifier:msn' 2628846.
There was no such logger 'org.apache.maven.artifact.manager.WagonManager' 2628846.
2006-03-28 02:09:43,208 [main] INFO  TaskQueueExecutor:build-project - Executor thread got shutdown signal.
2006-03-28 02:09:43,208 [main] INFO  TaskQueueExecutor:build-project - Waiting until task executor 'build-project' is idling...
2006-03-28 02:09:43,208 [Thread-101] INFO  TaskQueueExecutor:build-project - Executor thread 'build-project' exited.
There was no such logger 'org.codehaus.plexus.taskqueue.execution.TaskQueueExecutor:build-project' 2628846.
There was no such logger 'org.codehaus.plexus.action.Action:check-working-directory' 2628846.
There was no such logger 'org.apache.maven.profiles.MavenProfilesBuilder' 2628846.
There was no such logger 'org.apache.maven.continuum.store.ContinuumStore:jdo' 2628846.
There was no such logger 'org.codehaus.plexus.commandline.ExecutableResolver' 2628846.
2006-03-28 02:09:43,211 [main] INFO  Continuum                      - Stopping Continuum.
2006-03-28 02:09:43,211 [main] INFO  Continuum                      - Continuum stopped.
There was no such logger 'org.apache.maven.continuum.Continuum' 2628846.
There was no such logger 'org.codehaus.plexus.taskqueue.execution.TaskExecutor:check-out-project' 2628846.
There was no such logger 'org.codehaus.plexus.action.Action:update-working-directory-from-scm' 2628846.
There was no such logger 'org.codehaus.plexus.ircbot.IrcBot' 2628846.
There was no such logger 'org.apache.maven.continuum.configuration.ConfigurationService' 2628846.
There was no such logger 'org.apache.maven.continuum.execution.maven.m2.MavenBuilderHelper' 2628846.
There was no such logger 'org.codehaus.plexus.notification.notifier.Notifier:irc' 2628846.
There was no such logger 'org.codehaus.plexus.notification.notifier.manager.NotifierManager' 2628846.
There was no such logger 'org.codehaus.plexus.velocity.VelocityComponent' 2628846.
There was no such logger 'org.codehaus.plexus.action.Action:add-project-to-checkout-queue' 2628846.
There was no such logger 'org.codehaus.plexus.action.Action:checkout-project' 2628846.
There was no such logger 'org.apache.maven.settings.MavenSettingsBuilder' 2628846.
There was no such logger 'org.codehaus.plexus.action.ActionManager' 2628846.
There was no such logger 'org.codehaus.plexus.mailsender.MailSender' 2628846.
There was no such logger 'org.apache.maven.continuum.execution.ContinuumBuildExecutor:maven2' 2628846.
There was no such logger 'org.apache.maven.project.interpolation.ModelInterpolator' 2628846.
There was no such logger 'org.codehaus.plexus.notification.notifier.Notifier:console' 2628846.
There was no such logger 'org.apache.maven.continuum.utils.shell.ShellCommandHelper' 2628846.
There was no such logger 'org.codehaus.plexus.taskqueue.execution.TaskExecutor:build-project' 2628846.
There was no such logger 'org.codehaus.plexus.action.Action:store-checkout-scm-result' 2628846.
There was no such logger 'org.codehaus.plexus.action.Action:execute-builder' 2628846.
There was no such logger 'org.apache.maven.artifact.repository.metadata.RepositoryMetadataManager' 2628846.
There was no such logger 'org.apache.maven.artifact.transform.ArtifactTransformation:release' 2628846.
There was no such logger 'org.codehaus.plexus.jabber.JabberClient' 2628846.
Mar 28, 2006 2:09:43 AM org.quartz.core.QuartzScheduler shutdown
INFO: Scheduler defaultScheduler_$_NON_CLUSTERED shutting down.
Mar 28, 2006 2:09:43 AM org.quartz.core.QuartzScheduler pause
INFO: Scheduler defaultScheduler_$_NON_CLUSTERED paused.
Mar 28, 2006 2:09:43 AM org.quartz.core.QuartzScheduler shutdown
INFO: Scheduler defaultScheduler_$_NON_CLUSTERED shutdown complete.
There was no such logger 'org.codehaus.plexus.scheduler.Scheduler' 2628846.
There was no such logger 'org.apache.maven.continuum.notification.ContinuumNotificationDispatcher' 2628846.
There was no such logger 'org.apache.maven.project.MavenProjectBuilder' 2628846.
There was no such logger 'org.codehaus.plexus.action.Action:deploy-artifact' 2628846.
There was no such logger 'org.apache.maven.scm.manager.ScmManager' 2628846.
There was no such logger 'org.codehaus.plexus.action.Action:update-project-from-working-directory' 2628846.
There was no such logger 'org.apache.maven.artifact.transform.ArtifactTransformation:latest' 2628846.
[2006.03.28 02:09:43] Used 4594ms
[surefire] Tests run: 2, Failures: 0, Errors: 0, Time elapsed: 10.896 sec
[INFO] [jar:jar]
[INFO] Building jar: /home/continuum/continuum-maven/working-directory/149/target/continuum-core-it-1.0.3-SNAPSHOT.jar
[INFO] [install:install]
[INFO] Installing /home/continuum/continuum-maven/working-directory/149/target/continuum-core-it-1.0.3-SNAPSHOT.jar to /home/continuum/.m2/repository/org/apache/maven/continuum/continuum-core-it/1.0.3-SNAPSHOT/continuum-core-it-1.0.3-SNAPSHOT.jar
[INFO] ----------------------------------------------------------------------------
[INFO] BUILD SUCCESSFUL
[INFO] ----------------------------------------------------------------------------
[INFO] Total time: 7 minutes 44 seconds
[INFO] Finished at: Tue Mar 28 02:09:43 PST 2006
[INFO] Final Memory: 32M/144M
[INFO] ----------------------------------------------------------------------------

****************************************************************************



Mime
View raw message