maven-notifications mailing list archives

Site index · List index
Message view « Date » · « Thread »
Top « Date » · « Thread »
From Continuum Build Server <contin...@ci.codehaus.org>
Subject [continuum] BUILD FAILURE: Maven Repository Converter
Date Fri, 17 Mar 2006 08:42:32 GMT
Online report : http://ci.codehaus.org/continuum-maven/servlet/continuum/target/ProjectBuild.vm/view/ProjectBuild/id/4/buildId/297
Build statistics:
  State: Failed
  Previous Build: No previous build.
  Started at: Fri, 17 Mar 2006 00:42:21 -0800
  Finished at: Fri, 17 Mar 2006 00:42:32 -0800
  Total time: 10s
  Build Trigger: Schedule
  Exit code: 1
  Building machine hostname: cheddar.simulalabs.com
  Operating system : Linux(unknown)
  Java version : 1.5.0_03(Sun Microsystems Inc.)

Changes
      No files changed
  
****************************************************************************
Output:
****************************************************************************
[INFO] Scanning for projects...
[INFO] ----------------------------------------------------------------------------
[INFO] Building Maven Repository Converter
[INFO]    task-segment: [clean, install]
[INFO] ----------------------------------------------------------------------------
[INFO] [clean:clean]
[INFO] Deleting directory /home/nobody/continuum-maven/working-directory/4/target
[INFO] Deleting directory /home/nobody/continuum-maven/working-directory/4/target/classes
[INFO] Deleting directory /home/nobody/continuum-maven/working-directory/4/target/test-classes
[INFO] [plexus:descriptor {execution: default}]
[INFO] [resources:resources]
[INFO] Using default encoding to copy filtered resources.
[INFO] snapshot org.apache.maven.repository:maven-repository-reports-standard:1.0-SNAPSHOT:
checking for updates from apache.snapshots
[WARNING] 
	Artifact junit:junit:jar:3.8.1:test retains local scope 'test' overriding broader scope 'compile'
	given by a dependency. If this is not intended, modify or remove the local scope.

Downloading: http://repo1.maven.org/maven2/org/apache/maven/maven-model-converter/2.0.2/maven-model-converter-2.0.2.pom
1K downloaded
Downloading: http://repo1.maven.org/maven2/org/apache/maven/maven-model-converter/2.0.2/maven-model-converter-2.0.2.jar
17K downloaded
[INFO] [compiler:compile]
Compiling 7 source files to /home/nobody/continuum-maven/working-directory/4/target/classes
[INFO] [resources:testResources]
[INFO] Using default encoding to copy filtered resources.
[INFO] [compiler:testCompile]
Compiling 1 source file to /home/nobody/continuum-maven/working-directory/4/target/test-classes
[INFO] [surefire:test]
[INFO] Setting reports dir: /home/nobody/continuum-maven/working-directory/4/target/surefire-reports

-------------------------------------------------------
 T E S T S
-------------------------------------------------------
[surefire] Running org.apache.maven.repository.converter.RepositoryConverterTest
[surefire] Tests run: 22, Failures: 1, Errors: 0, Time elapsed: 0.024 sec <<<<<<<<
FAILURE !! 

Results :
[surefire] Tests run: 22, Failures: 1, Errors: 0

[INFO] ----------------------------------------------------------------------------
[ERROR] BUILD ERROR
[INFO] ----------------------------------------------------------------------------
[INFO] There are some test failure.
[INFO] ----------------------------------------------------------------------------
[INFO] For more information, run Maven with the -e switch
[INFO] ----------------------------------------------------------------------------
[INFO] Total time: 9 seconds
[INFO] Finished at: Fri Mar 17 00:42:32 PST 2006
[INFO] Final Memory: 12M/156M
[INFO] ----------------------------------------------------------------------------

****************************************************************************



Mime
View raw message