maven-notifications mailing list archives

Site index · List index
Message view « Date » · « Thread »
Top « Date » · « Thread »
From Continuum Build Server <contin...@ci.codehaus.org>
Subject [continuum] BUILD FAILURE: Maven Release plugin
Date Thu, 30 Mar 2006 10:03:51 GMT
Online report : http://ci.codehaus.org/continuum-maven/servlet/continuum/target/ProjectBuild.vm/view/ProjectBuild/id/54/buildId/560
Build statistics:
  State: Failed
  Previous State: Failed
  Started at: Thu, 30 Mar 2006 02:03:37 -0800
  Finished at: Thu, 30 Mar 2006 02:03:51 -0800
  Total time: 14s
  Build Trigger: Schedule
  Exit code: 1
  Building machine hostname: cheddar.simulalabs.com
  Operating system : Linux(unknown)
  Java version : 1.5.0_03(Sun Microsystems Inc.)

Changes
         carlos          Avoid problems with java sources encoding
             /maven/plugins/trunk/maven-release-plugin/src/test/java/org/apache/maven/plugins/release/PrepareReleaseMojoTest.java
        
****************************************************************************
Output:
****************************************************************************
[INFO] Scanning for projects...
[INFO] ----------------------------------------------------------------------------
[INFO] Building Maven Release plugin
[INFO]    task-segment: [clean, install]
[INFO] ----------------------------------------------------------------------------
[INFO] [clean:clean]
[INFO] Deleting directory /home/continuum/continuum-maven/working-directory/54/target
[INFO] Deleting directory /home/continuum/continuum-maven/working-directory/54/target/classes
[INFO] Deleting directory /home/continuum/continuum-maven/working-directory/54/target/test-classes
[INFO] [plugin:descriptor]
[INFO] Using 2 extractors.
[INFO] Applying extractor for language: java
[INFO] Extractor for language: java found 2 mojo descriptors.
[INFO] Applying extractor for language: bsh
[INFO] Extractor for language: bsh found 0 mojo descriptors.
[INFO] [resources:resources]
[INFO] Using default encoding to copy filtered resources.
[INFO] snapshot org.apache.maven.scm:maven-scm-provider-perforce:1.0-beta-3-SNAPSHOT: checking
for updates from apache.snapshots
[INFO] snapshot org.apache.maven.scm:maven-scm-provider-bazaar:1.0-beta-3-SNAPSHOT: checking
for updates from apache.snapshots
[INFO] [compiler:compile]
Compiling 10 source files to /home/continuum/continuum-maven/working-directory/54/target/classes
[INFO] [resources:testResources]
[INFO] Using default encoding to copy filtered resources.
[INFO] [compiler:testCompile]
Compiling 2 source files to /home/continuum/continuum-maven/working-directory/54/target/test-classes
[INFO] [surefire:test]
[INFO] Setting reports dir: /home/continuum/continuum-maven/working-directory/54/target/surefire-reports

-------------------------------------------------------
 T E S T S
-------------------------------------------------------
[surefire] Running org.apache.maven.plugins.release.PrepareReleaseMojoTest
[surefire] Tests run: 2, Failures: 1, Errors: 0, Time elapsed: 0.757 sec <<<<<<<<
FAILURE !! 
[surefire] Running org.apache.maven.plugins.release.versions.DefaultVersionInfoTest
[surefire] Tests run: 19, Failures: 0, Errors: 0, Time elapsed: 0.821 sec
[INFO] ----------------------------------------------------------------------------
[ERROR] BUILD ERROR
[INFO] ----------------------------------------------------------------------------
[INFO] There are test failures.
[INFO] ----------------------------------------------------------------------------
[INFO] For more information, run Maven with the -e switch
[INFO] ----------------------------------------------------------------------------
[INFO] Total time: 13 seconds
[INFO] Finished at: Thu Mar 30 02:03:51 PST 2006
[INFO] Final Memory: 13M/157M
[INFO] ----------------------------------------------------------------------------

****************************************************************************



Mime
View raw message