maven-notifications mailing list archives

Site index · List index
Message view « Date » · « Thread »
Top « Date » · « Thread »
From Continuum Build Server <contin...@ci.codehaus.org>
Subject [continuum] BUILD FAILURE: Doxia Core
Date Fri, 17 Mar 2006 05:58:13 GMT
Online report : http://ci.codehaus.org/continuum-maven/servlet/continuum/target/ProjectBuild.vm/view/ProjectBuild/id/12/buildId/141
Build statistics:
  State: Failed
  Previous State: Failed
  Started at: Thu, 16 Mar 2006 21:57:20 -0800
  Finished at: Thu, 16 Mar 2006 21:57:40 -0800
  Total time: 20s
  Build Trigger: Forced
  Exit code: 1
  Building machine hostname: cheddar.simulalabs.com
  Operating system : Linux(unknown)
  Java version : 1.5.0_03(Sun Microsystems Inc.)

Changes
      No files changed
  
****************************************************************************
Output:
****************************************************************************
[INFO] Scanning for projects...
[INFO] ----------------------------------------------------------------------------
[INFO] Building Doxia Core
[INFO]    task-segment: [clean, install]
[INFO] ----------------------------------------------------------------------------
[INFO] [clean:clean]
[INFO] Deleting directory /home/nobody/continuum-maven/working-directory/12/target
[WARNING] 
  This artifact has been relocated to javax.servlet:servlet-api:2.2.


[WARNING] 
  This artifact has been relocated to javax.servlet:servlet-api:2.2.


[INFO] [plexus:descriptor {execution: default}]
[INFO] [resources:resources]
[INFO] Using default encoding to copy filtered resources.
[INFO] snapshot org.apache.maven.doxia:doxia-sink-api:1.0-alpha-8-SNAPSHOT: checking for updates
from apache.snapshots
[INFO] [compiler:compile]
Compiling 79 source files to /home/nobody/continuum-maven/working-directory/12/target/classes
[INFO] [resources:testResources]
[INFO] Using default encoding to copy filtered resources.
[INFO] [compiler:testCompile]
Compiling 10 source files to /home/nobody/continuum-maven/working-directory/12/target/test-classes
[INFO] [surefire:test]
[INFO] Setting reports dir: /home/nobody/continuum-maven/working-directory/12/target/surefire-reports

-------------------------------------------------------
 T E S T S
-------------------------------------------------------
[surefire] Running org.apache.maven.doxia.module.rtf.RtfSinkTest
[surefire] Tests run: 1, Failures: 0, Errors: 1, Time elapsed: 0.282 sec <<<<<<<<
FAILURE !! 
[surefire] Running org.apache.maven.doxia.module.fml.FmlParserTest
[surefire] Tests run: 1, Failures: 0, Errors: 0, Time elapsed: 0.061 sec
[surefire] Running org.apache.maven.doxia.module.xdoc.XdocSinkTest
[surefire] Tests run: 1, Failures: 0, Errors: 0, Time elapsed: 0.04 sec
[surefire] Running org.apache.maven.doxia.module.xdoc.XdocParserTest
[surefire] Tests run: 1, Failures: 0, Errors: 0, Time elapsed: 0.031 sec
[surefire] Running org.apache.maven.doxia.module.xhtml.XhtmlParserTest
[surefire] Tests run: 1, Failures: 0, Errors: 0, Time elapsed: 0.036 sec
[surefire] Running org.apache.maven.doxia.module.xhtml.XhtmlSinkTest
[surefire] Tests run: 1, Failures: 0, Errors: 0, Time elapsed: 0.048 sec
[surefire] Running org.apache.maven.doxia.module.latex.LatexSinkTest
[surefire] Tests run: 1, Failures: 0, Errors: 0, Time elapsed: 0.08 sec

Results :
[surefire] Tests run: 7, Failures: 0, Errors: 1

[INFO] ----------------------------------------------------------------------------
[ERROR] BUILD ERROR
[INFO] ----------------------------------------------------------------------------
[INFO] There are some test failure.
[INFO] ----------------------------------------------------------------------------
[INFO] For more information, run Maven with the -e switch
[INFO] ----------------------------------------------------------------------------
[INFO] Total time: 10 seconds
[INFO] Finished at: Thu Mar 16 21:57:39 PST 2006
[INFO] Final Memory: 11M/156M
[INFO] ----------------------------------------------------------------------------

****************************************************************************



Mime
View raw message