maven-m2-dev mailing list archives

Site index · List index
Message view « Date » · « Thread »
Top « Date » · « Thread »
From jvan...@maven.org
Subject [maven2 build] Fri Sep 17 18:07:01 EDT 2004
Date Fri, 17 Sep 2004 22:07:52 GMT

Performing an update of maven-components ...

Updates occured, build required ...

P maven-core/pom.xml
P maven-core/src/bin/classworlds.conf
P maven-core/src/main/java/org/apache/maven/MavenConstants.java
P maven-model/maven.mdo

-----------------------------------------------------------------------
 Building mboot ... 
-----------------------------------------------------------------------
-----------------------------------------------------------------------
 Building maven2 components ... 
-----------------------------------------------------------------------
Maven installation directory: /home/projects/maven/m2
Using the following for your local repository: /home/projects/maven/maven-repo-local
Using the following for your remote repositories: [http://www.ibiblio.org/maven/]
Checking for MBoot's dependencies ...
Downloading http://www.ibiblio.org/maven/modello/jars/modello-1.0-SNAPSHOT.jar
Downloading http://www.ibiblio.org/maven/xstream/jars/xstream-1.0-SNAPSHOT.jar
Downloading http://www.ibiblio.org/maven/maven/jars/wagon-http-lightweight-1.0-alpha-1-SNAPSHOT.jar
Installing POM: /home/projects/maven/maven-repo-local/maven/poms/maven-component-2.0-SNAPSHOT.pom
Installing POM: /home/projects/maven/maven-repo-local/maven/poms/maven-plugin-parent-2.0-SNAPSHOT.pom
Building project in /home/projects/maven/m2-build/maven-components/maven-model ...
--------------------------------------------------------------------
Building project in /home/projects/maven/m2-build/maven-components/maven-model
Cleaning /home/projects/maven/m2-build/maven-components/maven-model/target...
Downloading dependencies ...
Downloading http://www.ibiblio.org/maven/plexus/jars/plexus-0.17-SNAPSHOT.jar
Artifact not found at [http://www.ibiblio.org/maven/plexus/jars/plexus-0.17-SNAPSHOT.jar]
Downloading http://www.ibiblio.org/maven/classworlds/jars/classworlds-1.1-SNAPSHOT.jar
Model exists!
Generating java in /home/projects/maven/m2-build/maven-components/maven-model/target/generated-sources
from /home/projects/maven/m2-build/maven-components/maven-model/maven.mdo
Generating java in /home/projects/maven/m2-build/maven-components/maven-model/target/generated-sources
from /home/projects/maven/m2-build/maven-components/maven-model/maven.mdo
Generating xpp3 unmarshaller in /home/projects/maven/m2-build/maven-components/maven-model/target/generated-sources
from /home/projects/maven/m2-build/maven-components/maven-model/maven.mdo
Generating xpp3 marshaller in /home/projects/maven/m2-build/maven-components/maven-model/target/generated-sources
from /home/projects/maven/m2-build/maven-components/maven-model/maven.mdo
Generating xpp3 unmarshaller in /home/projects/maven/m2-build/maven-components/maven-model/target/generated-sources
from /home/projects/maven/m2-build/maven-components/maven-model/maven.mdo
Generating xpp3 marshaller in /home/projects/maven/m2-build/maven-components/maven-model/target/generated-sources
from /home/projects/maven/m2-build/maven-components/maven-model/maven.mdo
Compiling sources ...
Packaging resources ...
Compiling test sources ...
Packaging test resources ...

-------------------------------------------------------
 T E S T S
-------------------------------------------------------
There are no test to run.

Resume :
[surefire] Tests run: 0, Failures: 0, Errors: 0

Installing POM: /home/projects/maven/maven-repo-local/maven/poms/maven-model-2.0-SNAPSHOT.pom
Installing JAR: /home/projects/maven/maven-repo-local/maven/jars/maven-model-2.0-SNAPSHOT.jar
--------------------------------------------------------------------
Building project in /home/projects/maven/m2-build/maven-components/maven-plugin ...
--------------------------------------------------------------------
Building project in /home/projects/maven/m2-build/maven-components/maven-plugin
Cleaning /home/projects/maven/m2-build/maven-components/maven-plugin/target...
Downloading dependencies ...
Compiling sources ...
Packaging resources ...
Compiling test sources ...
Packaging test resources ...

-------------------------------------------------------
 T E S T S
-------------------------------------------------------
[surefire] Running org.apache.maven.plugin.BeanTest
[surefire] Tests run: 1, Failures: 0, Errors: 0, Time elapsed: 0.005 sec
[surefire] Running org.apache.maven.plugin.TestPluginTest
[surefire] Tests run: 1, Failures: 0, Errors: 0, Time elapsed: 0 sec
There are no test to run.

Resume :
[surefire] Tests run: 2, Failures: 0, Errors: 0

Installing POM: /home/projects/maven/maven-repo-local/maven/poms/maven-plugin-2.0-SNAPSHOT.pom
Installing JAR: /home/projects/maven/maven-repo-local/maven/jars/maven-plugin-2.0-SNAPSHOT.jar
--------------------------------------------------------------------
Building project in /home/projects/maven/m2-build/maven-components/maven-plugin-tools ...
--------------------------------------------------------------------
Building project in /home/projects/maven/m2-build/maven-components/maven-plugin-tools
Cleaning /home/projects/maven/m2-build/maven-components/maven-plugin-tools/target...
Downloading dependencies ...
Downloading http://www.ibiblio.org/maven/maven/jars/maven-plugin-2.0-SNAPSHOT.jar
Compiling sources ...
Packaging resources ...
Compiling test sources ...
Packaging test resources ...

-------------------------------------------------------
 T E S T S
-------------------------------------------------------
[surefire] Running org.apache.maven.plugin.generator.jelly.JellyHarnessGeneratorTest
[surefire] Tests run: 1, Failures: 0, Errors: 0, Time elapsed: 0.117 sec
[surefire] Running org.apache.maven.plugin.generator.BeanGeneratorTest
[surefire] Tests run: 1, Failures: 0, Errors: 0, Time elapsed: 0.061 sec
[surefire] Running org.apache.maven.plugin.generator.PluginDescriptorGeneratorTest
[surefire] Tests run: 1, Failures: 0, Errors: 0, Time elapsed: 0.112 sec
[surefire] Running org.apache.maven.plugin.generator.PluginXdocGeneratorTest
[surefire] Tests run: 1, Failures: 0, Errors: 0, Time elapsed: 0.008 sec
There are no test to run.

Resume :
[surefire] Tests run: 4, Failures: 0, Errors: 0

Installing POM: /home/projects/maven/maven-repo-local/maven/poms/maven-plugin-tools-2.0-SNAPSHOT.pom
Installing JAR: /home/projects/maven/maven-repo-local/maven/jars/maven-plugin-tools-2.0-SNAPSHOT.jar
--------------------------------------------------------------------
Building project in /home/projects/maven/m2-build/maven-components/maven-artifact ...
--------------------------------------------------------------------
Building project in /home/projects/maven/m2-build/maven-components/maven-artifact
Cleaning /home/projects/maven/m2-build/maven-components/maven-artifact/target...
Downloading dependencies ...
Downloading http://www.ibiblio.org/maven/maven/jars/wagon-api-0.9-SNAPSHOT.jar
Downloading http://www.ibiblio.org/maven/maven/jars/wagon-http-lightweight-0.9-SNAPSHOT.jar
Compiling sources ...
Packaging resources ...
Compiling test sources ...
Packaging test resources ...

-------------------------------------------------------
 T E S T S
-------------------------------------------------------
[surefire] Running org.apache.maven.artifact.deployer.ArtifactDeployerTest
[surefire] Tests run: 1, Failures: 0, Errors: 0, Time elapsed: 0.288 sec
[INFO] Installing /home/projects/maven/m2-build/maven-components/maven-artifact/src/test/resources/artifact-install/artifact-1.0.jar
to target/test-classes/repositories/installer/local-repository/maven/jars/artifact-1.0.jar
[surefire] Running org.apache.maven.artifact.installer.ArtifactInstallerTest
[surefire] Tests run: 1, Failures: 0, Errors: 0, Time elapsed: 0.031 sec
[ERROR] Nonexistent component: org.apache.maven.wagon.Wagond
[surefire] Running org.apache.maven.artifact.manager.DefaultWagonManagerTest
[surefire] Tests run: 1, Failures: 0, Errors: 0, Time elapsed: 0.034 sec
[surefire] Running org.apache.maven.artifact.resolver.ArtifactResolverTest
[surefire] Tests run: 8, Failures: 0, Errors: 0, Time elapsed: 0.029 sec
There are no test to run.

Resume :
[surefire] Tests run: 11, Failures: 0, Errors: 0

Installing POM: /home/projects/maven/maven-repo-local/maven/poms/maven-artifact-2.0-SNAPSHOT.pom
Installing JAR: /home/projects/maven/maven-repo-local/maven/jars/maven-artifact-2.0-SNAPSHOT.jar
--------------------------------------------------------------------
Building project in /home/projects/maven/m2-build/maven-components/maven-core ...
--------------------------------------------------------------------
Building project in /home/projects/maven/m2-build/maven-components/maven-core
Cleaning /home/projects/maven/m2-build/maven-components/maven-core/target...
Downloading dependencies ...
Downloading http://www.ibiblio.org/maven/plexus/jars/plexus-artifact-container-1.0-alpha-1-SNAPSHOT.jar
Artifact not found at [http://www.ibiblio.org/maven/plexus/jars/plexus-artifact-container-1.0-alpha-1-SNAPSHOT.jar]
Downloading http://www.ibiblio.org/maven/maven/jars/maven-model-2.0-SNAPSHOT.jar
Downloading http://www.ibiblio.org/maven/maven/jars/maven-artifact-2.0-SNAPSHOT.jar
Downloading http://www.ibiblio.org/maven/maven/jars/wagon-api-1.0-alpha-1-SNAPSHOT.jar
Compiling sources ...
Packaging resources ...
Compiling test sources ...
Packaging test resources ...

-------------------------------------------------------
 T E S T S
-------------------------------------------------------
[surefire] Running org.apache.maven.lifecycle.goal.phase.GoalResolutionPhaseTest
[surefire] Tests run: 5, Failures: 0, Errors: 0, Time elapsed: 0.038 sec
[surefire] Running org.apache.maven.lifecycle.MavenLifecycleManagerTest
[surefire] Tests run: 1, Failures: 0, Errors: 0, Time elapsed: 0.052 sec
[surefire] Running org.apache.maven.plugin.OgnlProjectValueExtractorTest
[surefire] Tests run: 3, Failures: 0, Errors: 0, Time elapsed: 0.217 sec
[surefire] Running org.apache.maven.plugin.PluginTest
[surefire] Tests run: 1, Failures: 0, Errors: 0, Time elapsed: 0.045 sec
[surefire] Running org.apache.maven.project.ProjectBaseDirectoryAlignmentTest
[surefire] Tests run: 1, Failures: 0, Errors: 0, Time elapsed: 0.052 sec
[surefire] Running org.apache.maven.project.inheritance.t00.ProjectInheritanceTest
[surefire] Tests run: 1, Failures: 0, Errors: 0, Time elapsed: 0.045 sec
[surefire] Running org.apache.maven.project.inheritance.t01.ProjectInheritanceTest
[surefire] Tests run: 1, Failures: 0, Errors: 0, Time elapsed: 0.055 sec
[surefire] Running org.apache.maven.project.inheritance.DefaultModelInheritanceAssemblerTest
[surefire] Tests run: 1, Failures: 0, Errors: 0, Time elapsed: 0.001 sec
[surefire] Running org.apache.maven.project.validation.DefaultModelValidatorTest
[surefire] Tests run: 5, Failures: 0, Errors: 0, Time elapsed: 0.029 sec
There are no test to run.

Resume :
[surefire] Tests run: 19, Failures: 0, Errors: 0

Installing POM: /home/projects/maven/maven-repo-local/maven/poms/maven-core-2.0-SNAPSHOT.pom
Installing JAR: /home/projects/maven/maven-repo-local/maven/jars/maven-core-2.0-SNAPSHOT.jar
--------------------------------------------------------------------
Building project in /home/projects/maven/m2-build/maven-components/maven-core-it-verifier
...
--------------------------------------------------------------------
Building project in /home/projects/maven/m2-build/maven-components/maven-core-it-verifier
Cleaning /home/projects/maven/m2-build/maven-components/maven-core-it-verifier/target...
Downloading dependencies ...
Compiling sources ...
Packaging resources ...
Compiling test sources ...
Packaging test resources ...

-------------------------------------------------------
 T E S T S
-------------------------------------------------------
There are no test to run.

Resume :
[surefire] Tests run: 0, Failures: 0, Errors: 0

Installing POM: /home/projects/maven/maven-repo-local/maven/poms/maven-core-it-verifier-1.0.pom
Installing JAR: /home/projects/maven/maven-repo-local/maven/jars/maven-core-it-verifier-1.0.jar
--------------------------------------------------------------------
Building project in /home/projects/maven/m2-build/maven-components/maven-plugins/maven-clean-plugin
...
--------------------------------------------------------------------
Building project in /home/projects/maven/m2-build/maven-components/maven-plugins/maven-clean-plugin
Cleaning /home/projects/maven/m2-build/maven-components/maven-plugins/maven-clean-plugin/target...
Downloading dependencies ...
Compiling sources ...
Generating maven plugin descriptor ...
Packaging resources ...
Compiling test sources ...
Packaging test resources ...

-------------------------------------------------------
 T E S T S
-------------------------------------------------------
There are no test to run.

Resume :
[surefire] Tests run: 0, Failures: 0, Errors: 0

Installing POM: /home/projects/maven/maven-repo-local/maven/poms/maven-clean-plugin-1.0-SNAPSHOT.pom
Installing Plugin: /home/projects/maven/maven-repo-local/maven/plugins/maven-clean-plugin-1.0-SNAPSHOT.jar
--------------------------------------------------------------------
Building project in /home/projects/maven/m2-build/maven-components/maven-plugins/maven-compiler-plugin
...
--------------------------------------------------------------------
Building project in /home/projects/maven/m2-build/maven-components/maven-plugins/maven-compiler-plugin
Cleaning /home/projects/maven/m2-build/maven-components/maven-plugins/maven-compiler-plugin/target...
Downloading dependencies ...
Compiling sources ...
Generating maven plugin descriptor ...
Packaging resources ...
Compiling test sources ...
Packaging test resources ...

-------------------------------------------------------
 T E S T S
-------------------------------------------------------
There are no test to run.

Resume :
[surefire] Tests run: 0, Failures: 0, Errors: 0

Installing POM: /home/projects/maven/maven-repo-local/maven/poms/maven-compiler-plugin-1.0-SNAPSHOT.pom
Installing Plugin: /home/projects/maven/maven-repo-local/maven/plugins/maven-compiler-plugin-1.0-SNAPSHOT.jar
--------------------------------------------------------------------
Building project in /home/projects/maven/m2-build/maven-components/maven-plugins/maven-install-plugin
...
--------------------------------------------------------------------
Building project in /home/projects/maven/m2-build/maven-components/maven-plugins/maven-install-plugin
Cleaning /home/projects/maven/m2-build/maven-components/maven-plugins/maven-install-plugin/target...
Downloading dependencies ...
Downloading http://www.ibiblio.org/maven/maven/jars/maven-core-2.0-SNAPSHOT.jar
Compiling sources ...
Generating maven plugin descriptor ...
Packaging resources ...
Compiling test sources ...
Packaging test resources ...

-------------------------------------------------------
 T E S T S
-------------------------------------------------------
There are no test to run.

Resume :
[surefire] Tests run: 0, Failures: 0, Errors: 0

Installing POM: /home/projects/maven/maven-repo-local/maven/poms/maven-install-plugin-1.0-SNAPSHOT.pom
Installing Plugin: /home/projects/maven/maven-repo-local/maven/plugins/maven-install-plugin-1.0-SNAPSHOT.jar
--------------------------------------------------------------------
Building project in /home/projects/maven/m2-build/maven-components/maven-plugins/maven-jar-plugin
...
--------------------------------------------------------------------
Building project in /home/projects/maven/m2-build/maven-components/maven-plugins/maven-jar-plugin
Cleaning /home/projects/maven/m2-build/maven-components/maven-plugins/maven-jar-plugin/target...
Downloading dependencies ...
Compiling sources ...
Generating maven plugin descriptor ...
Packaging resources ...
Compiling test sources ...
Packaging test resources ...

-------------------------------------------------------
 T E S T S
-------------------------------------------------------
There are no test to run.

Resume :
[surefire] Tests run: 0, Failures: 0, Errors: 0

Installing POM: /home/projects/maven/maven-repo-local/maven/poms/maven-jar-plugin-1.0-SNAPSHOT.pom
Installing Plugin: /home/projects/maven/maven-repo-local/maven/plugins/maven-jar-plugin-1.0-SNAPSHOT.jar
--------------------------------------------------------------------
Building project in /home/projects/maven/m2-build/maven-components/maven-plugins/maven-plugin-plugin
...
--------------------------------------------------------------------
Building project in /home/projects/maven/m2-build/maven-components/maven-plugins/maven-plugin-plugin
Cleaning /home/projects/maven/m2-build/maven-components/maven-plugins/maven-plugin-plugin/target...
Downloading dependencies ...
Downloading http://www.ibiblio.org/maven/maven/jars/maven-plugin-tools-2.0-SNAPSHOT.jar
Artifact not found at [http://www.ibiblio.org/maven/maven/jars/maven-plugin-tools-2.0-SNAPSHOT.jar]
Compiling sources ...
Generating maven plugin descriptor ...
Packaging resources ...
Compiling test sources ...
Packaging test resources ...

-------------------------------------------------------
 T E S T S
-------------------------------------------------------
There are no test to run.

Resume :
[surefire] Tests run: 0, Failures: 0, Errors: 0

Installing POM: /home/projects/maven/maven-repo-local/maven/poms/maven-plugin-plugin-1.0-SNAPSHOT.pom
Installing Plugin: /home/projects/maven/maven-repo-local/maven/plugins/maven-plugin-plugin-1.0-SNAPSHOT.jar
--------------------------------------------------------------------
Building project in /home/projects/maven/m2-build/maven-components/maven-plugins/maven-pom-plugin
...
--------------------------------------------------------------------
Building project in /home/projects/maven/m2-build/maven-components/maven-plugins/maven-pom-plugin
Cleaning /home/projects/maven/m2-build/maven-components/maven-plugins/maven-pom-plugin/target...
Downloading dependencies ...
Compiling sources ...
Generating maven plugin descriptor ...
Packaging resources ...
Compiling test sources ...
Packaging test resources ...

-------------------------------------------------------
 T E S T S
-------------------------------------------------------
There are no test to run.

Resume :
[surefire] Tests run: 0, Failures: 0, Errors: 0

Installing POM: /home/projects/maven/maven-repo-local/maven/poms/maven-pom-plugin-1.0-SNAPSHOT.pom
Installing Plugin: /home/projects/maven/maven-repo-local/maven/plugins/maven-pom-plugin-1.0-SNAPSHOT.jar
--------------------------------------------------------------------
Building project in /home/projects/maven/m2-build/maven-components/maven-plugins/maven-resources-plugin
...
--------------------------------------------------------------------
Building project in /home/projects/maven/m2-build/maven-components/maven-plugins/maven-resources-plugin
Cleaning /home/projects/maven/m2-build/maven-components/maven-plugins/maven-resources-plugin/target...
Downloading dependencies ...
Compiling sources ...
Generating maven plugin descriptor ...
Packaging resources ...
Compiling test sources ...
Packaging test resources ...

-------------------------------------------------------
 T E S T S
-------------------------------------------------------
There are no test to run.

Resume :
[surefire] Tests run: 0, Failures: 0, Errors: 0

Installing POM: /home/projects/maven/maven-repo-local/maven/poms/maven-resources-plugin-1.0-SNAPSHOT.pom
Installing Plugin: /home/projects/maven/maven-repo-local/maven/plugins/maven-resources-plugin-1.0-SNAPSHOT.jar
--------------------------------------------------------------------
Building project in /home/projects/maven/m2-build/maven-components/maven-plugins/maven-surefire-plugin
...
--------------------------------------------------------------------
Building project in /home/projects/maven/m2-build/maven-components/maven-plugins/maven-surefire-plugin
Cleaning /home/projects/maven/m2-build/maven-components/maven-plugins/maven-surefire-plugin/target...
Downloading dependencies ...
Compiling sources ...
Generating maven plugin descriptor ...
Packaging resources ...
Compiling test sources ...
Packaging test resources ...

-------------------------------------------------------
 T E S T S
-------------------------------------------------------
There are no test to run.

Resume :
[surefire] Tests run: 0, Failures: 0, Errors: 0

Installing POM: /home/projects/maven/maven-repo-local/maven/poms/maven-surefire-plugin-1.0-SNAPSHOT.pom
Installing Plugin: /home/projects/maven/maven-repo-local/maven/plugins/maven-surefire-plugin-1.0-SNAPSHOT.jar
--------------------------------------------------------------------
Executing "chmod +x /home/projects/maven/m2/bin/m2"

Maven2 is installed in /home/projects/maven/m2
--------------------------------------------------------------------

Total time: 39 seconds
Finished at: Fri Sep 17 18:07:52 EDT 2004

Running maven-core integration tests ...

it0000... FAILED
org.apache.maven.it.VerificationException: java.lang.reflect.InvocationTargetException
	at org.apache.maven.it.Verifier.executeGoals(Verifier.java:320)
	at org.apache.maven.it.Verifier.main(Verifier.java:369)
Caused by: java.lang.reflect.InvocationTargetException
	at sun.reflect.NativeMethodAccessorImpl.invoke0(Native Method)
	at sun.reflect.NativeMethodAccessorImpl.invoke(NativeMethodAccessorImpl.java:39)
	at sun.reflect.DelegatingMethodAccessorImpl.invoke(DelegatingMethodAccessorImpl.java:25)
	at java.lang.reflect.Method.invoke(Method.java:324)
	at org.apache.maven.it.Verifier.executeGoals(Verifier.java:314)
	... 1 more
Caused by: java.io.FileNotFoundException: /home/projects/maven/m2/lib/plexus-artifact-container-1.0-alpha-1.jar
	at org.codehaus.classworlds.Configurator.configure(Configurator.java:340)
	at org.codehaus.classworlds.Launcher.configure(Launcher.java:144)
	at org.codehaus.classworlds.Launcher.mainWithExitCode(Launcher.java:412)
	... 6 more
it0001... FAILED
org.apache.maven.it.VerificationException: java.lang.reflect.InvocationTargetException
	at org.apache.maven.it.Verifier.executeGoals(Verifier.java:320)
	at org.apache.maven.it.Verifier.main(Verifier.java:369)
Caused by: java.lang.reflect.InvocationTargetException
	at sun.reflect.NativeMethodAccessorImpl.invoke0(Native Method)
	at sun.reflect.NativeMethodAccessorImpl.invoke(NativeMethodAccessorImpl.java:39)
	at sun.reflect.DelegatingMethodAccessorImpl.invoke(DelegatingMethodAccessorImpl.java:25)
	at java.lang.reflect.Method.invoke(Method.java:324)
	at org.apache.maven.it.Verifier.executeGoals(Verifier.java:314)
	... 1 more
Caused by: java.io.FileNotFoundException: /home/projects/maven/m2/lib/plexus-artifact-container-1.0-alpha-1.jar
	at org.codehaus.classworlds.Configurator.configure(Configurator.java:340)
	at org.codehaus.classworlds.Launcher.configure(Launcher.java:144)
	at org.codehaus.classworlds.Launcher.mainWithExitCode(Launcher.java:412)
	... 6 more
it0002... FAILED
----- Standard Out -----
Removing file: /home/projects/maven/maven-repo-local/maven/jars/maven-it-support-1.0.jar

org.apache.maven.it.VerificationException: java.lang.reflect.InvocationTargetException
	at org.apache.maven.it.Verifier.executeGoals(Verifier.java:320)
	at org.apache.maven.it.Verifier.main(Verifier.java:369)
Caused by: java.lang.reflect.InvocationTargetException
	at sun.reflect.NativeMethodAccessorImpl.invoke0(Native Method)
	at sun.reflect.NativeMethodAccessorImpl.invoke(NativeMethodAccessorImpl.java:39)
	at sun.reflect.DelegatingMethodAccessorImpl.invoke(DelegatingMethodAccessorImpl.java:25)
	at java.lang.reflect.Method.invoke(Method.java:324)
	at org.apache.maven.it.Verifier.executeGoals(Verifier.java:314)
	... 1 more
Caused by: java.io.FileNotFoundException: /home/projects/maven/m2/lib/plexus-artifact-container-1.0-alpha-1.jar
	at org.codehaus.classworlds.Configurator.configure(Configurator.java:340)
	at org.codehaus.classworlds.Launcher.configure(Launcher.java:144)
	at org.codehaus.classworlds.Launcher.mainWithExitCode(Launcher.java:412)
	... 6 more
it0003... FAILED
----- Standard Out -----
Removing file: /home/projects/maven/maven-repo-local/maven/jars/maven-core-it0003-1.0.jar

org.apache.maven.it.VerificationException: java.lang.reflect.InvocationTargetException
	at org.apache.maven.it.Verifier.executeGoals(Verifier.java:320)
	at org.apache.maven.it.Verifier.main(Verifier.java:369)
Caused by: java.lang.reflect.InvocationTargetException
	at sun.reflect.NativeMethodAccessorImpl.invoke0(Native Method)
	at sun.reflect.NativeMethodAccessorImpl.invoke(NativeMethodAccessorImpl.java:39)
	at sun.reflect.DelegatingMethodAccessorImpl.invoke(DelegatingMethodAccessorImpl.java:25)
	at java.lang.reflect.Method.invoke(Method.java:324)
	at org.apache.maven.it.Verifier.executeGoals(Verifier.java:314)
	... 1 more
Caused by: java.io.FileNotFoundException: /home/projects/maven/m2/lib/plexus-artifact-container-1.0-alpha-1.jar
	at org.codehaus.classworlds.Configurator.configure(Configurator.java:340)
	at org.codehaus.classworlds.Launcher.configure(Launcher.java:144)
	at org.codehaus.classworlds.Launcher.mainWithExitCode(Launcher.java:412)
	... 6 more
it0004... FAILED
----- Standard Out -----
Removing file: /home/projects/maven/maven-repo-local/maven/poms/maven-core-it0004-1.0.pom

org.apache.maven.it.VerificationException: java.lang.reflect.InvocationTargetException
	at org.apache.maven.it.Verifier.executeGoals(Verifier.java:320)
	at org.apache.maven.it.Verifier.main(Verifier.java:369)
Caused by: java.lang.reflect.InvocationTargetException
	at sun.reflect.NativeMethodAccessorImpl.invoke0(Native Method)
	at sun.reflect.NativeMethodAccessorImpl.invoke(NativeMethodAccessorImpl.java:39)
	at sun.reflect.DelegatingMethodAccessorImpl.invoke(DelegatingMethodAccessorImpl.java:25)
	at java.lang.reflect.Method.invoke(Method.java:324)
	at org.apache.maven.it.Verifier.executeGoals(Verifier.java:314)
	... 1 more
Caused by: java.io.FileNotFoundException: /home/projects/maven/m2/lib/plexus-artifact-container-1.0-alpha-1.jar
	at org.codehaus.classworlds.Configurator.configure(Configurator.java:340)
	at org.codehaus.classworlds.Launcher.configure(Launcher.java:144)
	at org.codehaus.classworlds.Launcher.mainWithExitCode(Launcher.java:412)
	... 6 more
it0005... FAILED
----- Standard Out -----
Removing file: /home/projects/maven/maven-repo-local/maven/poms/maven-core-it0005-1.0-SNAPSHOT.pom

org.apache.maven.it.VerificationException: java.lang.reflect.InvocationTargetException
	at org.apache.maven.it.Verifier.executeGoals(Verifier.java:320)
	at org.apache.maven.it.Verifier.main(Verifier.java:369)
Caused by: java.lang.reflect.InvocationTargetException
	at sun.reflect.NativeMethodAccessorImpl.invoke0(Native Method)
	at sun.reflect.NativeMethodAccessorImpl.invoke(NativeMethodAccessorImpl.java:39)
	at sun.reflect.DelegatingMethodAccessorImpl.invoke(DelegatingMethodAccessorImpl.java:25)
	at java.lang.reflect.Method.invoke(Method.java:324)
	at org.apache.maven.it.Verifier.executeGoals(Verifier.java:314)
	... 1 more
Caused by: java.io.FileNotFoundException: /home/projects/maven/m2/lib/plexus-artifact-container-1.0-alpha-1.jar
	at org.codehaus.classworlds.Configurator.configure(Configurator.java:340)
	at org.codehaus.classworlds.Launcher.configure(Launcher.java:144)
	at org.codehaus.classworlds.Launcher.mainWithExitCode(Launcher.java:412)
	... 6 more
it0006... FAILED
org.apache.maven.it.VerificationException: java.lang.reflect.InvocationTargetException
	at org.apache.maven.it.Verifier.executeGoals(Verifier.java:320)
	at org.apache.maven.it.Verifier.main(Verifier.java:369)
Caused by: java.lang.reflect.InvocationTargetException
	at sun.reflect.NativeMethodAccessorImpl.invoke0(Native Method)
	at sun.reflect.NativeMethodAccessorImpl.invoke(NativeMethodAccessorImpl.java:39)
	at sun.reflect.DelegatingMethodAccessorImpl.invoke(DelegatingMethodAccessorImpl.java:25)
	at java.lang.reflect.Method.invoke(Method.java:324)
	at org.apache.maven.it.Verifier.executeGoals(Verifier.java:314)
	... 1 more
Caused by: java.io.FileNotFoundException: /home/projects/maven/m2/lib/plexus-artifact-container-1.0-alpha-1.jar
	at org.codehaus.classworlds.Configurator.configure(Configurator.java:340)
	at org.codehaus.classworlds.Launcher.configure(Launcher.java:144)
	at org.codehaus.classworlds.Launcher.mainWithExitCode(Launcher.java:412)
	... 6 more
it0007... FAILED
----- Standard Out -----
Removing file: /home/projects/maven/maven-repo-local/maven/poms/maven-it-support-parent-1.0.pom

org.apache.maven.it.VerificationException: java.lang.reflect.InvocationTargetException
	at org.apache.maven.it.Verifier.executeGoals(Verifier.java:320)
	at org.apache.maven.it.Verifier.main(Verifier.java:369)
Caused by: java.lang.reflect.InvocationTargetException
	at sun.reflect.NativeMethodAccessorImpl.invoke0(Native Method)
	at sun.reflect.NativeMethodAccessorImpl.invoke(NativeMethodAccessorImpl.java:39)
	at sun.reflect.DelegatingMethodAccessorImpl.invoke(DelegatingMethodAccessorImpl.java:25)
	at java.lang.reflect.Method.invoke(Method.java:324)
	at org.apache.maven.it.Verifier.executeGoals(Verifier.java:314)
	... 1 more
Caused by: java.io.FileNotFoundException: /home/projects/maven/m2/lib/plexus-artifact-container-1.0-alpha-1.jar
	at org.codehaus.classworlds.Configurator.configure(Configurator.java:340)
	at org.codehaus.classworlds.Launcher.configure(Launcher.java:144)
	at org.codehaus.classworlds.Launcher.mainWithExitCode(Launcher.java:412)
	... 6 more

Creating m2 distribution for public consumption: http://www.codehaus.org/~jvanzyl/m2/m2-20040717.180701.tar.gz


Mime
View raw message