maven-m2-dev mailing list archives

Site index · List index
Message view « Date » · « Thread »
Top « Date » · « Thread »
From jvan...@maven.org
Subject [maven2 build] Sun Aug 15 11:07:01 EDT 2004
Date Sun, 15 Aug 2004 15:07:35 GMT

Performing an update of maven-components ...

Updates occured, build required ...

P maven-core/src/main/java/org/apache/maven/DefaultMaven.java
P maven-core/src/main/java/org/apache/maven/Maven.java
P maven-core/src/main/java/org/apache/maven/lifecycle/session/DefaultMavenSessionPhaseManager.java
P maven-core/src/main/java/org/apache/maven/lifecycle/session/MavenSession.java
P maven-core/src/main/java/org/apache/maven/lifecycle/session/MavenSessionPhaseManager.java
P maven-core/src/main/java/org/apache/maven/plugin/DefaultPluginManager.java
P maven-core/src/main/java/org/apache/maven/plugin/OgnlProjectValueExtractor.java
P maven-core/src/main/resources/META-INF/plexus/components.xml
P maven-core/src/test/java/org/apache/maven/MavenTestCase.java
P maven-core/src/test/java/org/apache/maven/lifecycle/MavenLifecycleManagerTest.java
P maven-core/src/test/java/org/apache/maven/plugin/OgnlProjectValueExtractorTest.java

-----------------------------------------------------------------------
 Building mboot ... 
-----------------------------------------------------------------------
-----------------------------------------------------------------------
 Building maven2 components ... 
-----------------------------------------------------------------------
Using the following for your maven.repo.local: /home/users/jvanzyl/maven-repo-local
Checking for MBoot's dependencies ...
Installing POM: /home/users/jvanzyl/maven-repo-local/maven/poms/maven-component-2.0-SNAPSHOT.pom
Installing POM: /home/users/jvanzyl/maven-repo-local/maven/poms/maven-plugin-parent-2.0-SNAPSHOT.pom
Building project in /home/users/jvanzyl/m2-build/maven-components/maven-model ...
--------------------------------------------------------------------
Building project in /home/users/jvanzyl/m2-build/maven-components/maven-model
Downloading dependencies ...
Model exists!
Generating java in /home/users/jvanzyl/m2-build/maven-components/maven-model/target/generated-sources
from /home/users/jvanzyl/m2-build/maven-components/maven-model/maven.mdo
Generating java in /home/users/jvanzyl/m2-build/maven-components/maven-model/target/generated-sources
from /home/users/jvanzyl/m2-build/maven-components/maven-model/maven.mdo
Generating xpp3 unmarshaller in /home/users/jvanzyl/m2-build/maven-components/maven-model/target/generated-sources
from /home/users/jvanzyl/m2-build/maven-components/maven-model/maven.mdo
Generating xpp3 marshaller in /home/users/jvanzyl/m2-build/maven-components/maven-model/target/generated-sources
from /home/users/jvanzyl/m2-build/maven-components/maven-model/maven.mdo
Generating xpp3 unmarshaller in /home/users/jvanzyl/m2-build/maven-components/maven-model/target/generated-sources
from /home/users/jvanzyl/m2-build/maven-components/maven-model/maven.mdo
Generating xpp3 marshaller in /home/users/jvanzyl/m2-build/maven-components/maven-model/target/generated-sources
from /home/users/jvanzyl/m2-build/maven-components/maven-model/maven.mdo
Compiling sources ...
Packaging resources ...
Compiling test sources ...
Packaging test resources ...

-------------------------------------------------------
 T E S T S
-------------------------------------------------------
There are no test to run.

Resume :
[surefire] Tests run: 0, Failures: 0, Errors: 0

Installing POM: /home/users/jvanzyl/maven-repo-local/maven/poms/maven-model-2.0-SNAPSHOT.pom
Installing JAR: /home/users/jvanzyl/maven-repo-local/maven/jars/maven-model-2.0-SNAPSHOT.jar
--------------------------------------------------------------------
Building project in /home/users/jvanzyl/m2-build/maven-components/maven-plugin ...
--------------------------------------------------------------------
Building project in /home/users/jvanzyl/m2-build/maven-components/maven-plugin
Downloading dependencies ...
Compiling sources ...
Packaging resources ...
Compiling test sources ...
Packaging test resources ...

-------------------------------------------------------
 T E S T S
-------------------------------------------------------
[surefire] Running org.apache.maven.plugin.BeanTest
[surefire] Tests run: 1, Failures: 0, Errors: 0, Time elapsed: 0.004 sec
[surefire] Running org.apache.maven.plugin.TestPluginTest
[surefire] Tests run: 1, Failures: 0, Errors: 0, Time elapsed: 0 sec
There are no test to run.

Resume :
[surefire] Tests run: 2, Failures: 0, Errors: 0

Installing POM: /home/users/jvanzyl/maven-repo-local/maven/poms/maven-plugin-2.0-SNAPSHOT.pom
Installing JAR: /home/users/jvanzyl/maven-repo-local/maven/jars/maven-plugin-2.0-SNAPSHOT.jar
--------------------------------------------------------------------
Building project in /home/users/jvanzyl/m2-build/maven-components/maven-plugin-tools ...
--------------------------------------------------------------------
Building project in /home/users/jvanzyl/m2-build/maven-components/maven-plugin-tools
Downloading dependencies ...
Compiling sources ...
Packaging resources ...
Compiling test sources ...
Packaging test resources ...

-------------------------------------------------------
 T E S T S
-------------------------------------------------------
[surefire] Running org.apache.maven.plugin.generator.jelly.JellyHarnessGeneratorTest
[surefire] Tests run: 1, Failures: 0, Errors: 0, Time elapsed: 0.117 sec
[surefire] Running org.apache.maven.plugin.generator.BeanGeneratorTest
[surefire] Tests run: 1, Failures: 0, Errors: 0, Time elapsed: 0.081 sec
[surefire] Running org.apache.maven.plugin.generator.PluginDescriptorGeneratorTest
[surefire] Tests run: 1, Failures: 0, Errors: 0, Time elapsed: 0.07 sec
[surefire] Running org.apache.maven.plugin.generator.PluginXdocGeneratorTest
[surefire] Tests run: 1, Failures: 0, Errors: 0, Time elapsed: 0.007 sec
There are no test to run.

Resume :
[surefire] Tests run: 4, Failures: 0, Errors: 0

Installing POM: /home/users/jvanzyl/maven-repo-local/maven/poms/maven-plugin-tools-2.0-SNAPSHOT.pom
Installing JAR: /home/users/jvanzyl/maven-repo-local/maven/jars/maven-plugin-tools-2.0-SNAPSHOT.jar
--------------------------------------------------------------------
Building project in /home/users/jvanzyl/m2-build/maven-components/maven-artifact ...
--------------------------------------------------------------------
Building project in /home/users/jvanzyl/m2-build/maven-components/maven-artifact
Downloading dependencies ...
Compiling sources ...
Packaging resources ...
Compiling test sources ...
Packaging test resources ...

-------------------------------------------------------
 T E S T S
-------------------------------------------------------
[surefire] Running org.apache.maven.artifact.deployer.ArtifactDeployerTest
[surefire] Tests run: 1, Failures: 0, Errors: 0, Time elapsed: 0.289 sec
[INFO] Installing /home/users/jvanzyl/m2-build/maven-components/maven-artifact/src/test/resources/artifact-install/artifact-1.0.jar
to target/test-classes/repositories/installer/local-repository/maven/jars/artifact-1.0.jar
[surefire] Running org.apache.maven.artifact.installer.ArtifactInstallerTest
[surefire] Tests run: 1, Failures: 0, Errors: 0, Time elapsed: 0.03 sec
[ERROR] Nonexistent component: org.apache.maven.wagon.Wagond
[surefire] Running org.apache.maven.artifact.manager.DefaultWagonManagerTest
[surefire] Tests run: 1, Failures: 0, Errors: 0, Time elapsed: 0.031 sec
[surefire] Running org.apache.maven.artifact.resolver.ArtifactResolverTest
[surefire] Tests run: 6, Failures: 0, Errors: 0, Time elapsed: 0.016 sec
There are no test to run.

Resume :
[surefire] Tests run: 9, Failures: 0, Errors: 0

Installing POM: /home/users/jvanzyl/maven-repo-local/maven/poms/maven-artifact-2.0-SNAPSHOT.pom
Installing JAR: /home/users/jvanzyl/maven-repo-local/maven/jars/maven-artifact-2.0-SNAPSHOT.jar
--------------------------------------------------------------------
Building project in /home/users/jvanzyl/m2-build/maven-components/maven-core ...
--------------------------------------------------------------------
Building project in /home/users/jvanzyl/m2-build/maven-components/maven-core
Downloading dependencies ...
Compiling sources ...
Packaging resources ...
Compiling test sources ...
Packaging test resources ...

-------------------------------------------------------
 T E S T S
-------------------------------------------------------
[surefire] Running org.apache.maven.decoration.DefaultGoalDecoratorTest
[surefire] Tests run: 3, Failures: 0, Errors: 0, Time elapsed: 0 sec
[surefire] Running org.apache.maven.decoration.GoalDecorationParserTest
[surefire] Tests run: 5, Failures: 0, Errors: 0, Time elapsed: 0.001 sec
[surefire] Running org.apache.maven.decoration.GoalDecoratorBindingsTest
[surefire] Tests run: 7, Failures: 0, Errors: 0, Time elapsed: 0 sec
java.lang.NoSuchMethodError: org.apache.maven.MavenTestCase.createGoalExecutionContext()Lorg/apache/maven/lifecycle/MavenGoalExecutionContext;
	at org.apache.maven.lifecycle.phase.GoalDecorationPhaseTest.testShouldParseDecoratorsFromFile(GoalDecorationPhaseTest.java:65)
	at sun.reflect.NativeMethodAccessorImpl.invoke0(Native Method)
	at sun.reflect.NativeMethodAccessorImpl.invoke(NativeMethodAccessorImpl.java:39)
	at sun.reflect.DelegatingMethodAccessorImpl.invoke(DelegatingMethodAccessorImpl.java:25)
	at java.lang.reflect.Method.invoke(Method.java:324)
	at junit.framework.TestCase.runTest(TestCase.java:154)
	at junit.framework.TestCase.runBare(TestCase.java:127)
	at junit.framework.TestResult$1.protect(TestResult.java:106)
	at junit.framework.TestResult.runProtected(TestResult.java:124)
	at junit.framework.TestResult.run(TestResult.java:109)
	at junit.framework.TestCase.run(TestCase.java:118)
	at junit.framework.TestSuite.runTest(TestSuite.java:208)
	at junit.framework.TestSuite.run(TestSuite.java:203)
	at sun.reflect.NativeMethodAccessorImpl.invoke0(Native Method)
	at sun.reflect.NativeMethodAccessorImpl.invoke(NativeMethodAccessorImpl.java:39)
	at sun.reflect.DelegatingMethodAccessorImpl.invoke(DelegatingMethodAccessorImpl.java:25)
	at java.lang.reflect.Method.invoke(Method.java:324)
	at org.codehaus.surefire.battery.JUnitBattery.execute(JUnitBattery.java:161)
	at org.codehaus.surefire.Surefire.executeBattery(Surefire.java:149)
	at org.codehaus.surefire.Surefire.run(Surefire.java:103)
	at org.codehaus.surefire.Surefire.run(Surefire.java:55)
	at sun.reflect.NativeMethodAccessorImpl.invoke0(Native Method)
	at sun.reflect.NativeMethodAccessorImpl.invoke(NativeMethodAccessorImpl.java:39)
	at sun.reflect.DelegatingMethodAccessorImpl.invoke(DelegatingMethodAccessorImpl.java:25)
	at java.lang.reflect.Method.invoke(Method.java:324)
	at SurefireBooter.run(SurefireBooter.java:70)
	at SurefirePlugin.execute(SurefirePlugin.java:36)
	at MBoot.runTests(MBoot.java:709)
	at MBoot.buildProject(MBoot.java:507)
	at MBoot.run(MBoot.java:216)
	at MBoot.main(MBoot.java:139)
[surefire] Running org.apache.maven.lifecycle.phase.GoalDecorationPhaseTest
[surefire] Tests run: 2, Failures: 0, Errors: 1, Time elapsed: 0.04 sec <<<<<<<<
FAILURE !! 
java.lang.NoSuchMethodError: org.apache.maven.MavenTestCase.createGoalExecutionContext(Ljava/lang/String;)Lorg/apache/maven/lifecycle/MavenGoalExecutionContext;
	at org.apache.maven.lifecycle.phase.GoalResolutionPhaseTest.runTest(GoalResolutionPhaseTest.java:274)
	at org.apache.maven.lifecycle.phase.GoalResolutionPhaseTest.testT1_ShouldFind_PreGoal_MainGoal_PostGoal(GoalResolutionPhaseTest.java:64)
	at sun.reflect.NativeMethodAccessorImpl.invoke0(Native Method)
	at sun.reflect.NativeMethodAccessorImpl.invoke(NativeMethodAccessorImpl.java:39)
	at sun.reflect.DelegatingMethodAccessorImpl.invoke(DelegatingMethodAccessorImpl.java:25)
	at java.lang.reflect.Method.invoke(Method.java:324)
	at junit.framework.TestCase.runTest(TestCase.java:154)
	at junit.framework.TestCase.runBare(TestCase.java:127)
	at junit.framework.TestResult$1.protect(TestResult.java:106)
	at junit.framework.TestResult.runProtected(TestResult.java:124)
	at junit.framework.TestResult.run(TestResult.java:109)
	at junit.framework.TestCase.run(TestCase.java:118)
	at junit.framework.TestSuite.runTest(TestSuite.java:208)
	at junit.framework.TestSuite.run(TestSuite.java:203)
	at sun.reflect.NativeMethodAccessorImpl.invoke0(Native Method)
	at sun.reflect.NativeMethodAccessorImpl.invoke(NativeMethodAccessorImpl.java:39)
	at sun.reflect.DelegatingMethodAccessorImpl.invoke(DelegatingMethodAccessorImpl.java:25)
	at java.lang.reflect.Method.invoke(Method.java:324)
	at org.codehaus.surefire.battery.JUnitBattery.execute(JUnitBattery.java:161)
	at org.codehaus.surefire.Surefire.executeBattery(Surefire.java:149)
	at org.codehaus.surefire.Surefire.run(Surefire.java:103)
	at org.codehaus.surefire.Surefire.run(Surefire.java:55)
	at sun.reflect.NativeMethodAccessorImpl.invoke0(Native Method)
	at sun.reflect.NativeMethodAccessorImpl.invoke(NativeMethodAccessorImpl.java:39)
	at sun.reflect.DelegatingMethodAccessorImpl.invoke(DelegatingMethodAccessorImpl.java:25)
	at java.lang.reflect.Method.invoke(Method.java:324)
	at SurefireBooter.run(SurefireBooter.java:70)
	at SurefirePlugin.execute(SurefirePlugin.java:36)
	at MBoot.runTests(MBoot.java:709)
	at MBoot.buildProject(MBoot.java:507)
	at MBoot.run(MBoot.java:216)
	at MBoot.main(MBoot.java:139)
java.lang.NoSuchMethodError: org.apache.maven.MavenTestCase.createGoalExecutionContext(Ljava/lang/String;)Lorg/apache/maven/lifecycle/MavenGoalExecutionContext;
	at org.apache.maven.lifecycle.phase.GoalResolutionPhaseTest.runTest(GoalResolutionPhaseTest.java:274)
	at org.apache.maven.lifecycle.phase.GoalResolutionPhaseTest.testT2_ShouldFind_Prereq_MainGoal(GoalResolutionPhaseTest.java:102)
	at sun.reflect.NativeMethodAccessorImpl.invoke0(Native Method)
	at sun.reflect.NativeMethodAccessorImpl.invoke(NativeMethodAccessorImpl.java:39)
	at sun.reflect.DelegatingMethodAccessorImpl.invoke(DelegatingMethodAccessorImpl.java:25)
	at java.lang.reflect.Method.invoke(Method.java:324)
	at junit.framework.TestCase.runTest(TestCase.java:154)
	at junit.framework.TestCase.runBare(TestCase.java:127)
	at junit.framework.TestResult$1.protect(TestResult.java:106)
	at junit.framework.TestResult.runProtected(TestResult.java:124)
	at junit.framework.TestResult.run(TestResult.java:109)
	at junit.framework.TestCase.run(TestCase.java:118)
	at junit.framework.TestSuite.runTest(TestSuite.java:208)
	at junit.framework.TestSuite.run(TestSuite.java:203)
	at sun.reflect.NativeMethodAccessorImpl.invoke0(Native Method)
	at sun.reflect.NativeMethodAccessorImpl.invoke(NativeMethodAccessorImpl.java:39)
	at sun.reflect.DelegatingMethodAccessorImpl.invoke(DelegatingMethodAccessorImpl.java:25)
	at java.lang.reflect.Method.invoke(Method.java:324)
	at org.codehaus.surefire.battery.JUnitBattery.execute(JUnitBattery.java:161)
	at org.codehaus.surefire.Surefire.executeBattery(Surefire.java:149)
	at org.codehaus.surefire.Surefire.run(Surefire.java:103)
	at org.codehaus.surefire.Surefire.run(Surefire.java:55)
	at sun.reflect.NativeMethodAccessorImpl.invoke0(Native Method)
	at sun.reflect.NativeMethodAccessorImpl.invoke(NativeMethodAccessorImpl.java:39)
	at sun.reflect.DelegatingMethodAccessorImpl.invoke(DelegatingMethodAccessorImpl.java:25)
	at java.lang.reflect.Method.invoke(Method.java:324)
	at SurefireBooter.run(SurefireBooter.java:70)
	at SurefirePlugin.execute(SurefirePlugin.java:36)
	at MBoot.runTests(MBoot.java:709)
	at MBoot.buildProject(MBoot.java:507)
	at MBoot.run(MBoot.java:216)
	at MBoot.main(MBoot.java:139)
java.lang.NoSuchMethodError: org.apache.maven.MavenTestCase.createGoalExecutionContext(Ljava/lang/String;)Lorg/apache/maven/lifecycle/MavenGoalExecutionContext;
	at org.apache.maven.lifecycle.phase.GoalResolutionPhaseTest.runTest(GoalResolutionPhaseTest.java:274)
	at org.apache.maven.lifecycle.phase.GoalResolutionPhaseTest.testT3_ShouldFind_PreGoal_Prereq_MainGoal_PostGoal(GoalResolutionPhaseTest.java:159)
	at sun.reflect.NativeMethodAccessorImpl.invoke0(Native Method)
	at sun.reflect.NativeMethodAccessorImpl.invoke(NativeMethodAccessorImpl.java:39)
	at sun.reflect.DelegatingMethodAccessorImpl.invoke(DelegatingMethodAccessorImpl.java:25)
	at java.lang.reflect.Method.invoke(Method.java:324)
	at junit.framework.TestCase.runTest(TestCase.java:154)
	at junit.framework.TestCase.runBare(TestCase.java:127)
	at junit.framework.TestResult$1.protect(TestResult.java:106)
	at junit.framework.TestResult.runProtected(TestResult.java:124)
	at junit.framework.TestResult.run(TestResult.java:109)
	at junit.framework.TestCase.run(TestCase.java:118)
	at junit.framework.TestSuite.runTest(TestSuite.java:208)
	at junit.framework.TestSuite.run(TestSuite.java:203)
	at sun.reflect.NativeMethodAccessorImpl.invoke0(Native Method)
	at sun.reflect.NativeMethodAccessorImpl.invoke(NativeMethodAccessorImpl.java:39)
	at sun.reflect.DelegatingMethodAccessorImpl.invoke(DelegatingMethodAccessorImpl.java:25)
	at java.lang.reflect.Method.invoke(Method.java:324)
	at org.codehaus.surefire.battery.JUnitBattery.execute(JUnitBattery.java:161)
	at org.codehaus.surefire.Surefire.executeBattery(Surefire.java:149)
	at org.codehaus.surefire.Surefire.run(Surefire.java:103)
	at org.codehaus.surefire.Surefire.run(Surefire.java:55)
	at sun.reflect.NativeMethodAccessorImpl.invoke0(Native Method)
	at sun.reflect.NativeMethodAccessorImpl.invoke(NativeMethodAccessorImpl.java:39)
	at sun.reflect.DelegatingMethodAccessorImpl.invoke(DelegatingMethodAccessorImpl.java:25)
	at java.lang.reflect.Method.invoke(Method.java:324)
	at SurefireBooter.run(SurefireBooter.java:70)
	at SurefirePlugin.execute(SurefirePlugin.java:36)
	at MBoot.runTests(MBoot.java:709)
	at MBoot.buildProject(MBoot.java:507)
	at MBoot.run(MBoot.java:216)
	at MBoot.main(MBoot.java:139)
java.lang.NoSuchMethodError: org.apache.maven.MavenTestCase.createGoalExecutionContext(Ljava/lang/String;)Lorg/apache/maven/lifecycle/MavenGoalExecutionContext;
	at org.apache.maven.lifecycle.phase.GoalResolutionPhaseTest.runTest(GoalResolutionPhaseTest.java:274)
	at org.apache.maven.lifecycle.phase.GoalResolutionPhaseTest.testT4_ShouldFind_PreGoal_Prereq_PostGoal_MainGoal(GoalResolutionPhaseTest.java:216)
	at sun.reflect.NativeMethodAccessorImpl.invoke0(Native Method)
	at sun.reflect.NativeMethodAccessorImpl.invoke(NativeMethodAccessorImpl.java:39)
	at sun.reflect.DelegatingMethodAccessorImpl.invoke(DelegatingMethodAccessorImpl.java:25)
	at java.lang.reflect.Method.invoke(Method.java:324)
	at junit.framework.TestCase.runTest(TestCase.java:154)
	at junit.framework.TestCase.runBare(TestCase.java:127)
	at junit.framework.TestResult$1.protect(TestResult.java:106)
	at junit.framework.TestResult.runProtected(TestResult.java:124)
	at junit.framework.TestResult.run(TestResult.java:109)
	at junit.framework.TestCase.run(TestCase.java:118)
	at junit.framework.TestSuite.runTest(TestSuite.java:208)
	at junit.framework.TestSuite.run(TestSuite.java:203)
	at sun.reflect.NativeMethodAccessorImpl.invoke0(Native Method)
	at sun.reflect.NativeMethodAccessorImpl.invoke(NativeMethodAccessorImpl.java:39)
	at sun.reflect.DelegatingMethodAccessorImpl.invoke(DelegatingMethodAccessorImpl.java:25)
	at java.lang.reflect.Method.invoke(Method.java:324)
	at org.codehaus.surefire.battery.JUnitBattery.execute(JUnitBattery.java:161)
	at org.codehaus.surefire.Surefire.executeBattery(Surefire.java:149)
	at org.codehaus.surefire.Surefire.run(Surefire.java:103)
	at org.codehaus.surefire.Surefire.run(Surefire.java:55)
	at sun.reflect.NativeMethodAccessorImpl.invoke0(Native Method)
	at sun.reflect.NativeMethodAccessorImpl.invoke(NativeMethodAccessorImpl.java:39)
	at sun.reflect.DelegatingMethodAccessorImpl.invoke(DelegatingMethodAccessorImpl.java:25)
	at java.lang.reflect.Method.invoke(Method.java:324)
	at SurefireBooter.run(SurefireBooter.java:70)
	at SurefirePlugin.execute(SurefirePlugin.java:36)
	at MBoot.runTests(MBoot.java:709)
	at MBoot.buildProject(MBoot.java:507)
	at MBoot.run(MBoot.java:216)
	at MBoot.main(MBoot.java:139)
java.lang.NoSuchMethodError: org.apache.maven.MavenTestCase.createGoalExecutionContext(Ljava/lang/String;)Lorg/apache/maven/lifecycle/MavenGoalExecutionContext;
	at org.apache.maven.lifecycle.phase.GoalResolutionPhaseTest.runTest(GoalResolutionPhaseTest.java:274)
	at org.apache.maven.lifecycle.phase.GoalResolutionPhaseTest.testT5_ShouldFind_Prereq_PreGoal_MainGoal(GoalResolutionPhaseTest.java:267)
	at sun.reflect.NativeMethodAccessorImpl.invoke0(Native Method)
	at sun.reflect.NativeMethodAccessorImpl.invoke(NativeMethodAccessorImpl.java:39)
	at sun.reflect.DelegatingMethodAccessorImpl.invoke(DelegatingMethodAccessorImpl.java:25)
	at java.lang.reflect.Method.invoke(Method.java:324)
	at junit.framework.TestCase.runTest(TestCase.java:154)
	at junit.framework.TestCase.runBare(TestCase.java:127)
	at junit.framework.TestResult$1.protect(TestResult.java:106)
	at junit.framework.TestResult.runProtected(TestResult.java:124)
	at junit.framework.TestResult.run(TestResult.java:109)
	at junit.framework.TestCase.run(TestCase.java:118)
	at junit.framework.TestSuite.runTest(TestSuite.java:208)
	at junit.framework.TestSuite.run(TestSuite.java:203)
	at sun.reflect.NativeMethodAccessorImpl.invoke0(Native Method)
	at sun.reflect.NativeMethodAccessorImpl.invoke(NativeMethodAccessorImpl.java:39)
	at sun.reflect.DelegatingMethodAccessorImpl.invoke(DelegatingMethodAccessorImpl.java:25)
	at java.lang.reflect.Method.invoke(Method.java:324)
	at org.codehaus.surefire.battery.JUnitBattery.execute(JUnitBattery.java:161)
	at org.codehaus.surefire.Surefire.executeBattery(Surefire.java:149)
	at org.codehaus.surefire.Surefire.run(Surefire.java:103)
	at org.codehaus.surefire.Surefire.run(Surefire.java:55)
	at sun.reflect.NativeMethodAccessorImpl.invoke0(Native Method)
	at sun.reflect.NativeMethodAccessorImpl.invoke(NativeMethodAccessorImpl.java:39)
	at sun.reflect.DelegatingMethodAccessorImpl.invoke(DelegatingMethodAccessorImpl.java:25)
	at java.lang.reflect.Method.invoke(Method.java:324)
	at SurefireBooter.run(SurefireBooter.java:70)
	at SurefirePlugin.execute(SurefirePlugin.java:36)
	at MBoot.runTests(MBoot.java:709)
	at MBoot.buildProject(MBoot.java:507)
	at MBoot.run(MBoot.java:216)
	at MBoot.main(MBoot.java:139)
[surefire] Running org.apache.maven.lifecycle.phase.GoalResolutionPhaseTest
[surefire] Tests run: 5, Failures: 0, Errors: 5, Time elapsed: 0.034 sec <<<<<<<<
FAILURE !! 
[surefire] Running org.apache.maven.lifecycle.MavenLifecycleManagerTest
[surefire] Tests run: 1, Failures: 0, Errors: 0, Time elapsed: 0.147 sec
Resolved goals: [t1:preGoal, t1:main, t1:postGoal]
Resolved goals: [t2:prereq, t2:main]
Resolved goals: [t3:preGoal, t3:prereq, t3:main, t3:postGoal]
Resolved goals: [t4:prereq-preGoal, t4:prereq, t4:prereq-postGoal, t4:main]
Resolved goals: [t5:prereq, t5:preGoal, t5:main]
[surefire] Running org.apache.maven.lifecycle.goal.phase.GoalResolutionPhaseTest
[surefire] Tests run: 5, Failures: 0, Errors: 0, Time elapsed: 0.042 sec
[surefire] Running org.apache.maven.plugin.OgnlProjectValueExtractorTest
[surefire] Tests run: 5, Failures: 0, Errors: 0, Time elapsed: 0.089 sec
[surefire] Running org.apache.maven.plugin.PluginTest
[surefire] Tests run: 1, Failures: 0, Errors: 0, Time elapsed: 0.026 sec
[surefire] Running org.apache.maven.project.ProjectBaseDirectoryAlignmentTest
[surefire] Tests run: 1, Failures: 0, Errors: 0, Time elapsed: 0.046 sec
[surefire] Running org.apache.maven.project.inheritance.t00.ProjectInheritanceTest
[surefire] Tests run: 1, Failures: 0, Errors: 0, Time elapsed: 0.107 sec
[surefire] Running org.apache.maven.project.inheritance.t01.ProjectInheritanceTest
[surefire] Tests run: 1, Failures: 0, Errors: 0, Time elapsed: 0.262 sec
[surefire] Running org.apache.maven.project.validation.DefaultModelValidatorTest
[surefire] Tests run: 5, Failures: 0, Errors: 0, Time elapsed: 0.029 sec
There are no test to run.

Resume :
[surefire] Tests run: 42, Failures: 0, Errors: 6

Exception in thread "main" java.lang.Exception: Tests error
	at MBoot.runTests(MBoot.java:713)
	at MBoot.buildProject(MBoot.java:507)
	at MBoot.run(MBoot.java:216)
	at MBoot.main(MBoot.java:139)

Creating m2 distribution for public consumption: http://www.codehaus.org/~jvanzyl/m2/m2-20040715.110701.tar.gz


Mime
View raw message