maven-m2-dev mailing list archives

Site index · List index
Message view « Date » · « Thread »
Top « Date » · « Thread »
From jvan...@maven.org
Subject [maven2 build] Wed Aug 11 16:18:08 EDT 2004
Date Wed, 11 Aug 2004 20:20:14 GMT

Performing a clean check out of maven-components ...

Updates occured, build required ...


-----------------------------------------------------------------------
 Building mboot ... 
-----------------------------------------------------------------------
-----------------------------------------------------------------------
 Building maven2 components ... 
-----------------------------------------------------------------------
Using the following for your maven.repo.local: /home/users/jvanzyl/maven-repo-local
Checking for MBoot's dependencies ...
...................................................................................
.
...
.
............................
.
.........................................................
.
..............................................
.
................................................
.
.....................................
.
..
.
Installing POM: /home/users/jvanzyl/maven-repo-local/maven/poms/maven-component-2.0-SNAPSHOT.pom
Installing POM: /home/users/jvanzyl/maven-repo-local/maven/poms/maven-plugin-parent-2.0-SNAPSHOT.pom
Building project in /home/users/jvanzyl/m2-build/maven-components/maven-model ...
--------------------------------------------------------------------
Building project in /home/users/jvanzyl/m2-build/maven-components/maven-model
Downloading dependencies ...
..............................................................................................................
.
.........................
.
Model exists!
Generating java in /home/users/jvanzyl/m2-build/maven-components/maven-model/target/generated-sources
from /home/users/jvanzyl/m2-build/maven-components/maven-model/maven.mdo
Generating java in /home/users/jvanzyl/m2-build/maven-components/maven-model/target/generated-sources
from /home/users/jvanzyl/m2-build/maven-components/maven-model/maven.mdo
Generating xpp3 unmarshaller in /home/users/jvanzyl/m2-build/maven-components/maven-model/target/generated-sources
from /home/users/jvanzyl/m2-build/maven-components/maven-model/maven.mdo
Generating xpp3 marshaller in /home/users/jvanzyl/m2-build/maven-components/maven-model/target/generated-sources
from /home/users/jvanzyl/m2-build/maven-components/maven-model/maven.mdo
Generating xpp3 unmarshaller in /home/users/jvanzyl/m2-build/maven-components/maven-model/target/generated-sources
from /home/users/jvanzyl/m2-build/maven-components/maven-model/maven.mdo
Generating xpp3 marshaller in /home/users/jvanzyl/m2-build/maven-components/maven-model/target/generated-sources
from /home/users/jvanzyl/m2-build/maven-components/maven-model/maven.mdo
Compiling sources ...
Packaging resources ...
Compiling test sources ...
Packaging test resources ...

-------------------------------------------------------
 T E S T S
-------------------------------------------------------
There are no test to run.

Resume :
[surefire] Tests run: 0, Failures: 0, Errors: 0

Installing POM: /home/users/jvanzyl/maven-repo-local/maven/poms/maven-model-2.0-SNAPSHOT.pom
Installing JAR: /home/users/jvanzyl/maven-repo-local/maven/jars/maven-model-2.0-SNAPSHOT.jar
--------------------------------------------------------------------
Building project in /home/users/jvanzyl/m2-build/maven-components/maven-plugin ...
--------------------------------------------------------------------
Building project in /home/users/jvanzyl/m2-build/maven-components/maven-plugin
Downloading dependencies ...
Compiling sources ...
Packaging resources ...
Compiling test sources ...
Packaging test resources ...

-------------------------------------------------------
 T E S T S
-------------------------------------------------------
[surefire] Running org.apache.maven.plugin.BeanTest
[surefire] Tests run: 1, Failures: 0, Errors: 0, Time elapsed: 0.005 sec
[surefire] Running org.apache.maven.plugin.TestPluginTest
[surefire] Tests run: 1, Failures: 0, Errors: 0, Time elapsed: 0 sec
There are no test to run.

Resume :
[surefire] Tests run: 2, Failures: 0, Errors: 0

Installing POM: /home/users/jvanzyl/maven-repo-local/maven/poms/maven-plugin-2.0-SNAPSHOT.pom
Installing JAR: /home/users/jvanzyl/maven-repo-local/maven/jars/maven-plugin-2.0-SNAPSHOT.jar
--------------------------------------------------------------------
Building project in /home/users/jvanzyl/m2-build/maven-components/maven-plugin-tools ...
--------------------------------------------------------------------
Building project in /home/users/jvanzyl/m2-build/maven-components/maven-plugin-tools
Downloading dependencies ...
.
Compiling sources ...
Packaging resources ...
Compiling test sources ...
Packaging test resources ...

-------------------------------------------------------
 T E S T S
-------------------------------------------------------
[surefire] Running org.apache.maven.plugin.generator.jelly.JellyHarnessGeneratorTest
[surefire] Tests run: 1, Failures: 0, Errors: 0, Time elapsed: 0.12 sec
[surefire] Running org.apache.maven.plugin.generator.BeanGeneratorTest
[surefire] Tests run: 1, Failures: 0, Errors: 0, Time elapsed: 0.067 sec
[surefire] Running org.apache.maven.plugin.generator.PluginDescriptorGeneratorTest
[surefire] Tests run: 1, Failures: 0, Errors: 0, Time elapsed: 0.076 sec
[surefire] Running org.apache.maven.plugin.generator.PluginXdocGeneratorTest
[surefire] Tests run: 1, Failures: 0, Errors: 0, Time elapsed: 0.009 sec
There are no test to run.

Resume :
[surefire] Tests run: 4, Failures: 0, Errors: 0

Installing POM: /home/users/jvanzyl/maven-repo-local/maven/poms/maven-plugin-tools-2.0-SNAPSHOT.pom
Installing JAR: /home/users/jvanzyl/maven-repo-local/maven/jars/maven-plugin-tools-2.0-SNAPSHOT.jar
--------------------------------------------------------------------
Building project in /home/users/jvanzyl/m2-build/maven-components/maven-artifact ...
--------------------------------------------------------------------
Building project in /home/users/jvanzyl/m2-build/maven-components/maven-artifact
Downloading dependencies ...
.................................
.
.
.
Compiling sources ...
Packaging resources ...
Compiling test sources ...
Packaging test resources ...

-------------------------------------------------------
 T E S T S
-------------------------------------------------------
[surefire] Running org.apache.maven.artifact.deployer.ArtifactDeployerTest
[surefire] Tests run: 1, Failures: 0, Errors: 0, Time elapsed: 0.331 sec
[INFO] Installing /home/users/jvanzyl/m2-build/maven-components/maven-artifact/src/test/resources/artifact-install/artifact-1.0.jar
to target/test-classes/repositories/installer/local-repository/maven/jars/artifact-1.0.jar
[surefire] Running org.apache.maven.artifact.installer.ArtifactInstallerTest
[surefire] Tests run: 1, Failures: 0, Errors: 0, Time elapsed: 0.031 sec
[ERROR] Nonexistent component: org.apache.maven.wagon.Wagond
[surefire] Running org.apache.maven.artifact.manager.DefaultWagonManagerTest
[surefire] Tests run: 1, Failures: 0, Errors: 0, Time elapsed: 0.035 sec
[surefire] Running org.apache.maven.artifact.resolver.ArtifactResolverTest
[surefire] Tests run: 6, Failures: 0, Errors: 0, Time elapsed: 0.018 sec
There are no test to run.

Resume :
[surefire] Tests run: 9, Failures: 0, Errors: 0

Installing POM: /home/users/jvanzyl/maven-repo-local/maven/poms/maven-artifact-2.0-SNAPSHOT.pom
Installing JAR: /home/users/jvanzyl/maven-repo-local/maven/jars/maven-artifact-2.0-SNAPSHOT.jar
--------------------------------------------------------------------
Building project in /home/users/jvanzyl/m2-build/maven-components/maven-core ...
--------------------------------------------------------------------
Building project in /home/users/jvanzyl/m2-build/maven-components/maven-core
Downloading dependencies ...
.
.
.....................
.
......
.
......................................................................................................
.
....................................
.
..
.
.........................
.
Compiling sources ...
Packaging resources ...
Compiling test sources ...
Packaging test resources ...

-------------------------------------------------------
 T E S T S
-------------------------------------------------------
[surefire] Running org.apache.maven.decoration.DefaultGoalDecoratorTest
[surefire] Tests run: 3, Failures: 0, Errors: 0, Time elapsed: 0 sec
[surefire] Running org.apache.maven.decoration.GoalDecorationParserTest
[surefire] Tests run: 5, Failures: 0, Errors: 0, Time elapsed: 0 sec
[surefire] Running org.apache.maven.decoration.GoalDecoratorBindingsTest
[surefire] Tests run: 7, Failures: 0, Errors: 0, Time elapsed: 0 sec
[surefire] Running org.apache.maven.MavenTest
[surefire] Tests run: 1, Failures: 0, Errors: 0, Time elapsed: 0.326 sec
[surefire] Running org.apache.maven.lifecycle.phase.GoalDecorationPhaseTest
[surefire] Tests run: 2, Failures: 0, Errors: 0, Time elapsed: 0.044 sec
Resolved goals: [t1:preGoal, t1:main, t1:postGoal]
Resolved goals: [t2:prereq, t2:main]
Resolved goals: [t3:preGoal, t3:prereq, t3:main, t3:postGoal]
Resolved goals: [t4:prereq-preGoal, t4:prereq, t4:prereq-postGoal, t4:main]
Resolved goals: [t5:prereq, t5:preGoal, t5:main]
[surefire] Running org.apache.maven.lifecycle.phase.GoalResolutionPhaseTest
[surefire] Tests run: 5, Failures: 0, Errors: 0, Time elapsed: 0.032 sec
[surefire] Running org.apache.maven.lifecycle.MavenLifecycleManagerTest
[surefire] Tests run: 1, Failures: 0, Errors: 0, Time elapsed: 0.033 sec
[surefire] Running org.apache.maven.plugin.OgnlProjectValueExtractorTest
[surefire] Tests run: 5, Failures: 0, Errors: 0, Time elapsed: 0.044 sec
[surefire] Running org.apache.maven.plugin.PluginTest
[surefire] Tests run: 1, Failures: 0, Errors: 0, Time elapsed: 0.028 sec
[surefire] Running org.apache.maven.project.ProjectBaseDirectoryAlignmentTest
[surefire] Tests run: 1, Failures: 0, Errors: 0, Time elapsed: 0.054 sec
[surefire] Running org.apache.maven.project.inheritance.t00.ProjectInheritanceTest
[surefire] Tests run: 1, Failures: 0, Errors: 0, Time elapsed: 0.121 sec
[surefire] Running org.apache.maven.project.inheritance.t01.ProjectInheritanceTest
[surefire] Tests run: 1, Failures: 0, Errors: 0, Time elapsed: 0.298 sec
[surefire] Running org.apache.maven.project.validation.DefaultModelValidatorTest
[surefire] Tests run: 5, Failures: 0, Errors: 0, Time elapsed: 0.026 sec
There are no test to run.

Resume :
[surefire] Tests run: 38, Failures: 0, Errors: 0

Installing POM: /home/users/jvanzyl/maven-repo-local/maven/poms/maven-core-2.0-SNAPSHOT.pom
Installing JAR: /home/users/jvanzyl/maven-repo-local/maven/jars/maven-core-2.0-SNAPSHOT.jar
--------------------------------------------------------------------
Building project in /home/users/jvanzyl/m2-build/maven-components/maven-core-it-verifier ...
--------------------------------------------------------------------
Building project in /home/users/jvanzyl/m2-build/maven-components/maven-core-it-verifier
Downloading dependencies ...
Compiling sources ...
Packaging resources ...
Compiling test sources ...
Packaging test resources ...

-------------------------------------------------------
 T E S T S
-------------------------------------------------------
There are no test to run.

Resume :
[surefire] Tests run: 0, Failures: 0, Errors: 0

Installing POM: /home/users/jvanzyl/maven-repo-local/maven/poms/maven-core-it-verifier-1.0.pom
Installing JAR: /home/users/jvanzyl/maven-repo-local/maven/jars/maven-core-it-verifier-1.0.jar
--------------------------------------------------------------------
Building project in /home/users/jvanzyl/m2-build/maven-components/maven-plugins/maven-clean-plugin
...
--------------------------------------------------------------------
Building project in /home/users/jvanzyl/m2-build/maven-components/maven-plugins/maven-clean-plugin
Downloading dependencies ...
Compiling sources ...
Generating maven plugin descriptor ...
Packaging resources ...
Compiling test sources ...
Packaging test resources ...

-------------------------------------------------------
 T E S T S
-------------------------------------------------------
There are no test to run.

Resume :
[surefire] Tests run: 0, Failures: 0, Errors: 0

Installing POM: /home/users/jvanzyl/maven-repo-local/maven/poms/maven-clean-plugin-1.0-SNAPSHOT.pom
Installing Plugin: /home/users/jvanzyl/maven-repo-local/maven/plugins/maven-clean-plugin-1.0-SNAPSHOT.jar
--------------------------------------------------------------------
Building project in /home/users/jvanzyl/m2-build/maven-components/maven-plugins/maven-compiler-plugin
...
--------------------------------------------------------------------
Building project in /home/users/jvanzyl/m2-build/maven-components/maven-plugins/maven-compiler-plugin
Downloading dependencies ...
.....
.
...
.
Compiling sources ...
Generating maven plugin descriptor ...
Packaging resources ...
Compiling test sources ...
Packaging test resources ...

-------------------------------------------------------
 T E S T S
-------------------------------------------------------
There are no test to run.

Resume :
[surefire] Tests run: 0, Failures: 0, Errors: 0

Installing POM: /home/users/jvanzyl/maven-repo-local/maven/poms/maven-compiler-plugin-1.0-SNAPSHOT.pom
Installing Plugin: /home/users/jvanzyl/maven-repo-local/maven/plugins/maven-compiler-plugin-1.0-SNAPSHOT.jar
--------------------------------------------------------------------
Building project in /home/users/jvanzyl/m2-build/maven-components/maven-plugins/maven-install-plugin
...
--------------------------------------------------------------------
Building project in /home/users/jvanzyl/m2-build/maven-components/maven-plugins/maven-install-plugin
Downloading dependencies ...
.
Compiling sources ...
Generating maven plugin descriptor ...
Packaging resources ...
Compiling test sources ...
Packaging test resources ...

-------------------------------------------------------
 T E S T S
-------------------------------------------------------
There are no test to run.

Resume :
[surefire] Tests run: 0, Failures: 0, Errors: 0

Installing POM: /home/users/jvanzyl/maven-repo-local/maven/poms/maven-install-plugin-1.0-SNAPSHOT.pom
Installing Plugin: /home/users/jvanzyl/maven-repo-local/maven/plugins/maven-install-plugin-1.0-SNAPSHOT.jar
--------------------------------------------------------------------
Building project in /home/users/jvanzyl/m2-build/maven-components/maven-plugins/maven-jar-plugin
...
--------------------------------------------------------------------
Building project in /home/users/jvanzyl/m2-build/maven-components/maven-plugins/maven-jar-plugin
Downloading dependencies ...
Compiling sources ...
Generating maven plugin descriptor ...
Packaging resources ...
Compiling test sources ...
Packaging test resources ...

-------------------------------------------------------
 T E S T S
-------------------------------------------------------
There are no test to run.

Resume :
[surefire] Tests run: 0, Failures: 0, Errors: 0

Installing POM: /home/users/jvanzyl/maven-repo-local/maven/poms/maven-jar-plugin-1.0-SNAPSHOT.pom
Installing Plugin: /home/users/jvanzyl/maven-repo-local/maven/plugins/maven-jar-plugin-1.0-SNAPSHOT.jar
--------------------------------------------------------------------
Building project in /home/users/jvanzyl/m2-build/maven-components/maven-plugins/maven-plugin-plugin
...
--------------------------------------------------------------------
Building project in /home/users/jvanzyl/m2-build/maven-components/maven-plugins/maven-plugin-plugin
Downloading dependencies ...
Compiling sources ...
Generating maven plugin descriptor ...
Packaging resources ...
Compiling test sources ...
Packaging test resources ...

-------------------------------------------------------
 T E S T S
-------------------------------------------------------
There are no test to run.

Resume :
[surefire] Tests run: 0, Failures: 0, Errors: 0

Installing POM: /home/users/jvanzyl/maven-repo-local/maven/poms/maven-plugin-plugin-1.0-SNAPSHOT.pom
Installing Plugin: /home/users/jvanzyl/maven-repo-local/maven/plugins/maven-plugin-plugin-1.0-SNAPSHOT.jar
--------------------------------------------------------------------
Building project in /home/users/jvanzyl/m2-build/maven-components/maven-plugins/maven-pom-plugin
...
--------------------------------------------------------------------
Building project in /home/users/jvanzyl/m2-build/maven-components/maven-plugins/maven-pom-plugin
Downloading dependencies ...
Compiling sources ...
Generating maven plugin descriptor ...
Packaging resources ...
Compiling test sources ...
Packaging test resources ...

-------------------------------------------------------
 T E S T S
-------------------------------------------------------
There are no test to run.

Resume :
[surefire] Tests run: 0, Failures: 0, Errors: 0

Installing POM: /home/users/jvanzyl/maven-repo-local/maven/poms/maven-pom-plugin-1.0-SNAPSHOT.pom
Installing Plugin: /home/users/jvanzyl/maven-repo-local/maven/plugins/maven-pom-plugin-1.0-SNAPSHOT.jar
--------------------------------------------------------------------
Building project in /home/users/jvanzyl/m2-build/maven-components/maven-plugins/maven-resources-plugin
...
--------------------------------------------------------------------
Building project in /home/users/jvanzyl/m2-build/maven-components/maven-plugins/maven-resources-plugin
Downloading dependencies ...
Compiling sources ...
Generating maven plugin descriptor ...
Packaging resources ...
Compiling test sources ...
Packaging test resources ...

-------------------------------------------------------
 T E S T S
-------------------------------------------------------
There are no test to run.

Resume :
[surefire] Tests run: 0, Failures: 0, Errors: 0

Installing POM: /home/users/jvanzyl/maven-repo-local/maven/poms/maven-resources-plugin-1.0-SNAPSHOT.pom
Installing Plugin: /home/users/jvanzyl/maven-repo-local/maven/plugins/maven-resources-plugin-1.0-SNAPSHOT.jar
--------------------------------------------------------------------
Building project in /home/users/jvanzyl/m2-build/maven-components/maven-plugins/maven-surefire-plugin
...
--------------------------------------------------------------------
Building project in /home/users/jvanzyl/m2-build/maven-components/maven-plugins/maven-surefire-plugin
Downloading dependencies ...
Compiling sources ...
Generating maven plugin descriptor ...
Packaging resources ...
Compiling test sources ...
Packaging test resources ...

-------------------------------------------------------
 T E S T S
-------------------------------------------------------
There are no test to run.

Resume :
[surefire] Tests run: 0, Failures: 0, Errors: 0

Installing POM: /home/users/jvanzyl/maven-repo-local/maven/poms/maven-surefire-plugin-1.0-SNAPSHOT.pom
Installing Plugin: /home/users/jvanzyl/maven-repo-local/maven/plugins/maven-surefire-plugin-1.0-SNAPSHOT.jar
--------------------------------------------------------------------
Executing "chmod +x /home/users/jvanzyl/m2/bin/m2"
Total time: 1 minutes 12 seconds
Finished at: Wed Aug 11 16:19:38 EDT 2004

Running maven-core integration tests ...

----------------------------------------------------------
Running integration test it0000 ...
----------------------------------------------------------
clean is not installed. Now installing into /home/users/jvanzyl/maven-repo-local ...
adding plugin maven:maven-clean-plugin:plugin:1.0-SNAPSHOT
[INFO] [clean:clean]
jar is not installed. Now installing into /home/users/jvanzyl/maven-repo-local ...
adding plugin maven:maven-jar-plugin:plugin:1.0-SNAPSHOT
surefire is not installed. Now installing into /home/users/jvanzyl/maven-repo-local ...
adding plugin maven:maven-surefire-plugin:plugin:1.0-SNAPSHOT
compiler is not installed. Now installing into /home/users/jvanzyl/maven-repo-local ...
adding plugin maven:maven-compiler-plugin:plugin:1.0-SNAPSHOT
resources is not installed. Now installing into /home/users/jvanzyl/maven-repo-local ...
adding plugin maven:maven-resources-plugin:plugin:1.0-SNAPSHOT
[INFO] [compiler:compile]
[INFO] [compiler:testCompile]
[INFO] [resources:resources]
[INFO] [resources:testResources]
[INFO] [surefire:test]

-------------------------------------------------------
 T E S T S
-------------------------------------------------------
[surefire] Running org.apache.maven.it0000.PersonTest
[surefire] Tests run: 1, Failures: 0, Errors: 0, Time elapsed: 0.003 sec
There are no test to run.

Resume :
[surefire] Tests run: 1, Failures: 0, Errors: 0

[INFO] [jar:jar]
[INFO] ----------------------------------------------------------------------------
[INFO] BUILD SUCCESSFUL
[INFO] ----------------------------------------------------------------------------
[INFO] Total time: 16 seconds
[INFO] Finished at: Wed Aug 11 16:19:55 EDT 2004
[INFO] Final Memory: 1M/2M
[INFO] ----------------------------------------------------------------------------
-----------------------------------------------------------------------------------> OK
----------------------------------------------------------
Running integration test it0001 ...
----------------------------------------------------------
clean is not installed. Now installing into /home/users/jvanzyl/maven-repo-local ...
adding plugin maven:maven-clean-plugin:plugin:1.0-SNAPSHOT
[INFO] [clean:clean]
jar is not installed. Now installing into /home/users/jvanzyl/maven-repo-local ...
adding plugin maven:maven-jar-plugin:plugin:1.0-SNAPSHOT
surefire is not installed. Now installing into /home/users/jvanzyl/maven-repo-local ...
adding plugin maven:maven-surefire-plugin:plugin:1.0-SNAPSHOT
compiler is not installed. Now installing into /home/users/jvanzyl/maven-repo-local ...
adding plugin maven:maven-compiler-plugin:plugin:1.0-SNAPSHOT
resources is not installed. Now installing into /home/users/jvanzyl/maven-repo-local ...
adding plugin maven:maven-resources-plugin:plugin:1.0-SNAPSHOT
[INFO] [compiler:compile]
[INFO] [compiler:testCompile]
[INFO] [resources:resources]
[INFO] [resources:testResources]
[INFO] [surefire:test]

-------------------------------------------------------
 T E S T S
-------------------------------------------------------
[surefire] Running org.apache.maven.it0001.PersonTest
[surefire] Tests run: 1, Failures: 0, Errors: 0, Time elapsed: 0.003 sec
There are no test to run.

Resume :
[surefire] Tests run: 1, Failures: 0, Errors: 0

[INFO] [jar:jar]
[INFO] ----------------------------------------------------------------------------
[INFO] BUILD SUCCESSFUL
[INFO] ----------------------------------------------------------------------------
[INFO] Total time: 1 seconds
[INFO] Finished at: Wed Aug 11 16:19:58 EDT 2004
[INFO] Final Memory: 1M/2M
[INFO] ----------------------------------------------------------------------------
-----------------------------------------------------------------------------------> OK
----------------------------------------------------------
Running integration test it0002 ...
----------------------------------------------------------

Removing maven-it-support-1.0.jar from the local repository so we can verify its downloading
...

clean is not installed. Now installing into /home/users/jvanzyl/maven-repo-local ...
adding plugin maven:maven-clean-plugin:plugin:1.0-SNAPSHOT
[INFO] [clean:clean]
jar is not installed. Now installing into /home/users/jvanzyl/maven-repo-local ...
adding plugin maven:maven-jar-plugin:plugin:1.0-SNAPSHOT
surefire is not installed. Now installing into /home/users/jvanzyl/maven-repo-local ...
adding plugin maven:maven-surefire-plugin:plugin:1.0-SNAPSHOT
compiler is not installed. Now installing into /home/users/jvanzyl/maven-repo-local ...
adding plugin maven:maven-compiler-plugin:plugin:1.0-SNAPSHOT
resources is not installed. Now installing into /home/users/jvanzyl/maven-repo-local ...
adding plugin maven:maven-resources-plugin:plugin:1.0-SNAPSHOT
[INFO] [compiler:compile]
[INFO] [compiler:testCompile]
[INFO] [resources:resources]
[INFO] [resources:testResources]
[INFO] [surefire:test]

-------------------------------------------------------
 T E S T S
-------------------------------------------------------
[surefire] Running org.apache.maven.it0001.PersonTest
[surefire] Tests run: 1, Failures: 0, Errors: 0, Time elapsed: 0.005 sec
[surefire] Running org.apache.maven.it0002.PersonTest
[surefire] Tests run: 1, Failures: 0, Errors: 0, Time elapsed: 0.001 sec
There are no test to run.

Resume :
[surefire] Tests run: 2, Failures: 0, Errors: 0

[INFO] [jar:jar]
[INFO] ----------------------------------------------------------------------------
[INFO] BUILD SUCCESSFUL
[INFO] ----------------------------------------------------------------------------
[INFO] Total time: 1 seconds
[INFO] Finished at: Wed Aug 11 16:20:00 EDT 2004
[INFO] Final Memory: 0M/2M
[INFO] ----------------------------------------------------------------------------
-----------------------------------------------------------------------------------> OK
----------------------------------------------------------
Running integration test it0003 ...
----------------------------------------------------------

Removing maven-core-it0003-1.0.jar from the local repository so we can verify jar installation
...

clean is not installed. Now installing into /home/users/jvanzyl/maven-repo-local ...
adding plugin maven:maven-clean-plugin:plugin:1.0-SNAPSHOT
[INFO] [clean:clean]
jar is not installed. Now installing into /home/users/jvanzyl/maven-repo-local ...
adding plugin maven:maven-jar-plugin:plugin:1.0-SNAPSHOT
surefire is not installed. Now installing into /home/users/jvanzyl/maven-repo-local ...
adding plugin maven:maven-surefire-plugin:plugin:1.0-SNAPSHOT
compiler is not installed. Now installing into /home/users/jvanzyl/maven-repo-local ...
adding plugin maven:maven-compiler-plugin:plugin:1.0-SNAPSHOT
resources is not installed. Now installing into /home/users/jvanzyl/maven-repo-local ...
adding plugin maven:maven-resources-plugin:plugin:1.0-SNAPSHOT
[INFO] [compiler:compile]
[INFO] [compiler:testCompile]
[INFO] [resources:resources]
[INFO] [resources:testResources]
[INFO] [surefire:test]

-------------------------------------------------------
 T E S T S
-------------------------------------------------------
[surefire] Running org.apache.maven.it0003.PersonTest
[surefire] Tests run: 1, Failures: 0, Errors: 0, Time elapsed: 0.002 sec
There are no test to run.

Resume :
[surefire] Tests run: 1, Failures: 0, Errors: 0

[INFO] [jar:jar]
[INFO] [jar:install]
[INFO] Installing /home/users/jvanzyl/m2-build/maven-components/maven-core-it/it0003/target/maven-core-it0003-1.0.jar
to /home/users/jvanzyl/maven-repo-local/maven/jars/maven-core-it0003-1.0.jar
[INFO] ----------------------------------------------------------------------------
[INFO] BUILD SUCCESSFUL
[INFO] ----------------------------------------------------------------------------
[INFO] Total time: 1 seconds
[INFO] Finished at: Wed Aug 11 16:20:03 EDT 2004
[INFO] Final Memory: 1M/2M
[INFO] ----------------------------------------------------------------------------
-----------------------------------------------------------------------------------> OK
----------------------------------------------------------
Running integration test it0004 ...
----------------------------------------------------------

Removing maven-core-it0004-1.0.pom from the local repository so we can verify pom installation
...

clean is not installed. Now installing into /home/users/jvanzyl/maven-repo-local ...
adding plugin maven:maven-clean-plugin:plugin:1.0-SNAPSHOT
[INFO] [clean:clean]
pom is not installed. Now installing into /home/users/jvanzyl/maven-repo-local ...
adding plugin maven:maven-pom-plugin:plugin:1.0-SNAPSHOT
[INFO] [pom:install]
[INFO] Installing /home/users/jvanzyl/m2-build/maven-components/maven-core-it/it0004/pom.xml
to /home/users/jvanzyl/maven-repo-local/maven/poms/maven-core-it0004-1.0.pom
[INFO] ----------------------------------------------------------------------------
[INFO] BUILD SUCCESSFUL
[INFO] ----------------------------------------------------------------------------
[INFO] Total time: 0 seconds
[INFO] Finished at: Wed Aug 11 16:20:04 EDT 2004
[INFO] Final Memory: 0M/1M
[INFO] ----------------------------------------------------------------------------
-----------------------------------------------------------------------------------> OK
----------------------------------------------------------
Running integration test it0005 ...
----------------------------------------------------------

Removing maven-core-it0005-1.0.pom from the local repository so we can verify pom installation
...

clean is not installed. Now installing into /home/users/jvanzyl/maven-repo-local ...
adding plugin maven:maven-clean-plugin:plugin:1.0-SNAPSHOT
[INFO] [clean:clean]
pom is not installed. Now installing into /home/users/jvanzyl/maven-repo-local ...
adding plugin maven:maven-pom-plugin:plugin:1.0-SNAPSHOT
[INFO] [pom:install]
[INFO] Installing /home/users/jvanzyl/m2-build/maven-components/maven-core-it/it0005/pom.xml
to /home/users/jvanzyl/maven-repo-local/maven/poms/maven-core-it0005-1.0-SNAPSHOT.pom
[INFO] ----------------------------------------------------------------------------
[INFO] BUILD SUCCESSFUL
[INFO] ----------------------------------------------------------------------------
[INFO] Total time: 0 seconds
[INFO] Finished at: Wed Aug 11 16:20:05 EDT 2004
[INFO] Final Memory: 0M/1M
[INFO] ----------------------------------------------------------------------------
Exception in thread "main" org.apache.maven.it.VerificationException: org.apache.maven.it.VerificationException:
Expected file was not found: /home/users/jvanzyl/maven-repo-local/maven/poms/maven-core-it0005-1.0-SNAPSHOT.pom.snapshot-version
	at org.apache.maven.it.Verifier.verify(Verifier.java:92)
	at org.apache.maven.it.Verifier.main(Verifier.java:197)
Caused by: org.apache.maven.it.VerificationException: Expected file was not found: /home/users/jvanzyl/maven-repo-local/maven/poms/maven-core-it0005-1.0-SNAPSHOT.pom.snapshot-version
	at org.apache.maven.it.Verifier.verifyExpectedResult(Verifier.java:145)
	at org.apache.maven.it.Verifier.verify(Verifier.java:87)
	... 1 more
----------------------------------------------------------
Running integration test it0006 ...
----------------------------------------------------------
clean is not installed. Now installing into /home/users/jvanzyl/maven-repo-local ...
adding plugin maven:maven-clean-plugin:plugin:1.0-SNAPSHOT
[INFO] [clean:clean]
jar is not installed. Now installing into /home/users/jvanzyl/maven-repo-local ...
adding plugin maven:maven-jar-plugin:plugin:1.0-SNAPSHOT
surefire is not installed. Now installing into /home/users/jvanzyl/maven-repo-local ...
adding plugin maven:maven-surefire-plugin:plugin:1.0-SNAPSHOT
compiler is not installed. Now installing into /home/users/jvanzyl/maven-repo-local ...
adding plugin maven:maven-compiler-plugin:plugin:1.0-SNAPSHOT
resources is not installed. Now installing into /home/users/jvanzyl/maven-repo-local ...
adding plugin maven:maven-resources-plugin:plugin:1.0-SNAPSHOT
[INFO] [clean:clean]
[INFO] [compiler:compile]
[INFO] [compiler:testCompile]
[INFO] [resources:resources]
[INFO] [resources:testResources]
[INFO] [surefire:test]

-------------------------------------------------------
 T E S T S
-------------------------------------------------------
[surefire] Running org.apache.maven.it0000.PersonTest
[surefire] Tests run: 1, Failures: 0, Errors: 0, Time elapsed: 0.003 sec
There are no test to run.

Resume :
[surefire] Tests run: 1, Failures: 0, Errors: 0

[INFO] [jar:jar]
[INFO] [jar:install]
[INFO] Installing /home/users/jvanzyl/m2-build/maven-components/maven-core-it/it0006/target/maven-core-it0006-1.0.jar
to /home/users/jvanzyl/maven-repo-local/maven/jars/maven-core-it0006-1.0.jar
[INFO] [compiler:testCompile]
[INFO] [resources:resources]
[INFO] [resources:testResources]
[INFO] [surefire:test]

-------------------------------------------------------
 T E S T S
-------------------------------------------------------
[surefire] Running org.apache.maven.it0000.PersonTest
[surefire] Tests run: 1, Failures: 0, Errors: 0, Time elapsed: 0.003 sec
There are no test to run.

Resume :
[surefire] Tests run: 1, Failures: 0, Errors: 0

[INFO] [jar:jar]
[INFO] ----------------------------------------------------------------------------
[INFO] BUILD SUCCESSFUL
[INFO] ----------------------------------------------------------------------------
[INFO] Total time: 2 seconds
[INFO] Finished at: Wed Aug 11 16:20:09 EDT 2004
[INFO] Final Memory: 0M/2M
[INFO] ----------------------------------------------------------------------------
-----------------------------------------------------------------------------------> OK
----------------------------------------------------------
Running integration test it0007 ...
----------------------------------------------------------

Removing maven-it-support-parent-1.0.pom from the local repository so we can verify its downloading
...

clean is not installed. Now installing into /home/users/jvanzyl/maven-repo-local ...
adding plugin maven:maven-clean-plugin:plugin:1.0-SNAPSHOT
[INFO] [clean:clean]
jar is not installed. Now installing into /home/users/jvanzyl/maven-repo-local ...
adding plugin maven:maven-jar-plugin:plugin:1.0-SNAPSHOT
surefire is not installed. Now installing into /home/users/jvanzyl/maven-repo-local ...
adding plugin maven:maven-surefire-plugin:plugin:1.0-SNAPSHOT
compiler is not installed. Now installing into /home/users/jvanzyl/maven-repo-local ...
adding plugin maven:maven-compiler-plugin:plugin:1.0-SNAPSHOT
resources is not installed. Now installing into /home/users/jvanzyl/maven-repo-local ...
adding plugin maven:maven-resources-plugin:plugin:1.0-SNAPSHOT
[INFO] [compiler:compile]
[INFO] [compiler:testCompile]
[INFO] [resources:resources]
[INFO] [resources:testResources]
[INFO] [surefire:test]

-------------------------------------------------------
 T E S T S
-------------------------------------------------------
[surefire] Running org.apache.maven.it0007.PersonTest
[surefire] Tests run: 1, Failures: 0, Errors: 0, Time elapsed: 0.01 sec
There are no test to run.

Resume :
[surefire] Tests run: 1, Failures: 0, Errors: 0

[INFO] [jar:jar]
[INFO] ----------------------------------------------------------------------------
[INFO] BUILD SUCCESSFUL
[INFO] ----------------------------------------------------------------------------
[INFO] Total time: 1 seconds
[INFO] Finished at: Wed Aug 11 16:20:11 EDT 2004
[INFO] Final Memory: 1M/2M
[INFO] ----------------------------------------------------------------------------
-----------------------------------------------------------------------------------> OK

Creating m2 distribution for public consumption: http://www.codehaus.org/~jvanzyl/m2/m2-20041811.161808.tar.gz

./ci.sh: line 130: cd: m2-build/maven-components/maven-core/dist: No such file or directory

Mime
View raw message