maven-m2-dev mailing list archives

Site index · List index
Message view « Date » · « Thread »
Top « Date » · « Thread »
From jvan...@maven.org
Subject [maven2 build] Tue Aug 10 08:59:51 EDT 2004
Date Tue, 10 Aug 2004 13:01:42 GMT

Performing a clean check out of maven-components ...

Updates occured, build required ...


-----------------------------------------------------------------------
 Building mboot ... 
-----------------------------------------------------------------------
-----------------------------------------------------------------------
 Building maven2 components ... 
-----------------------------------------------------------------------
Using the following for your maven.repo.local: /home/users/jvanzyl/maven-repo-local
Checking for MBoot's dependencies ...
...................................................................................
.
...
.
.............................
.
.......................................................................
.
................................................................
.
...............................................
.
......................................
.
..
.
Installing POM: /home/users/jvanzyl/maven-repo-local/maven/poms/maven-component-2.0-SNAPSHOT.pom
Installing POM: /home/users/jvanzyl/maven-repo-local/maven/poms/maven-plugin-parent-2.0-SNAPSHOT.pom
Building project in /home/users/jvanzyl/m2-build/maven-components/maven-model ...
--------------------------------------------------------------------
Building project in /home/users/jvanzyl/m2-build/maven-components/maven-model
Downloading dependencies ...
.....................................................................................................................................
.
.........................
.
Model exists!
Generating java in /home/users/jvanzyl/m2-build/maven-components/maven-model/target/generated-sources from /home/users/jvanzyl/m2-build/maven-components/maven-model/maven.mdo
Generating java in /home/users/jvanzyl/m2-build/maven-components/maven-model/target/generated-sources from /home/users/jvanzyl/m2-build/maven-components/maven-model/maven.mdo
Generating xpp3 unmarshaller in /home/users/jvanzyl/m2-build/maven-components/maven-model/target/generated-sources from /home/users/jvanzyl/m2-build/maven-components/maven-model/maven.mdo
Generating xpp3 marshaller in /home/users/jvanzyl/m2-build/maven-components/maven-model/target/generated-sources from /home/users/jvanzyl/m2-build/maven-components/maven-model/maven.mdo
Generating xpp3 unmarshaller in /home/users/jvanzyl/m2-build/maven-components/maven-model/target/generated-sources from /home/users/jvanzyl/m2-build/maven-components/maven-model/maven.mdo
Generating xpp3 marshaller in /home/users/jvanzyl/m2-build/maven-components/maven-model/target/generated-sources from /home/users/jvanzyl/m2-build/maven-components/maven-model/maven.mdo
Compiling sources ...
Packaging resources ...
Compiling test sources ...
Packaging test resources ...

-------------------------------------------------------
 T E S T S
-------------------------------------------------------
There are no test to run.

Resume :
[surefire] Tests run: 0, Failures: 0, Errors: 0

Installing POM: /home/users/jvanzyl/maven-repo-local/maven/poms/maven-model-2.0-SNAPSHOT.pom
Installing JAR: /home/users/jvanzyl/maven-repo-local/maven/jars/maven-model-2.0-SNAPSHOT.jar
--------------------------------------------------------------------
Building project in /home/users/jvanzyl/m2-build/maven-components/maven-plugin ...
--------------------------------------------------------------------
Building project in /home/users/jvanzyl/m2-build/maven-components/maven-plugin
Downloading dependencies ...
Compiling sources ...
Packaging resources ...
Compiling test sources ...
Packaging test resources ...

-------------------------------------------------------
 T E S T S
-------------------------------------------------------
[surefire] Running org.apache.maven.plugin.BeanTest
[surefire] Tests run: 1, Failures: 0, Errors: 0, Time elapsed: 0.006 sec
[surefire] Running org.apache.maven.plugin.TestPluginTest
[surefire] Tests run: 1, Failures: 0, Errors: 0, Time elapsed: 0.001 sec
There are no test to run.

Resume :
[surefire] Tests run: 2, Failures: 0, Errors: 0

Installing POM: /home/users/jvanzyl/maven-repo-local/maven/poms/maven-plugin-2.0-SNAPSHOT.pom
Installing JAR: /home/users/jvanzyl/maven-repo-local/maven/jars/maven-plugin-2.0-SNAPSHOT.jar
--------------------------------------------------------------------
Building project in /home/users/jvanzyl/m2-build/maven-components/maven-plugin-tools ...
--------------------------------------------------------------------
Building project in /home/users/jvanzyl/m2-build/maven-components/maven-plugin-tools
Downloading dependencies ...
.
Compiling sources ...
Packaging resources ...
Compiling test sources ...
Packaging test resources ...

-------------------------------------------------------
 T E S T S
-------------------------------------------------------
[surefire] Running org.apache.maven.plugin.generator.jelly.JellyHarnessGeneratorTest
[surefire] Tests run: 1, Failures: 0, Errors: 0, Time elapsed: 0.114 sec
[surefire] Running org.apache.maven.plugin.generator.BeanGeneratorTest
[surefire] Tests run: 1, Failures: 0, Errors: 0, Time elapsed: 0.063 sec
[surefire] Running org.apache.maven.plugin.generator.PluginDescriptorGeneratorTest
[surefire] Tests run: 1, Failures: 0, Errors: 0, Time elapsed: 0.068 sec
[surefire] Running org.apache.maven.plugin.generator.PluginXdocGeneratorTest
[surefire] Tests run: 1, Failures: 0, Errors: 0, Time elapsed: 0.009 sec
There are no test to run.

Resume :
[surefire] Tests run: 4, Failures: 0, Errors: 0

Installing POM: /home/users/jvanzyl/maven-repo-local/maven/poms/maven-plugin-tools-2.0-SNAPSHOT.pom
Installing JAR: /home/users/jvanzyl/maven-repo-local/maven/jars/maven-plugin-tools-2.0-SNAPSHOT.jar
--------------------------------------------------------------------
Building project in /home/users/jvanzyl/m2-build/maven-components/maven-artifact ...
--------------------------------------------------------------------
Building project in /home/users/jvanzyl/m2-build/maven-components/maven-artifact
Downloading dependencies ...
.................................
.
..
.
Compiling sources ...
Packaging resources ...
Compiling test sources ...
/home/users/jvanzyl/m2-build/maven-components/maven-artifact/src/test/java/org/apache/maven/artifact/resolver/ArtifactResolverTest.java:[151,56]  No method matching createArtifact(java.lang.String, java.lang.String) found in class org.apache.maven.artifact.resolver.ArtifactResolverTest.
/home/users/jvanzyl/m2-build/maven-components/maven-artifact/src/test/java/org/apache/maven/artifact/resolver/ArtifactResolverTest.java:[197,56]  No method matching createArtifact(java.lang.String, java.lang.String) found in class org.apache.maven.artifact.resolver.ArtifactResolverTest.
Packaging test resources ...

-------------------------------------------------------
 T E S T S
-------------------------------------------------------
[surefire] Running org.apache.maven.artifact.deployer.ArtifactDeployerTest
[surefire] Tests run: 1, Failures: 0, Errors: 0, Time elapsed: 0.355 sec
[INFO] Installing /home/users/jvanzyl/m2-build/maven-components/maven-artifact/src/test/resources/artifact-install/artifact-1.0.jar to target/test-classes/repositories/installer/local-repository/maven/jars/artifact-1.0.jar
[surefire] Running org.apache.maven.artifact.installer.ArtifactInstallerTest
[surefire] Tests run: 1, Failures: 0, Errors: 0, Time elapsed: 0.03 sec
[ERROR] Nonexistent component: org.apache.maven.wagon.Wagond
[surefire] Running org.apache.maven.artifact.manager.DefaultWagonManagerTest
[surefire] Tests run: 1, Failures: 0, Errors: 0, Time elapsed: 0.032 sec
There are no test to run.

Resume :
[surefire] Tests run: 3, Failures: 0, Errors: 0

Installing POM: /home/users/jvanzyl/maven-repo-local/maven/poms/maven-artifact-2.0-SNAPSHOT.pom
Installing JAR: /home/users/jvanzyl/maven-repo-local/maven/jars/maven-artifact-2.0-SNAPSHOT.jar
--------------------------------------------------------------------
Building project in /home/users/jvanzyl/m2-build/maven-components/maven-core ...
--------------------------------------------------------------------
Building project in /home/users/jvanzyl/m2-build/maven-components/maven-core
Downloading dependencies ...
.
.
.....................
.
......
.
.......................................................................................................
.
....................................
.
..
.
.........................
.
Compiling sources ...
Packaging resources ...
Compiling test sources ...
Packaging test resources ...

-------------------------------------------------------
 T E S T S
-------------------------------------------------------
[surefire] Running org.apache.maven.decoration.DefaultGoalDecoratorTest
[surefire] Tests run: 3, Failures: 0, Errors: 0, Time elapsed: 0 sec
[surefire] Running org.apache.maven.decoration.GoalDecorationParserTest
[surefire] Tests run: 5, Failures: 0, Errors: 0, Time elapsed: 0.001 sec
[surefire] Running org.apache.maven.decoration.GoalDecoratorBindingsTest
[surefire] Tests run: 7, Failures: 0, Errors: 0, Time elapsed: 0 sec
[surefire] Running org.apache.maven.MavenTest
[surefire] Tests run: 1, Failures: 0, Errors: 0, Time elapsed: 0.32 sec
[surefire] Running org.apache.maven.lifecycle.phase.GoalDecorationPhaseTest
[surefire] Tests run: 2, Failures: 0, Errors: 0, Time elapsed: 0.048 sec
Resolved goals: [t1:preGoal, t1:main, t1:postGoal]
Resolved goals: [t2:prereq, t2:main]
Resolved goals: [t3:preGoal, t3:prereq, t3:main, t3:postGoal]
Resolved goals: [t4:prereq-preGoal, t4:prereq, t4:prereq-postGoal, t4:main]
Resolved goals: [t5:prereq, t5:preGoal, t5:main]
[surefire] Running org.apache.maven.lifecycle.phase.GoalResolutionPhaseTest
[surefire] Tests run: 5, Failures: 0, Errors: 0, Time elapsed: 0.046 sec
[surefire] Running org.apache.maven.lifecycle.MavenLifecycleManagerTest
[surefire] Tests run: 1, Failures: 0, Errors: 0, Time elapsed: 0.034 sec
[surefire] Running org.apache.maven.plugin.OgnlProjectValueExtractorTest
[surefire] Tests run: 5, Failures: 0, Errors: 0, Time elapsed: 0.043 sec
[surefire] Running org.apache.maven.plugin.PluginTest
[surefire] Tests run: 1, Failures: 0, Errors: 0, Time elapsed: 0.026 sec
[surefire] Running org.apache.maven.project.ProjectBaseDirectoryAlignmentTest
[surefire] Tests run: 1, Failures: 0, Errors: 0, Time elapsed: 0.052 sec
[surefire] Running org.apache.maven.project.inheritance.t00.ProjectInheritanceTest
[surefire] Tests run: 1, Failures: 0, Errors: 0, Time elapsed: 0.119 sec
[surefire] Running org.apache.maven.project.inheritance.t01.ProjectInheritanceTest
[surefire] Tests run: 1, Failures: 0, Errors: 0, Time elapsed: 0.345 sec
[surefire] Running org.apache.maven.project.validation.DefaultModelValidatorTest
[surefire] Tests run: 5, Failures: 0, Errors: 0, Time elapsed: 0.03 sec
There are no test to run.

Resume :
[surefire] Tests run: 38, Failures: 0, Errors: 0

Installing POM: /home/users/jvanzyl/maven-repo-local/maven/poms/maven-core-2.0-SNAPSHOT.pom
Installing JAR: /home/users/jvanzyl/maven-repo-local/maven/jars/maven-core-2.0-SNAPSHOT.jar
--------------------------------------------------------------------
Building project in /home/users/jvanzyl/m2-build/maven-components/maven-plugins/maven-clean-plugin ...
--------------------------------------------------------------------
Building project in /home/users/jvanzyl/m2-build/maven-components/maven-plugins/maven-clean-plugin
Downloading dependencies ...
Compiling sources ...
Generating maven plugin descriptor ...
Packaging resources ...
Compiling test sources ...
Packaging test resources ...

-------------------------------------------------------
 T E S T S
-------------------------------------------------------
There are no test to run.

Resume :
[surefire] Tests run: 0, Failures: 0, Errors: 0

Installing POM: /home/users/jvanzyl/maven-repo-local/maven/poms/maven-clean-plugin-1.0-SNAPSHOT.pom
Installing Plugin: /home/users/jvanzyl/maven-repo-local/maven/plugins/maven-clean-plugin-1.0-SNAPSHOT.jar
--------------------------------------------------------------------
Building project in /home/users/jvanzyl/m2-build/maven-components/maven-plugins/maven-compiler-plugin ...
--------------------------------------------------------------------
Building project in /home/users/jvanzyl/m2-build/maven-components/maven-plugins/maven-compiler-plugin
Downloading dependencies ...
.....
.
...
.
Compiling sources ...
Generating maven plugin descriptor ...
Packaging resources ...
Compiling test sources ...
Packaging test resources ...

-------------------------------------------------------
 T E S T S
-------------------------------------------------------
There are no test to run.

Resume :
[surefire] Tests run: 0, Failures: 0, Errors: 0

Installing POM: /home/users/jvanzyl/maven-repo-local/maven/poms/maven-compiler-plugin-1.0-SNAPSHOT.pom
Installing Plugin: /home/users/jvanzyl/maven-repo-local/maven/plugins/maven-compiler-plugin-1.0-SNAPSHOT.jar
--------------------------------------------------------------------
Building project in /home/users/jvanzyl/m2-build/maven-components/maven-plugins/maven-install-plugin ...
--------------------------------------------------------------------
Building project in /home/users/jvanzyl/m2-build/maven-components/maven-plugins/maven-install-plugin
Downloading dependencies ...
.
Compiling sources ...
Generating maven plugin descriptor ...
Packaging resources ...
Compiling test sources ...
Packaging test resources ...

-------------------------------------------------------
 T E S T S
-------------------------------------------------------
There are no test to run.

Resume :
[surefire] Tests run: 0, Failures: 0, Errors: 0

Installing POM: /home/users/jvanzyl/maven-repo-local/maven/poms/maven-install-plugin-1.0-SNAPSHOT.pom
Installing Plugin: /home/users/jvanzyl/maven-repo-local/maven/plugins/maven-install-plugin-1.0-SNAPSHOT.jar
--------------------------------------------------------------------
Building project in /home/users/jvanzyl/m2-build/maven-components/maven-plugins/maven-jar-plugin ...
--------------------------------------------------------------------
Building project in /home/users/jvanzyl/m2-build/maven-components/maven-plugins/maven-jar-plugin
Downloading dependencies ...
Compiling sources ...
Generating maven plugin descriptor ...
Packaging resources ...
Compiling test sources ...
Packaging test resources ...

-------------------------------------------------------
 T E S T S
-------------------------------------------------------
There are no test to run.

Resume :
[surefire] Tests run: 0, Failures: 0, Errors: 0

Installing POM: /home/users/jvanzyl/maven-repo-local/maven/poms/maven-jar-plugin-1.0-SNAPSHOT.pom
Installing Plugin: /home/users/jvanzyl/maven-repo-local/maven/plugins/maven-jar-plugin-1.0-SNAPSHOT.jar
--------------------------------------------------------------------
Building project in /home/users/jvanzyl/m2-build/maven-components/maven-plugins/maven-plugin-plugin ...
--------------------------------------------------------------------
Building project in /home/users/jvanzyl/m2-build/maven-components/maven-plugins/maven-plugin-plugin
Downloading dependencies ...
Compiling sources ...
Generating maven plugin descriptor ...
Packaging resources ...
Compiling test sources ...
Packaging test resources ...

-------------------------------------------------------
 T E S T S
-------------------------------------------------------
There are no test to run.

Resume :
[surefire] Tests run: 0, Failures: 0, Errors: 0

Installing POM: /home/users/jvanzyl/maven-repo-local/maven/poms/maven-plugin-plugin-1.0-SNAPSHOT.pom
Installing Plugin: /home/users/jvanzyl/maven-repo-local/maven/plugins/maven-plugin-plugin-1.0-SNAPSHOT.jar
--------------------------------------------------------------------
Building project in /home/users/jvanzyl/m2-build/maven-components/maven-plugins/maven-pom-plugin ...
--------------------------------------------------------------------
Building project in /home/users/jvanzyl/m2-build/maven-components/maven-plugins/maven-pom-plugin
Downloading dependencies ...
Compiling sources ...
Generating maven plugin descriptor ...
Packaging resources ...
Compiling test sources ...
Packaging test resources ...

-------------------------------------------------------
 T E S T S
-------------------------------------------------------
There are no test to run.

Resume :
[surefire] Tests run: 0, Failures: 0, Errors: 0

Installing POM: /home/users/jvanzyl/maven-repo-local/maven/poms/maven-pom-plugin-1.0-SNAPSHOT.pom
Installing Plugin: /home/users/jvanzyl/maven-repo-local/maven/plugins/maven-pom-plugin-1.0-SNAPSHOT.jar
--------------------------------------------------------------------
Building project in /home/users/jvanzyl/m2-build/maven-components/maven-plugins/maven-resources-plugin ...
--------------------------------------------------------------------
Building project in /home/users/jvanzyl/m2-build/maven-components/maven-plugins/maven-resources-plugin
Downloading dependencies ...
Compiling sources ...
Generating maven plugin descriptor ...
Packaging resources ...
Compiling test sources ...
Packaging test resources ...

-------------------------------------------------------
 T E S T S
-------------------------------------------------------
There are no test to run.

Resume :
[surefire] Tests run: 0, Failures: 0, Errors: 0

Installing POM: /home/users/jvanzyl/maven-repo-local/maven/poms/maven-resources-plugin-1.0-SNAPSHOT.pom
Installing Plugin: /home/users/jvanzyl/maven-repo-local/maven/plugins/maven-resources-plugin-1.0-SNAPSHOT.jar
--------------------------------------------------------------------
Building project in /home/users/jvanzyl/m2-build/maven-components/maven-plugins/maven-surefire-plugin ...
--------------------------------------------------------------------
Building project in /home/users/jvanzyl/m2-build/maven-components/maven-plugins/maven-surefire-plugin
Downloading dependencies ...
Compiling sources ...
Generating maven plugin descriptor ...
Packaging resources ...
Compiling test sources ...
Packaging test resources ...

-------------------------------------------------------
 T E S T S
-------------------------------------------------------
There are no test to run.

Resume :
[surefire] Tests run: 0, Failures: 0, Errors: 0

Installing POM: /home/users/jvanzyl/maven-repo-local/maven/poms/maven-surefire-plugin-1.0-SNAPSHOT.pom
Installing Plugin: /home/users/jvanzyl/maven-repo-local/maven/plugins/maven-surefire-plugin-1.0-SNAPSHOT.jar
--------------------------------------------------------------------
Executing "chmod +x /home/users/jvanzyl/m2/bin/m2"
Total time: 43 seconds
Finished at: Tue Aug 10 09:01:26 EDT 2004

Running maven-core integration tests ...


The verifier needs to be built ... 

Building project in /home/users/jvanzyl/m2-build/maven-components/maven-core-it-verifier
Using the following for your maven.repo.local: ${user.home}/maven-repo-local
Building tests in /home/users/jvanzyl/m2-build/maven-components/maven-core-it-verifier
Running tests in /home/users/jvanzyl/m2-build/maven-components/maven-core-it-verifier

-------------------------------------------------------
 T E S T S
-------------------------------------------------------
There are no test to run.

Resume :
[surefire] Tests run: 0, Failures: 0, Errors: 0

Building jars (maven-core-it-verifier-1.0.jar) in /home/users/jvanzyl/m2-build/maven-components/maven-core-it-verifier/target
Installing maven-core-it-verifier-1.0.jar in /home/users/jvanzyl/maven-repo-local/maven/jars
Installing POM in /home/users/jvanzyl/maven-repo-local/maven/poms/maven-core-it-verifier-1.0.pom
----------------------------------------------------------
Running integration test it0000 ...
----------------------------------------------------------
clean is not installed. Now installing into /home/users/jvanzyl/maven-repo-local ...
adding plugin maven:maven-clean-plugin:plugin:1.0-SNAPSHOT
[INFO] [clean:clean]
jar is not installed. Now installing into /home/users/jvanzyl/maven-repo-local ...
adding plugin maven:maven-jar-plugin:plugin:1.0-SNAPSHOT
surefire is not installed. Now installing into /home/users/jvanzyl/maven-repo-local ...
adding plugin maven:maven-surefire-plugin:plugin:1.0-SNAPSHOT
compiler is not installed. Now installing into /home/users/jvanzyl/maven-repo-local ...
adding plugin maven:maven-compiler-plugin:plugin:1.0-SNAPSHOT
org.apache.maven.artifact.resolver.ArtifactResolutionException: Error transitively resolving artifacts: 
	at org.apache.maven.artifact.resolver.DefaultArtifactResolver.resolveTransitively(DefaultArtifactResolver.java:125)
	at org.codehaus.plexus.DefaultPlexusContainer.addComponent(DefaultPlexusContainer.java:1092)
	at org.apache.maven.plugin.DefaultPluginManager.addPlugin(DefaultPluginManager.java:270)
	at org.apache.maven.plugin.DefaultPluginManager.verifyPluginForGoal(DefaultPluginManager.java:247)
	at org.apache.maven.plugin.DefaultPluginManager.processEdge(DefaultPluginManager.java:174)
	at org.apache.maven.plugin.DefaultPluginManager.processPluginDescriptor(DefaultPluginManager.java:137)
	at org.apache.maven.plugin.DefaultPluginManager.componentDiscovered(DefaultPluginManager.java:202)
	at org.codehaus.plexus.component.discovery.DefaultComponentDiscovererManager.fireComponentDiscoveryEvent(DefaultComponentDiscovererManager.java:47)
	at org.codehaus.plexus.component.discovery.AbstractComponentDiscoverer.findComponents(AbstractComponentDiscoverer.java:63)
	at org.codehaus.plexus.DefaultPlexusContainer.discoverComponents(DefaultPlexusContainer.java:493)
	at org.codehaus.plexus.DefaultPlexusContainer.addComponent(DefaultPlexusContainer.java:1058)
	at org.apache.maven.plugin.DefaultPluginManager.addPlugin(DefaultPluginManager.java:270)
	at org.apache.maven.plugin.DefaultPluginManager.verifyPluginForGoal(DefaultPluginManager.java:247)
	at org.apache.maven.plugin.DefaultPluginManager.processEdge(DefaultPluginManager.java:174)
	at org.apache.maven.plugin.DefaultPluginManager.processPluginDescriptor(DefaultPluginManager.java:137)
	at org.apache.maven.plugin.DefaultPluginManager.componentDiscovered(DefaultPluginManager.java:202)
	at org.codehaus.plexus.component.discovery.DefaultComponentDiscovererManager.fireComponentDiscoveryEvent(DefaultComponentDiscovererManager.java:47)
	at org.codehaus.plexus.component.discovery.AbstractComponentDiscoverer.findComponents(AbstractComponentDiscoverer.java:63)
	at org.codehaus.plexus.DefaultPlexusContainer.discoverComponents(DefaultPlexusContainer.java:493)
	at org.codehaus.plexus.DefaultPlexusContainer.addComponent(DefaultPlexusContainer.java:1058)
	at org.apache.maven.plugin.DefaultPluginManager.addPlugin(DefaultPluginManager.java:270)
	at org.apache.maven.plugin.DefaultPluginManager.verifyPluginForGoal(DefaultPluginManager.java:247)
	at org.apache.maven.lifecycle.phase.PluginDownloadPhase.execute(PluginDownloadPhase.java:54)
	at org.apache.maven.lifecycle.DefaultMavenLifecycleManager.execute(DefaultMavenLifecycleManager.java:48)
	at org.apache.maven.DefaultMaven.execute(DefaultMaven.java:121)
	at org.apache.maven.DefaultMaven.execute(DefaultMaven.java:82)
	at org.apache.maven.MavenCli.main(MavenCli.java:150)
	at sun.reflect.NativeMethodAccessorImpl.invoke0(Native Method)
	at sun.reflect.NativeMethodAccessorImpl.invoke(NativeMethodAccessorImpl.java:39)
	at sun.reflect.DelegatingMethodAccessorImpl.invoke(DelegatingMethodAccessorImpl.java:25)
	at java.lang.reflect.Method.invoke(Method.java:324)
	at org.codehaus.classworlds.Launcher.launchEnhanced(Launcher.java:350)
	at org.codehaus.classworlds.Launcher.launch(Launcher.java:290)
	at org.codehaus.classworlds.Launcher.main(Launcher.java:433)
Caused by: org.apache.maven.artifact.resolver.TransitiveArtifactResolutionException: Error retrieving metadata: 
	at org.apache.maven.artifact.resolver.DefaultArtifactResolver.collect(DefaultArtifactResolver.java:204)
	at org.apache.maven.artifact.resolver.DefaultArtifactResolver.resolveTransitively(DefaultArtifactResolver.java:118)
	... 33 more
Caused by: org.apache.maven.artifact.metadata.ArtifactMetadataRetrievalException: Cannot read artifact source: 
	at org.apache.maven.artifact.MavenMetadataSource.retrieve(MavenMetadataSource.java:82)
	at org.apache.maven.artifact.resolver.DefaultArtifactResolver.collect(DefaultArtifactResolver.java:200)
	... 34 more
Caused by: java.io.FileNotFoundException: /home/users/jvanzyl/maven-repo-local/plexus/poms/plexus-0.16.pom (No such file or directory)
	at java.io.FileInputStream.open(Native Method)
	at java.io.FileInputStream.<init>(FileInputStream.java:106)
	at java.io.FileReader.<init>(FileReader.java:55)
	at org.apache.maven.artifact.MavenMetadataSource.retrieve(MavenMetadataSource.java:76)
	... 35 more
resources is not installed. Now installing into /home/users/jvanzyl/maven-repo-local ...
adding plugin maven:maven-resources-plugin:plugin:1.0-SNAPSHOT
org.apache.maven.artifact.resolver.ArtifactResolutionException: Error transitively resolving artifacts: 
	at org.apache.maven.artifact.resolver.DefaultArtifactResolver.resolveTransitively(DefaultArtifactResolver.java:125)
	at org.codehaus.plexus.DefaultPlexusContainer.addComponent(DefaultPlexusContainer.java:1092)
	at org.apache.maven.plugin.DefaultPluginManager.addPlugin(DefaultPluginManager.java:270)
	at org.apache.maven.plugin.DefaultPluginManager.verifyPluginForGoal(DefaultPluginManager.java:247)
	at org.apache.maven.plugin.DefaultPluginManager.processEdge(DefaultPluginManager.java:174)
	at org.apache.maven.plugin.DefaultPluginManager.processPluginDescriptor(DefaultPluginManager.java:137)
	at org.apache.maven.plugin.DefaultPluginManager.componentDiscovered(DefaultPluginManager.java:202)
	at org.codehaus.plexus.component.discovery.DefaultComponentDiscovererManager.fireComponentDiscoveryEvent(DefaultComponentDiscovererManager.java:47)
	at org.codehaus.plexus.component.discovery.AbstractComponentDiscoverer.findComponents(AbstractComponentDiscoverer.java:63)
	at org.codehaus.plexus.DefaultPlexusContainer.discoverComponents(DefaultPlexusContainer.java:493)
	at org.codehaus.plexus.DefaultPlexusContainer.addComponent(DefaultPlexusContainer.java:1058)
	at org.apache.maven.plugin.DefaultPluginManager.addPlugin(DefaultPluginManager.java:270)
	at org.apache.maven.plugin.DefaultPluginManager.verifyPluginForGoal(DefaultPluginManager.java:247)
	at org.apache.maven.plugin.DefaultPluginManager.processEdge(DefaultPluginManager.java:174)
	at org.apache.maven.plugin.DefaultPluginManager.processPluginDescriptor(DefaultPluginManager.java:137)
	at org.apache.maven.plugin.DefaultPluginManager.componentDiscovered(DefaultPluginManager.java:202)
	at org.codehaus.plexus.component.discovery.DefaultComponentDiscovererManager.fireComponentDiscoveryEvent(DefaultComponentDiscovererManager.java:47)
	at org.codehaus.plexus.component.discovery.AbstractComponentDiscoverer.findComponents(AbstractComponentDiscoverer.java:63)
	at org.codehaus.plexus.DefaultPlexusContainer.discoverComponents(DefaultPlexusContainer.java:493)
	at org.codehaus.plexus.DefaultPlexusContainer.addComponent(DefaultPlexusContainer.java:1058)
	at org.apache.maven.plugin.DefaultPluginManager.addPlugin(DefaultPluginManager.java:270)
	at org.apache.maven.plugin.DefaultPluginManager.verifyPluginForGoal(DefaultPluginManager.java:247)
	at org.apache.maven.lifecycle.phase.PluginDownloadPhase.execute(PluginDownloadPhase.java:54)
	at org.apache.maven.lifecycle.DefaultMavenLifecycleManager.execute(DefaultMavenLifecycleManager.java:48)
	at org.apache.maven.DefaultMaven.execute(DefaultMaven.java:121)
	at org.apache.maven.DefaultMaven.execute(DefaultMaven.java:82)
	at org.apache.maven.MavenCli.main(MavenCli.java:150)
	at sun.reflect.NativeMethodAccessorImpl.invoke0(Native Method)
	at sun.reflect.NativeMethodAccessorImpl.invoke(NativeMethodAccessorImpl.java:39)
	at sun.reflect.DelegatingMethodAccessorImpl.invoke(DelegatingMethodAccessorImpl.java:25)
	at java.lang.reflect.Method.invoke(Method.java:324)
	at org.codehaus.classworlds.Launcher.launchEnhanced(Launcher.java:350)
	at org.codehaus.classworlds.Launcher.launch(Launcher.java:290)
	at org.codehaus.classworlds.Launcher.main(Launcher.java:433)
Caused by: org.apache.maven.artifact.resolver.TransitiveArtifactResolutionException: Error retrieving metadata: 
	at org.apache.maven.artifact.resolver.DefaultArtifactResolver.collect(DefaultArtifactResolver.java:204)
	at org.apache.maven.artifact.resolver.DefaultArtifactResolver.resolveTransitively(DefaultArtifactResolver.java:118)
	... 33 more
Caused by: org.apache.maven.artifact.metadata.ArtifactMetadataRetrievalException: Cannot read artifact source: 
	at org.apache.maven.artifact.MavenMetadataSource.retrieve(MavenMetadataSource.java:82)
	at org.apache.maven.artifact.resolver.DefaultArtifactResolver.collect(DefaultArtifactResolver.java:200)
	... 34 more
Caused by: java.io.FileNotFoundException: /home/users/jvanzyl/maven-repo-local/plexus/poms/plexus-0.16.pom (No such file or directory)
	at java.io.FileInputStream.open(Native Method)
	at java.io.FileInputStream.<init>(FileInputStream.java:106)
	at java.io.FileReader.<init>(FileReader.java:55)
	at org.apache.maven.artifact.MavenMetadataSource.retrieve(MavenMetadataSource.java:76)
	... 35 more
org.apache.maven.artifact.resolver.ArtifactResolutionException: Error transitively resolving artifacts: 
	at org.apache.maven.artifact.resolver.DefaultArtifactResolver.resolveTransitively(DefaultArtifactResolver.java:125)
	at org.codehaus.plexus.DefaultPlexusContainer.addComponent(DefaultPlexusContainer.java:1092)
	at org.apache.maven.plugin.DefaultPluginManager.addPlugin(DefaultPluginManager.java:270)
	at org.apache.maven.plugin.DefaultPluginManager.verifyPluginForGoal(DefaultPluginManager.java:247)
	at org.apache.maven.plugin.DefaultPluginManager.processEdge(DefaultPluginManager.java:174)
	at org.apache.maven.plugin.DefaultPluginManager.processPluginDescriptor(DefaultPluginManager.java:137)
	at org.apache.maven.plugin.DefaultPluginManager.componentDiscovered(DefaultPluginManager.java:202)
	at org.codehaus.plexus.component.discovery.DefaultComponentDiscovererManager.fireComponentDiscoveryEvent(DefaultComponentDiscovererManager.java:47)
	at org.codehaus.plexus.component.discovery.AbstractComponentDiscoverer.findComponents(AbstractComponentDiscoverer.java:63)
	at org.codehaus.plexus.DefaultPlexusContainer.discoverComponents(DefaultPlexusContainer.java:493)
	at org.codehaus.plexus.DefaultPlexusContainer.addComponent(DefaultPlexusContainer.java:1058)
	at org.apache.maven.plugin.DefaultPluginManager.addPlugin(DefaultPluginManager.java:270)
	at org.apache.maven.plugin.DefaultPluginManager.verifyPluginForGoal(DefaultPluginManager.java:247)
	at org.apache.maven.lifecycle.phase.PluginDownloadPhase.execute(PluginDownloadPhase.java:54)
	at org.apache.maven.lifecycle.DefaultMavenLifecycleManager.execute(DefaultMavenLifecycleManager.java:48)
	at org.apache.maven.DefaultMaven.execute(DefaultMaven.java:121)
	at org.apache.maven.DefaultMaven.execute(DefaultMaven.java:82)
	at org.apache.maven.MavenCli.main(MavenCli.java:150)
	at sun.reflect.NativeMethodAccessorImpl.invoke0(Native Method)
	at sun.reflect.NativeMethodAccessorImpl.invoke(NativeMethodAccessorImpl.java:39)
	at sun.reflect.DelegatingMethodAccessorImpl.invoke(DelegatingMethodAccessorImpl.java:25)
	at java.lang.reflect.Method.invoke(Method.java:324)
	at org.codehaus.classworlds.Launcher.launchEnhanced(Launcher.java:350)
	at org.codehaus.classworlds.Launcher.launch(Launcher.java:290)
	at org.codehaus.classworlds.Launcher.main(Launcher.java:433)
Caused by: org.apache.maven.artifact.resolver.TransitiveArtifactResolutionException: Error retrieving metadata: 
	at org.apache.maven.artifact.resolver.DefaultArtifactResolver.collect(DefaultArtifactResolver.java:204)
	at org.apache.maven.artifact.resolver.DefaultArtifactResolver.resolveTransitively(DefaultArtifactResolver.java:118)
	... 24 more
Caused by: org.apache.maven.artifact.metadata.ArtifactMetadataRetrievalException: Cannot read artifact source: 
	at org.apache.maven.artifact.MavenMetadataSource.retrieve(MavenMetadataSource.java:82)
	at org.apache.maven.artifact.resolver.DefaultArtifactResolver.collect(DefaultArtifactResolver.java:200)
	... 25 more
Caused by: java.io.FileNotFoundException: /home/users/jvanzyl/maven-repo-local/surefire/poms/surefire-booter-1.1.pom (No such file or directory)
	at java.io.FileInputStream.open(Native Method)
	at java.io.FileInputStream.<init>(FileInputStream.java:106)
	at java.io.FileReader.<init>(FileReader.java:55)
	at org.apache.maven.artifact.MavenMetadataSource.retrieve(MavenMetadataSource.java:76)
	... 26 more
[INFO] ----------------------------------------------------------------------------
[ERROR] BUILD ERROR
[INFO] ----------------------------------------------------------------------------
[ERROR] Cause: 
org.apache.maven.artifact.resolver.ArtifactResolutionException: Error transitively resolving artifacts: 
	at org.apache.maven.artifact.resolver.DefaultArtifactResolver.resolveTransitively(DefaultArtifactResolver.java:125)
	at org.codehaus.plexus.DefaultPlexusContainer.addComponent(DefaultPlexusContainer.java:1092)
	at org.apache.maven.plugin.DefaultPluginManager.addPlugin(DefaultPluginManager.java:270)
	at org.apache.maven.plugin.DefaultPluginManager.verifyPluginForGoal(DefaultPluginManager.java:247)
	at org.apache.maven.lifecycle.phase.PluginDownloadPhase.execute(PluginDownloadPhase.java:54)
	at org.apache.maven.lifecycle.DefaultMavenLifecycleManager.execute(DefaultMavenLifecycleManager.java:48)
	at org.apache.maven.DefaultMaven.execute(DefaultMaven.java:121)
	at org.apache.maven.DefaultMaven.execute(DefaultMaven.java:82)
	at org.apache.maven.MavenCli.main(MavenCli.java:150)
	at sun.reflect.NativeMethodAccessorImpl.invoke0(Native Method)
	at sun.reflect.NativeMethodAccessorImpl.invoke(NativeMethodAccessorImpl.java:39)
	at sun.reflect.DelegatingMethodAccessorImpl.invoke(DelegatingMethodAccessorImpl.java:25)
	at java.lang.reflect.Method.invoke(Method.java:324)
	at org.codehaus.classworlds.Launcher.launchEnhanced(Launcher.java:350)
	at org.codehaus.classworlds.Launcher.launch(Launcher.java:290)
	at org.codehaus.classworlds.Launcher.main(Launcher.java:433)
Caused by: org.apache.maven.artifact.resolver.TransitiveArtifactResolutionException: Error retrieving metadata: 
	at org.apache.maven.artifact.resolver.DefaultArtifactResolver.collect(DefaultArtifactResolver.java:204)
	at org.apache.maven.artifact.resolver.DefaultArtifactResolver.resolveTransitively(DefaultArtifactResolver.java:118)
	... 15 more
Caused by: org.apache.maven.artifact.metadata.ArtifactMetadataRetrievalException: Cannot read artifact source: 
	at org.apache.maven.artifact.MavenMetadataSource.retrieve(MavenMetadataSource.java:82)
	at org.apache.maven.artifact.resolver.DefaultArtifactResolver.collect(DefaultArtifactResolver.java:200)
	... 16 more
Caused by: java.io.FileNotFoundException: /home/users/jvanzyl/maven-repo-local/maven/poms/wagon-api-1.0-alpha-1-SNAPSHOT.pom (No such file or directory)
	at java.io.FileInputStream.open(Native Method)
	at java.io.FileInputStream.<init>(FileInputStream.java:106)
	at java.io.FileReader.<init>(FileReader.java:55)
	at org.apache.maven.artifact.MavenMetadataSource.retrieve(MavenMetadataSource.java:76)
	... 17 more
[INFO] ----------------------------------------------------------------------------
[INFO] Total time: 1 seconds
[INFO] Finished at: Tue Aug 10 09:01:30 EDT 2004
[INFO] Final Memory: 0M/1M
[INFO] ----------------------------------------------------------------------------
[INFO] ----------------------------------------------------------------------------
[INFO] BUILD SUCCESSFUL
[INFO] ----------------------------------------------------------------------------
[INFO] Total time: 1 seconds
[INFO] Finished at: Tue Aug 10 09:01:30 EDT 2004
[INFO] Final Memory: 0M/1M
[INFO] ----------------------------------------------------------------------------
Exception in thread "main" org.apache.maven.it.VerificationException: org.apache.maven.it.VerificationException: Expected file was not found: ./target/classes/org/apache/maven/it0000/Person.class
	at org.apache.maven.it.Verifier.verify(Verifier.java:92)
	at org.apache.maven.it.Verifier.main(Verifier.java:197)
Caused by: org.apache.maven.it.VerificationException: Expected file was not found: ./target/classes/org/apache/maven/it0000/Person.class
	at org.apache.maven.it.Verifier.verifyExpectedResult(Verifier.java:145)
	at org.apache.maven.it.Verifier.verify(Verifier.java:87)
	... 1 more
----------------------------------------------------------
Running integration test it0001 ...
----------------------------------------------------------
clean is not installed. Now installing into /home/users/jvanzyl/maven-repo-local ...
adding plugin maven:maven-clean-plugin:plugin:1.0-SNAPSHOT
[INFO] [clean:clean]
jar is not installed. Now installing into /home/users/jvanzyl/maven-repo-local ...
adding plugin maven:maven-jar-plugin:plugin:1.0-SNAPSHOT
surefire is not installed. Now installing into /home/users/jvanzyl/maven-repo-local ...
adding plugin maven:maven-surefire-plugin:plugin:1.0-SNAPSHOT
compiler is not installed. Now installing into /home/users/jvanzyl/maven-repo-local ...
adding plugin maven:maven-compiler-plugin:plugin:1.0-SNAPSHOT
org.apache.maven.artifact.resolver.ArtifactResolutionException: Error transitively resolving artifacts: 
	at org.apache.maven.artifact.resolver.DefaultArtifactResolver.resolveTransitively(DefaultArtifactResolver.java:125)
	at org.codehaus.plexus.DefaultPlexusContainer.addComponent(DefaultPlexusContainer.java:1092)
	at org.apache.maven.plugin.DefaultPluginManager.addPlugin(DefaultPluginManager.java:270)
	at org.apache.maven.plugin.DefaultPluginManager.verifyPluginForGoal(DefaultPluginManager.java:247)
	at org.apache.maven.plugin.DefaultPluginManager.processEdge(DefaultPluginManager.java:174)
	at org.apache.maven.plugin.DefaultPluginManager.processPluginDescriptor(DefaultPluginManager.java:137)
	at org.apache.maven.plugin.DefaultPluginManager.componentDiscovered(DefaultPluginManager.java:202)
	at org.codehaus.plexus.component.discovery.DefaultComponentDiscovererManager.fireComponentDiscoveryEvent(DefaultComponentDiscovererManager.java:47)
	at org.codehaus.plexus.component.discovery.AbstractComponentDiscoverer.findComponents(AbstractComponentDiscoverer.java:63)
	at org.codehaus.plexus.DefaultPlexusContainer.discoverComponents(DefaultPlexusContainer.java:493)
	at org.codehaus.plexus.DefaultPlexusContainer.addComponent(DefaultPlexusContainer.java:1058)
	at org.apache.maven.plugin.DefaultPluginManager.addPlugin(DefaultPluginManager.java:270)
	at org.apache.maven.plugin.DefaultPluginManager.verifyPluginForGoal(DefaultPluginManager.java:247)
	at org.apache.maven.plugin.DefaultPluginManager.processEdge(DefaultPluginManager.java:174)
	at org.apache.maven.plugin.DefaultPluginManager.processPluginDescriptor(DefaultPluginManager.java:137)
	at org.apache.maven.plugin.DefaultPluginManager.componentDiscovered(DefaultPluginManager.java:202)
	at org.codehaus.plexus.component.discovery.DefaultComponentDiscovererManager.fireComponentDiscoveryEvent(DefaultComponentDiscovererManager.java:47)
	at org.codehaus.plexus.component.discovery.AbstractComponentDiscoverer.findComponents(AbstractComponentDiscoverer.java:63)
	at org.codehaus.plexus.DefaultPlexusContainer.discoverComponents(DefaultPlexusContainer.java:493)
	at org.codehaus.plexus.DefaultPlexusContainer.addComponent(DefaultPlexusContainer.java:1058)
	at org.apache.maven.plugin.DefaultPluginManager.addPlugin(DefaultPluginManager.java:270)
	at org.apache.maven.plugin.DefaultPluginManager.verifyPluginForGoal(DefaultPluginManager.java:247)
	at org.apache.maven.lifecycle.phase.PluginDownloadPhase.execute(PluginDownloadPhase.java:54)
	at org.apache.maven.lifecycle.DefaultMavenLifecycleManager.execute(DefaultMavenLifecycleManager.java:48)
	at org.apache.maven.DefaultMaven.execute(DefaultMaven.java:121)
	at org.apache.maven.DefaultMaven.execute(DefaultMaven.java:82)
	at org.apache.maven.MavenCli.main(MavenCli.java:150)
	at sun.reflect.NativeMethodAccessorImpl.invoke0(Native Method)
	at sun.reflect.NativeMethodAccessorImpl.invoke(NativeMethodAccessorImpl.java:39)
	at sun.reflect.DelegatingMethodAccessorImpl.invoke(DelegatingMethodAccessorImpl.java:25)
	at java.lang.reflect.Method.invoke(Method.java:324)
	at org.codehaus.classworlds.Launcher.launchEnhanced(Launcher.java:350)
	at org.codehaus.classworlds.Launcher.launch(Launcher.java:290)
	at org.codehaus.classworlds.Launcher.main(Launcher.java:433)
Caused by: org.apache.maven.artifact.resolver.TransitiveArtifactResolutionException: Error retrieving metadata: 
	at org.apache.maven.artifact.resolver.DefaultArtifactResolver.collect(DefaultArtifactResolver.java:204)
	at org.apache.maven.artifact.resolver.DefaultArtifactResolver.resolveTransitively(DefaultArtifactResolver.java:118)
	... 33 more
Caused by: org.apache.maven.artifact.metadata.ArtifactMetadataRetrievalException: Cannot read artifact source: 
	at org.apache.maven.artifact.MavenMetadataSource.retrieve(MavenMetadataSource.java:82)
	at org.apache.maven.artifact.resolver.DefaultArtifactResolver.collect(DefaultArtifactResolver.java:200)
	... 34 more
Caused by: java.io.FileNotFoundException: /home/users/jvanzyl/maven-repo-local/plexus/poms/plexus-0.16.pom (No such file or directory)
	at java.io.FileInputStream.open(Native Method)
	at java.io.FileInputStream.<init>(FileInputStream.java:106)
	at java.io.FileReader.<init>(FileReader.java:55)
	at org.apache.maven.artifact.MavenMetadataSource.retrieve(MavenMetadataSource.java:76)
	... 35 more
resources is not installed. Now installing into /home/users/jvanzyl/maven-repo-local ...
adding plugin maven:maven-resources-plugin:plugin:1.0-SNAPSHOT
org.apache.maven.artifact.resolver.ArtifactResolutionException: Error transitively resolving artifacts: 
	at org.apache.maven.artifact.resolver.DefaultArtifactResolver.resolveTransitively(DefaultArtifactResolver.java:125)
	at org.codehaus.plexus.DefaultPlexusContainer.addComponent(DefaultPlexusContainer.java:1092)
	at org.apache.maven.plugin.DefaultPluginManager.addPlugin(DefaultPluginManager.java:270)
	at org.apache.maven.plugin.DefaultPluginManager.verifyPluginForGoal(DefaultPluginManager.java:247)
	at org.apache.maven.plugin.DefaultPluginManager.processEdge(DefaultPluginManager.java:174)
	at org.apache.maven.plugin.DefaultPluginManager.processPluginDescriptor(DefaultPluginManager.java:137)
	at org.apache.maven.plugin.DefaultPluginManager.componentDiscovered(DefaultPluginManager.java:202)
	at org.codehaus.plexus.component.discovery.DefaultComponentDiscovererManager.fireComponentDiscoveryEvent(DefaultComponentDiscovererManager.java:47)
	at org.codehaus.plexus.component.discovery.AbstractComponentDiscoverer.findComponents(AbstractComponentDiscoverer.java:63)
	at org.codehaus.plexus.DefaultPlexusContainer.discoverComponents(DefaultPlexusContainer.java:493)
	at org.codehaus.plexus.DefaultPlexusContainer.addComponent(DefaultPlexusContainer.java:1058)
	at org.apache.maven.plugin.DefaultPluginManager.addPlugin(DefaultPluginManager.java:270)
	at org.apache.maven.plugin.DefaultPluginManager.verifyPluginForGoal(DefaultPluginManager.java:247)
	at org.apache.maven.plugin.DefaultPluginManager.processEdge(DefaultPluginManager.java:174)
	at org.apache.maven.plugin.DefaultPluginManager.processPluginDescriptor(DefaultPluginManager.java:137)
	at org.apache.maven.plugin.DefaultPluginManager.componentDiscovered(DefaultPluginManager.java:202)
	at org.codehaus.plexus.component.discovery.DefaultComponentDiscovererManager.fireComponentDiscoveryEvent(DefaultComponentDiscovererManager.java:47)
	at org.codehaus.plexus.component.discovery.AbstractComponentDiscoverer.findComponents(AbstractComponentDiscoverer.java:63)
	at org.codehaus.plexus.DefaultPlexusContainer.discoverComponents(DefaultPlexusContainer.java:493)
	at org.codehaus.plexus.DefaultPlexusContainer.addComponent(DefaultPlexusContainer.java:1058)
	at org.apache.maven.plugin.DefaultPluginManager.addPlugin(DefaultPluginManager.java:270)
	at org.apache.maven.plugin.DefaultPluginManager.verifyPluginForGoal(DefaultPluginManager.java:247)
	at org.apache.maven.lifecycle.phase.PluginDownloadPhase.execute(PluginDownloadPhase.java:54)
	at org.apache.maven.lifecycle.DefaultMavenLifecycleManager.execute(DefaultMavenLifecycleManager.java:48)
	at org.apache.maven.DefaultMaven.execute(DefaultMaven.java:121)
	at org.apache.maven.DefaultMaven.execute(DefaultMaven.java:82)
	at org.apache.maven.MavenCli.main(MavenCli.java:150)
	at sun.reflect.NativeMethodAccessorImpl.invoke0(Native Method)
	at sun.reflect.NativeMethodAccessorImpl.invoke(NativeMethodAccessorImpl.java:39)
	at sun.reflect.DelegatingMethodAccessorImpl.invoke(DelegatingMethodAccessorImpl.java:25)
	at java.lang.reflect.Method.invoke(Method.java:324)
	at org.codehaus.classworlds.Launcher.launchEnhanced(Launcher.java:350)
	at org.codehaus.classworlds.Launcher.launch(Launcher.java:290)
	at org.codehaus.classworlds.Launcher.main(Launcher.java:433)
Caused by: org.apache.maven.artifact.resolver.TransitiveArtifactResolutionException: Error retrieving metadata: 
	at org.apache.maven.artifact.resolver.DefaultArtifactResolver.collect(DefaultArtifactResolver.java:204)
	at org.apache.maven.artifact.resolver.DefaultArtifactResolver.resolveTransitively(DefaultArtifactResolver.java:118)
	... 33 more
Caused by: org.apache.maven.artifact.metadata.ArtifactMetadataRetrievalException: Cannot read artifact source: 
	at org.apache.maven.artifact.MavenMetadataSource.retrieve(MavenMetadataSource.java:82)
	at org.apache.maven.artifact.resolver.DefaultArtifactResolver.collect(DefaultArtifactResolver.java:200)
	... 34 more
Caused by: java.io.FileNotFoundException: /home/users/jvanzyl/maven-repo-local/plexus/poms/plexus-0.16.pom (No such file or directory)
	at java.io.FileInputStream.open(Native Method)
	at java.io.FileInputStream.<init>(FileInputStream.java:106)
	at java.io.FileReader.<init>(FileReader.java:55)
	at org.apache.maven.artifact.MavenMetadataSource.retrieve(MavenMetadataSource.java:76)
	... 35 more
org.apache.maven.artifact.resolver.ArtifactResolutionException: Error transitively resolving artifacts: 
	at org.apache.maven.artifact.resolver.DefaultArtifactResolver.resolveTransitively(DefaultArtifactResolver.java:125)
	at org.codehaus.plexus.DefaultPlexusContainer.addComponent(DefaultPlexusContainer.java:1092)
	at org.apache.maven.plugin.DefaultPluginManager.addPlugin(DefaultPluginManager.java:270)
	at org.apache.maven.plugin.DefaultPluginManager.verifyPluginForGoal(DefaultPluginManager.java:247)
	at org.apache.maven.plugin.DefaultPluginManager.processEdge(DefaultPluginManager.java:174)
	at org.apache.maven.plugin.DefaultPluginManager.processPluginDescriptor(DefaultPluginManager.java:137)
	at org.apache.maven.plugin.DefaultPluginManager.componentDiscovered(DefaultPluginManager.java:202)
	at org.codehaus.plexus.component.discovery.DefaultComponentDiscovererManager.fireComponentDiscoveryEvent(DefaultComponentDiscovererManager.java:47)
	at org.codehaus.plexus.component.discovery.AbstractComponentDiscoverer.findComponents(AbstractComponentDiscoverer.java:63)
	at org.codehaus.plexus.DefaultPlexusContainer.discoverComponents(DefaultPlexusContainer.java:493)
	at org.codehaus.plexus.DefaultPlexusContainer.addComponent(DefaultPlexusContainer.java:1058)
	at org.apache.maven.plugin.DefaultPluginManager.addPlugin(DefaultPluginManager.java:270)
	at org.apache.maven.plugin.DefaultPluginManager.verifyPluginForGoal(DefaultPluginManager.java:247)
	at org.apache.maven.lifecycle.phase.PluginDownloadPhase.execute(PluginDownloadPhase.java:54)
	at org.apache.maven.lifecycle.DefaultMavenLifecycleManager.execute(DefaultMavenLifecycleManager.java:48)
	at org.apache.maven.DefaultMaven.execute(DefaultMaven.java:121)
	at org.apache.maven.DefaultMaven.execute(DefaultMaven.java:82)
	at org.apache.maven.MavenCli.main(MavenCli.java:150)
	at sun.reflect.NativeMethodAccessorImpl.invoke0(Native Method)
	at sun.reflect.NativeMethodAccessorImpl.invoke(NativeMethodAccessorImpl.java:39)
	at sun.reflect.DelegatingMethodAccessorImpl.invoke(DelegatingMethodAccessorImpl.java:25)
	at java.lang.reflect.Method.invoke(Method.java:324)
	at org.codehaus.classworlds.Launcher.launchEnhanced(Launcher.java:350)
	at org.codehaus.classworlds.Launcher.launch(Launcher.java:290)
	at org.codehaus.classworlds.Launcher.main(Launcher.java:433)
Caused by: org.apache.maven.artifact.resolver.TransitiveArtifactResolutionException: Error retrieving metadata: 
	at org.apache.maven.artifact.resolver.DefaultArtifactResolver.collect(DefaultArtifactResolver.java:204)
	at org.apache.maven.artifact.resolver.DefaultArtifactResolver.resolveTransitively(DefaultArtifactResolver.java:118)
	... 24 more
Caused by: org.apache.maven.artifact.metadata.ArtifactMetadataRetrievalException: Cannot read artifact source: 
	at org.apache.maven.artifact.MavenMetadataSource.retrieve(MavenMetadataSource.java:82)
	at org.apache.maven.artifact.resolver.DefaultArtifactResolver.collect(DefaultArtifactResolver.java:200)
	... 25 more
Caused by: java.io.FileNotFoundException: /home/users/jvanzyl/maven-repo-local/surefire/poms/surefire-booter-1.1.pom (No such file or directory)
	at java.io.FileInputStream.open(Native Method)
	at java.io.FileInputStream.<init>(FileInputStream.java:106)
	at java.io.FileReader.<init>(FileReader.java:55)
	at org.apache.maven.artifact.MavenMetadataSource.retrieve(MavenMetadataSource.java:76)
	... 26 more
[INFO] ----------------------------------------------------------------------------
[ERROR] BUILD ERROR
[INFO] ----------------------------------------------------------------------------
[ERROR] Cause: 
org.apache.maven.artifact.resolver.ArtifactResolutionException: Error transitively resolving artifacts: 
	at org.apache.maven.artifact.resolver.DefaultArtifactResolver.resolveTransitively(DefaultArtifactResolver.java:125)
	at org.codehaus.plexus.DefaultPlexusContainer.addComponent(DefaultPlexusContainer.java:1092)
	at org.apache.maven.plugin.DefaultPluginManager.addPlugin(DefaultPluginManager.java:270)
	at org.apache.maven.plugin.DefaultPluginManager.verifyPluginForGoal(DefaultPluginManager.java:247)
	at org.apache.maven.lifecycle.phase.PluginDownloadPhase.execute(PluginDownloadPhase.java:54)
	at org.apache.maven.lifecycle.DefaultMavenLifecycleManager.execute(DefaultMavenLifecycleManager.java:48)
	at org.apache.maven.DefaultMaven.execute(DefaultMaven.java:121)
	at org.apache.maven.DefaultMaven.execute(DefaultMaven.java:82)
	at org.apache.maven.MavenCli.main(MavenCli.java:150)
	at sun.reflect.NativeMethodAccessorImpl.invoke0(Native Method)
	at sun.reflect.NativeMethodAccessorImpl.invoke(NativeMethodAccessorImpl.java:39)
	at sun.reflect.DelegatingMethodAccessorImpl.invoke(DelegatingMethodAccessorImpl.java:25)
	at java.lang.reflect.Method.invoke(Method.java:324)
	at org.codehaus.classworlds.Launcher.launchEnhanced(Launcher.java:350)
	at org.codehaus.classworlds.Launcher.launch(Launcher.java:290)
	at org.codehaus.classworlds.Launcher.main(Launcher.java:433)
Caused by: org.apache.maven.artifact.resolver.TransitiveArtifactResolutionException: Error retrieving metadata: 
	at org.apache.maven.artifact.resolver.DefaultArtifactResolver.collect(DefaultArtifactResolver.java:204)
	at org.apache.maven.artifact.resolver.DefaultArtifactResolver.resolveTransitively(DefaultArtifactResolver.java:118)
	... 15 more
Caused by: org.apache.maven.artifact.metadata.ArtifactMetadataRetrievalException: Cannot read artifact source: 
	at org.apache.maven.artifact.MavenMetadataSource.retrieve(MavenMetadataSource.java:82)
	at org.apache.maven.artifact.resolver.DefaultArtifactResolver.collect(DefaultArtifactResolver.java:200)
	... 16 more
Caused by: java.io.FileNotFoundException: /home/users/jvanzyl/maven-repo-local/maven/poms/wagon-api-1.0-alpha-1-SNAPSHOT.pom (No such file or directory)
	at java.io.FileInputStream.open(Native Method)
	at java.io.FileInputStream.<init>(FileInputStream.java:106)
	at java.io.FileReader.<init>(FileReader.java:55)
	at org.apache.maven.artifact.MavenMetadataSource.retrieve(MavenMetadataSource.java:76)
	... 17 more
[INFO] ----------------------------------------------------------------------------
[INFO] Total time: 1 seconds
[INFO] Finished at: Tue Aug 10 09:01:32 EDT 2004
[INFO] Final Memory: 0M/1M
[INFO] ----------------------------------------------------------------------------
[INFO] ----------------------------------------------------------------------------
[INFO] BUILD SUCCESSFUL
[INFO] ----------------------------------------------------------------------------
[INFO] Total time: 1 seconds
[INFO] Finished at: Tue Aug 10 09:01:32 EDT 2004
[INFO] Final Memory: 0M/1M
[INFO] ----------------------------------------------------------------------------
Exception in thread "main" org.apache.maven.it.VerificationException: org.apache.maven.it.VerificationException: Expected file was not found: ./target/classes/org/apache/maven/it0001/Person.class
	at org.apache.maven.it.Verifier.verify(Verifier.java:92)
	at org.apache.maven.it.Verifier.main(Verifier.java:197)
Caused by: org.apache.maven.it.VerificationException: Expected file was not found: ./target/classes/org/apache/maven/it0001/Person.class
	at org.apache.maven.it.Verifier.verifyExpectedResult(Verifier.java:145)
	at org.apache.maven.it.Verifier.verify(Verifier.java:87)
	... 1 more
----------------------------------------------------------
Running integration test it0002 ...
----------------------------------------------------------

Removing maven-it-support-1.0.jar from the local repository so we can verify its downloading ...

clean is not installed. Now installing into /home/users/jvanzyl/maven-repo-local ...
adding plugin maven:maven-clean-plugin:plugin:1.0-SNAPSHOT
[INFO] [clean:clean]
jar is not installed. Now installing into /home/users/jvanzyl/maven-repo-local ...
adding plugin maven:maven-jar-plugin:plugin:1.0-SNAPSHOT
surefire is not installed. Now installing into /home/users/jvanzyl/maven-repo-local ...
adding plugin maven:maven-surefire-plugin:plugin:1.0-SNAPSHOT
compiler is not installed. Now installing into /home/users/jvanzyl/maven-repo-local ...
adding plugin maven:maven-compiler-plugin:plugin:1.0-SNAPSHOT
org.apache.maven.artifact.resolver.ArtifactResolutionException: Error transitively resolving artifacts: 
	at org.apache.maven.artifact.resolver.DefaultArtifactResolver.resolveTransitively(DefaultArtifactResolver.java:125)
	at org.codehaus.plexus.DefaultPlexusContainer.addComponent(DefaultPlexusContainer.java:1092)
	at org.apache.maven.plugin.DefaultPluginManager.addPlugin(DefaultPluginManager.java:270)
	at org.apache.maven.plugin.DefaultPluginManager.verifyPluginForGoal(DefaultPluginManager.java:247)
	at org.apache.maven.plugin.DefaultPluginManager.processEdge(DefaultPluginManager.java:174)
	at org.apache.maven.plugin.DefaultPluginManager.processPluginDescriptor(DefaultPluginManager.java:137)
	at org.apache.maven.plugin.DefaultPluginManager.componentDiscovered(DefaultPluginManager.java:202)
	at org.codehaus.plexus.component.discovery.DefaultComponentDiscovererManager.fireComponentDiscoveryEvent(DefaultComponentDiscovererManager.java:47)
	at org.codehaus.plexus.component.discovery.AbstractComponentDiscoverer.findComponents(AbstractComponentDiscoverer.java:63)
	at org.codehaus.plexus.DefaultPlexusContainer.discoverComponents(DefaultPlexusContainer.java:493)
	at org.codehaus.plexus.DefaultPlexusContainer.addComponent(DefaultPlexusContainer.java:1058)
	at org.apache.maven.plugin.DefaultPluginManager.addPlugin(DefaultPluginManager.java:270)
	at org.apache.maven.plugin.DefaultPluginManager.verifyPluginForGoal(DefaultPluginManager.java:247)
	at org.apache.maven.plugin.DefaultPluginManager.processEdge(DefaultPluginManager.java:174)
	at org.apache.maven.plugin.DefaultPluginManager.processPluginDescriptor(DefaultPluginManager.java:137)
	at org.apache.maven.plugin.DefaultPluginManager.componentDiscovered(DefaultPluginManager.java:202)
	at org.codehaus.plexus.component.discovery.DefaultComponentDiscovererManager.fireComponentDiscoveryEvent(DefaultComponentDiscovererManager.java:47)
	at org.codehaus.plexus.component.discovery.AbstractComponentDiscoverer.findComponents(AbstractComponentDiscoverer.java:63)
	at org.codehaus.plexus.DefaultPlexusContainer.discoverComponents(DefaultPlexusContainer.java:493)
	at org.codehaus.plexus.DefaultPlexusContainer.addComponent(DefaultPlexusContainer.java:1058)
	at org.apache.maven.plugin.DefaultPluginManager.addPlugin(DefaultPluginManager.java:270)
	at org.apache.maven.plugin.DefaultPluginManager.verifyPluginForGoal(DefaultPluginManager.java:247)
	at org.apache.maven.lifecycle.phase.PluginDownloadPhase.execute(PluginDownloadPhase.java:54)
	at org.apache.maven.lifecycle.DefaultMavenLifecycleManager.execute(DefaultMavenLifecycleManager.java:48)
	at org.apache.maven.DefaultMaven.execute(DefaultMaven.java:121)
	at org.apache.maven.DefaultMaven.execute(DefaultMaven.java:82)
	at org.apache.maven.MavenCli.main(MavenCli.java:150)
	at sun.reflect.NativeMethodAccessorImpl.invoke0(Native Method)
	at sun.reflect.NativeMethodAccessorImpl.invoke(NativeMethodAccessorImpl.java:39)
	at sun.reflect.DelegatingMethodAccessorImpl.invoke(DelegatingMethodAccessorImpl.java:25)
	at java.lang.reflect.Method.invoke(Method.java:324)
	at org.codehaus.classworlds.Launcher.launchEnhanced(Launcher.java:350)
	at org.codehaus.classworlds.Launcher.launch(Launcher.java:290)
	at org.codehaus.classworlds.Launcher.main(Launcher.java:433)
Caused by: org.apache.maven.artifact.resolver.TransitiveArtifactResolutionException: Error retrieving metadata: 
	at org.apache.maven.artifact.resolver.DefaultArtifactResolver.collect(DefaultArtifactResolver.java:204)
	at org.apache.maven.artifact.resolver.DefaultArtifactResolver.resolveTransitively(DefaultArtifactResolver.java:118)
	... 33 more
Caused by: org.apache.maven.artifact.metadata.ArtifactMetadataRetrievalException: Cannot read artifact source: 
	at org.apache.maven.artifact.MavenMetadataSource.retrieve(MavenMetadataSource.java:82)
	at org.apache.maven.artifact.resolver.DefaultArtifactResolver.collect(DefaultArtifactResolver.java:200)
	... 34 more
Caused by: java.io.FileNotFoundException: /home/users/jvanzyl/maven-repo-local/plexus/poms/plexus-compiler-api-1.0.pom (No such file or directory)
	at java.io.FileInputStream.open(Native Method)
	at java.io.FileInputStream.<init>(FileInputStream.java:106)
	at java.io.FileReader.<init>(FileReader.java:55)
	at org.apache.maven.artifact.MavenMetadataSource.retrieve(MavenMetadataSource.java:76)
	... 35 more
resources is not installed. Now installing into /home/users/jvanzyl/maven-repo-local ...
adding plugin maven:maven-resources-plugin:plugin:1.0-SNAPSHOT
org.apache.maven.artifact.resolver.ArtifactResolutionException: Error transitively resolving artifacts: 
	at org.apache.maven.artifact.resolver.DefaultArtifactResolver.resolveTransitively(DefaultArtifactResolver.java:125)
	at org.codehaus.plexus.DefaultPlexusContainer.addComponent(DefaultPlexusContainer.java:1092)
	at org.apache.maven.plugin.DefaultPluginManager.addPlugin(DefaultPluginManager.java:270)
	at org.apache.maven.plugin.DefaultPluginManager.verifyPluginForGoal(DefaultPluginManager.java:247)
	at org.apache.maven.plugin.DefaultPluginManager.processEdge(DefaultPluginManager.java:174)
	at org.apache.maven.plugin.DefaultPluginManager.processPluginDescriptor(DefaultPluginManager.java:137)
	at org.apache.maven.plugin.DefaultPluginManager.componentDiscovered(DefaultPluginManager.java:202)
	at org.codehaus.plexus.component.discovery.DefaultComponentDiscovererManager.fireComponentDiscoveryEvent(DefaultComponentDiscovererManager.java:47)
	at org.codehaus.plexus.component.discovery.AbstractComponentDiscoverer.findComponents(AbstractComponentDiscoverer.java:63)
	at org.codehaus.plexus.DefaultPlexusContainer.discoverComponents(DefaultPlexusContainer.java:493)
	at org.codehaus.plexus.DefaultPlexusContainer.addComponent(DefaultPlexusContainer.java:1058)
	at org.apache.maven.plugin.DefaultPluginManager.addPlugin(DefaultPluginManager.java:270)
	at org.apache.maven.plugin.DefaultPluginManager.verifyPluginForGoal(DefaultPluginManager.java:247)
	at org.apache.maven.plugin.DefaultPluginManager.processEdge(DefaultPluginManager.java:174)
	at org.apache.maven.plugin.DefaultPluginManager.processPluginDescriptor(DefaultPluginManager.java:137)
	at org.apache.maven.plugin.DefaultPluginManager.componentDiscovered(DefaultPluginManager.java:202)
	at org.codehaus.plexus.component.discovery.DefaultComponentDiscovererManager.fireComponentDiscoveryEvent(DefaultComponentDiscovererManager.java:47)
	at org.codehaus.plexus.component.discovery.AbstractComponentDiscoverer.findComponents(AbstractComponentDiscoverer.java:63)
	at org.codehaus.plexus.DefaultPlexusContainer.discoverComponents(DefaultPlexusContainer.java:493)
	at org.codehaus.plexus.DefaultPlexusContainer.addComponent(DefaultPlexusContainer.java:1058)
	at org.apache.maven.plugin.DefaultPluginManager.addPlugin(DefaultPluginManager.java:270)
	at org.apache.maven.plugin.DefaultPluginManager.verifyPluginForGoal(DefaultPluginManager.java:247)
	at org.apache.maven.lifecycle.phase.PluginDownloadPhase.execute(PluginDownloadPhase.java:54)
	at org.apache.maven.lifecycle.DefaultMavenLifecycleManager.execute(DefaultMavenLifecycleManager.java:48)
	at org.apache.maven.DefaultMaven.execute(DefaultMaven.java:121)
	at org.apache.maven.DefaultMaven.execute(DefaultMaven.java:82)
	at org.apache.maven.MavenCli.main(MavenCli.java:150)
	at sun.reflect.NativeMethodAccessorImpl.invoke0(Native Method)
	at sun.reflect.NativeMethodAccessorImpl.invoke(NativeMethodAccessorImpl.java:39)
	at sun.reflect.DelegatingMethodAccessorImpl.invoke(DelegatingMethodAccessorImpl.java:25)
	at java.lang.reflect.Method.invoke(Method.java:324)
	at org.codehaus.classworlds.Launcher.launchEnhanced(Launcher.java:350)
	at org.codehaus.classworlds.Launcher.launch(Launcher.java:290)
	at org.codehaus.classworlds.Launcher.main(Launcher.java:433)
Caused by: org.apache.maven.artifact.resolver.TransitiveArtifactResolutionException: Error retrieving metadata: 
	at org.apache.maven.artifact.resolver.DefaultArtifactResolver.collect(DefaultArtifactResolver.java:204)
	at org.apache.maven.artifact.resolver.DefaultArtifactResolver.resolveTransitively(DefaultArtifactResolver.java:118)
	... 33 more
Caused by: org.apache.maven.artifact.metadata.ArtifactMetadataRetrievalException: Cannot read artifact source: 
	at org.apache.maven.artifact.MavenMetadataSource.retrieve(MavenMetadataSource.java:82)
	at org.apache.maven.artifact.resolver.DefaultArtifactResolver.collect(DefaultArtifactResolver.java:200)
	... 34 more
Caused by: java.io.FileNotFoundException: /home/users/jvanzyl/maven-repo-local/plexus/poms/plexus-0.16.pom (No such file or directory)
	at java.io.FileInputStream.open(Native Method)
	at java.io.FileInputStream.<init>(FileInputStream.java:106)
	at java.io.FileReader.<init>(FileReader.java:55)
	at org.apache.maven.artifact.MavenMetadataSource.retrieve(MavenMetadataSource.java:76)
	... 35 more
org.apache.maven.artifact.resolver.ArtifactResolutionException: Error transitively resolving artifacts: 
	at org.apache.maven.artifact.resolver.DefaultArtifactResolver.resolveTransitively(DefaultArtifactResolver.java:125)
	at org.codehaus.plexus.DefaultPlexusContainer.addComponent(DefaultPlexusContainer.java:1092)
	at org.apache.maven.plugin.DefaultPluginManager.addPlugin(DefaultPluginManager.java:270)
	at org.apache.maven.plugin.DefaultPluginManager.verifyPluginForGoal(DefaultPluginManager.java:247)
	at org.apache.maven.plugin.DefaultPluginManager.processEdge(DefaultPluginManager.java:174)
	at org.apache.maven.plugin.DefaultPluginManager.processPluginDescriptor(DefaultPluginManager.java:137)
	at org.apache.maven.plugin.DefaultPluginManager.componentDiscovered(DefaultPluginManager.java:202)
	at org.codehaus.plexus.component.discovery.DefaultComponentDiscovererManager.fireComponentDiscoveryEvent(DefaultComponentDiscovererManager.java:47)
	at org.codehaus.plexus.component.discovery.AbstractComponentDiscoverer.findComponents(AbstractComponentDiscoverer.java:63)
	at org.codehaus.plexus.DefaultPlexusContainer.discoverComponents(DefaultPlexusContainer.java:493)
	at org.codehaus.plexus.DefaultPlexusContainer.addComponent(DefaultPlexusContainer.java:1058)
	at org.apache.maven.plugin.DefaultPluginManager.addPlugin(DefaultPluginManager.java:270)
	at org.apache.maven.plugin.DefaultPluginManager.verifyPluginForGoal(DefaultPluginManager.java:247)
	at org.apache.maven.lifecycle.phase.PluginDownloadPhase.execute(PluginDownloadPhase.java:54)
	at org.apache.maven.lifecycle.DefaultMavenLifecycleManager.execute(DefaultMavenLifecycleManager.java:48)
	at org.apache.maven.DefaultMaven.execute(DefaultMaven.java:121)
	at org.apache.maven.DefaultMaven.execute(DefaultMaven.java:82)
	at org.apache.maven.MavenCli.main(MavenCli.java:150)
	at sun.reflect.NativeMethodAccessorImpl.invoke0(Native Method)
	at sun.reflect.NativeMethodAccessorImpl.invoke(NativeMethodAccessorImpl.java:39)
	at sun.reflect.DelegatingMethodAccessorImpl.invoke(DelegatingMethodAccessorImpl.java:25)
	at java.lang.reflect.Method.invoke(Method.java:324)
	at org.codehaus.classworlds.Launcher.launchEnhanced(Launcher.java:350)
	at org.codehaus.classworlds.Launcher.launch(Launcher.java:290)
	at org.codehaus.classworlds.Launcher.main(Launcher.java:433)
Caused by: org.apache.maven.artifact.resolver.TransitiveArtifactResolutionException: Error retrieving metadata: 
	at org.apache.maven.artifact.resolver.DefaultArtifactResolver.collect(DefaultArtifactResolver.java:204)
	at org.apache.maven.artifact.resolver.DefaultArtifactResolver.resolveTransitively(DefaultArtifactResolver.java:118)
	... 24 more
Caused by: org.apache.maven.artifact.metadata.ArtifactMetadataRetrievalException: Cannot read artifact source: 
	at org.apache.maven.artifact.MavenMetadataSource.retrieve(MavenMetadataSource.java:82)
	at org.apache.maven.artifact.resolver.DefaultArtifactResolver.collect(DefaultArtifactResolver.java:200)
	... 25 more
Caused by: java.io.FileNotFoundException: /home/users/jvanzyl/maven-repo-local/surefire/poms/surefire-booter-1.1.pom (No such file or directory)
	at java.io.FileInputStream.open(Native Method)
	at java.io.FileInputStream.<init>(FileInputStream.java:106)
	at java.io.FileReader.<init>(FileReader.java:55)
	at org.apache.maven.artifact.MavenMetadataSource.retrieve(MavenMetadataSource.java:76)
	... 26 more
[INFO] ----------------------------------------------------------------------------
[ERROR] BUILD ERROR
[INFO] ----------------------------------------------------------------------------
[ERROR] Cause: 
org.apache.maven.artifact.resolver.ArtifactResolutionException: Error transitively resolving artifacts: 
	at org.apache.maven.artifact.resolver.DefaultArtifactResolver.resolveTransitively(DefaultArtifactResolver.java:125)
	at org.codehaus.plexus.DefaultPlexusContainer.addComponent(DefaultPlexusContainer.java:1092)
	at org.apache.maven.plugin.DefaultPluginManager.addPlugin(DefaultPluginManager.java:270)
	at org.apache.maven.plugin.DefaultPluginManager.verifyPluginForGoal(DefaultPluginManager.java:247)
	at org.apache.maven.lifecycle.phase.PluginDownloadPhase.execute(PluginDownloadPhase.java:54)
	at org.apache.maven.lifecycle.DefaultMavenLifecycleManager.execute(DefaultMavenLifecycleManager.java:48)
	at org.apache.maven.DefaultMaven.execute(DefaultMaven.java:121)
	at org.apache.maven.DefaultMaven.execute(DefaultMaven.java:82)
	at org.apache.maven.MavenCli.main(MavenCli.java:150)
	at sun.reflect.NativeMethodAccessorImpl.invoke0(Native Method)
	at sun.reflect.NativeMethodAccessorImpl.invoke(NativeMethodAccessorImpl.java:39)
	at sun.reflect.DelegatingMethodAccessorImpl.invoke(DelegatingMethodAccessorImpl.java:25)
	at java.lang.reflect.Method.invoke(Method.java:324)
	at org.codehaus.classworlds.Launcher.launchEnhanced(Launcher.java:350)
	at org.codehaus.classworlds.Launcher.launch(Launcher.java:290)
	at org.codehaus.classworlds.Launcher.main(Launcher.java:433)
Caused by: org.apache.maven.artifact.resolver.TransitiveArtifactResolutionException: Error retrieving metadata: 
	at org.apache.maven.artifact.resolver.DefaultArtifactResolver.collect(DefaultArtifactResolver.java:204)
	at org.apache.maven.artifact.resolver.DefaultArtifactResolver.resolveTransitively(DefaultArtifactResolver.java:118)
	... 15 more
Caused by: org.apache.maven.artifact.metadata.ArtifactMetadataRetrievalException: Cannot read artifact source: 
	at org.apache.maven.artifact.MavenMetadataSource.retrieve(MavenMetadataSource.java:82)
	at org.apache.maven.artifact.resolver.DefaultArtifactResolver.collect(DefaultArtifactResolver.java:200)
	... 16 more
Caused by: java.io.FileNotFoundException: /home/users/jvanzyl/maven-repo-local/plexus/poms/plexus-0.16.pom (No such file or directory)
	at java.io.FileInputStream.open(Native Method)
	at java.io.FileInputStream.<init>(FileInputStream.java:106)
	at java.io.FileReader.<init>(FileReader.java:55)
	at org.apache.maven.artifact.MavenMetadataSource.retrieve(MavenMetadataSource.java:76)
	... 17 more
[INFO] ----------------------------------------------------------------------------
[INFO] Total time: 1 seconds
[INFO] Finished at: Tue Aug 10 09:01:34 EDT 2004
[INFO] Final Memory: 0M/1M
[INFO] ----------------------------------------------------------------------------
[INFO] ----------------------------------------------------------------------------
[INFO] BUILD SUCCESSFUL
[INFO] ----------------------------------------------------------------------------
[INFO] Total time: 1 seconds
[INFO] Finished at: Tue Aug 10 09:01:34 EDT 2004
[INFO] Final Memory: 0M/1M
[INFO] ----------------------------------------------------------------------------
Exception in thread "main" org.apache.maven.it.VerificationException: org.apache.maven.it.VerificationException: Expected file was not found: ./target/classes/org/apache/maven/it0002/Person.class
	at org.apache.maven.it.Verifier.verify(Verifier.java:92)
	at org.apache.maven.it.Verifier.main(Verifier.java:197)
Caused by: org.apache.maven.it.VerificationException: Expected file was not found: ./target/classes/org/apache/maven/it0002/Person.class
	at org.apache.maven.it.Verifier.verifyExpectedResult(Verifier.java:145)
	at org.apache.maven.it.Verifier.verify(Verifier.java:87)
	... 1 more
----------------------------------------------------------
Running integration test it0003 ...
----------------------------------------------------------

Removing maven-core-it0003-1.0.jar from the local repository so we can verify jar installation ...

clean is not installed. Now installing into /home/users/jvanzyl/maven-repo-local ...
adding plugin maven:maven-clean-plugin:plugin:1.0-SNAPSHOT
[INFO] [clean:clean]
jar is not installed. Now installing into /home/users/jvanzyl/maven-repo-local ...
adding plugin maven:maven-jar-plugin:plugin:1.0-SNAPSHOT
surefire is not installed. Now installing into /home/users/jvanzyl/maven-repo-local ...
adding plugin maven:maven-surefire-plugin:plugin:1.0-SNAPSHOT
compiler is not installed. Now installing into /home/users/jvanzyl/maven-repo-local ...
adding plugin maven:maven-compiler-plugin:plugin:1.0-SNAPSHOT
org.apache.maven.artifact.resolver.ArtifactResolutionException: Error transitively resolving artifacts: 
	at org.apache.maven.artifact.resolver.DefaultArtifactResolver.resolveTransitively(DefaultArtifactResolver.java:125)
	at org.codehaus.plexus.DefaultPlexusContainer.addComponent(DefaultPlexusContainer.java:1092)
	at org.apache.maven.plugin.DefaultPluginManager.addPlugin(DefaultPluginManager.java:270)
	at org.apache.maven.plugin.DefaultPluginManager.verifyPluginForGoal(DefaultPluginManager.java:247)
	at org.apache.maven.plugin.DefaultPluginManager.processEdge(DefaultPluginManager.java:174)
	at org.apache.maven.plugin.DefaultPluginManager.processPluginDescriptor(DefaultPluginManager.java:137)
	at org.apache.maven.plugin.DefaultPluginManager.componentDiscovered(DefaultPluginManager.java:202)
	at org.codehaus.plexus.component.discovery.DefaultComponentDiscovererManager.fireComponentDiscoveryEvent(DefaultComponentDiscovererManager.java:47)
	at org.codehaus.plexus.component.discovery.AbstractComponentDiscoverer.findComponents(AbstractComponentDiscoverer.java:63)
	at org.codehaus.plexus.DefaultPlexusContainer.discoverComponents(DefaultPlexusContainer.java:493)
	at org.codehaus.plexus.DefaultPlexusContainer.addComponent(DefaultPlexusContainer.java:1058)
	at org.apache.maven.plugin.DefaultPluginManager.addPlugin(DefaultPluginManager.java:270)
	at org.apache.maven.plugin.DefaultPluginManager.verifyPluginForGoal(DefaultPluginManager.java:247)
	at org.apache.maven.plugin.DefaultPluginManager.processEdge(DefaultPluginManager.java:174)
	at org.apache.maven.plugin.DefaultPluginManager.processPluginDescriptor(DefaultPluginManager.java:137)
	at org.apache.maven.plugin.DefaultPluginManager.componentDiscovered(DefaultPluginManager.java:202)
	at org.codehaus.plexus.component.discovery.DefaultComponentDiscovererManager.fireComponentDiscoveryEvent(DefaultComponentDiscovererManager.java:47)
	at org.codehaus.plexus.component.discovery.AbstractComponentDiscoverer.findComponents(AbstractComponentDiscoverer.java:63)
	at org.codehaus.plexus.DefaultPlexusContainer.discoverComponents(DefaultPlexusContainer.java:493)
	at org.codehaus.plexus.DefaultPlexusContainer.addComponent(DefaultPlexusContainer.java:1058)
	at org.apache.maven.plugin.DefaultPluginManager.addPlugin(DefaultPluginManager.java:270)
	at org.apache.maven.plugin.DefaultPluginManager.verifyPluginForGoal(DefaultPluginManager.java:247)
	at org.apache.maven.lifecycle.phase.PluginDownloadPhase.execute(PluginDownloadPhase.java:54)
	at org.apache.maven.lifecycle.DefaultMavenLifecycleManager.execute(DefaultMavenLifecycleManager.java:48)
	at org.apache.maven.DefaultMaven.execute(DefaultMaven.java:121)
	at org.apache.maven.DefaultMaven.execute(DefaultMaven.java:82)
	at org.apache.maven.MavenCli.main(MavenCli.java:150)
	at sun.reflect.NativeMethodAccessorImpl.invoke0(Native Method)
	at sun.reflect.NativeMethodAccessorImpl.invoke(NativeMethodAccessorImpl.java:39)
	at sun.reflect.DelegatingMethodAccessorImpl.invoke(DelegatingMethodAccessorImpl.java:25)
	at java.lang.reflect.Method.invoke(Method.java:324)
	at org.codehaus.classworlds.Launcher.launchEnhanced(Launcher.java:350)
	at org.codehaus.classworlds.Launcher.launch(Launcher.java:290)
	at org.codehaus.classworlds.Launcher.main(Launcher.java:433)
Caused by: org.apache.maven.artifact.resolver.TransitiveArtifactResolutionException: Error retrieving metadata: 
	at org.apache.maven.artifact.resolver.DefaultArtifactResolver.collect(DefaultArtifactResolver.java:204)
	at org.apache.maven.artifact.resolver.DefaultArtifactResolver.resolveTransitively(DefaultArtifactResolver.java:118)
	... 33 more
Caused by: org.apache.maven.artifact.metadata.ArtifactMetadataRetrievalException: Cannot read artifact source: 
	at org.apache.maven.artifact.MavenMetadataSource.retrieve(MavenMetadataSource.java:82)
	at org.apache.maven.artifact.resolver.DefaultArtifactResolver.collect(DefaultArtifactResolver.java:200)
	... 34 more
Caused by: java.io.FileNotFoundException: /home/users/jvanzyl/maven-repo-local/plexus/poms/plexus-0.16.pom (No such file or directory)
	at java.io.FileInputStream.open(Native Method)
	at java.io.FileInputStream.<init>(FileInputStream.java:106)
	at java.io.FileReader.<init>(FileReader.java:55)
	at org.apache.maven.artifact.MavenMetadataSource.retrieve(MavenMetadataSource.java:76)
	... 35 more
resources is not installed. Now installing into /home/users/jvanzyl/maven-repo-local ...
adding plugin maven:maven-resources-plugin:plugin:1.0-SNAPSHOT
org.apache.maven.artifact.resolver.ArtifactResolutionException: Error transitively resolving artifacts: 
	at org.apache.maven.artifact.resolver.DefaultArtifactResolver.resolveTransitively(DefaultArtifactResolver.java:125)
	at org.codehaus.plexus.DefaultPlexusContainer.addComponent(DefaultPlexusContainer.java:1092)
	at org.apache.maven.plugin.DefaultPluginManager.addPlugin(DefaultPluginManager.java:270)
	at org.apache.maven.plugin.DefaultPluginManager.verifyPluginForGoal(DefaultPluginManager.java:247)
	at org.apache.maven.plugin.DefaultPluginManager.processEdge(DefaultPluginManager.java:174)
	at org.apache.maven.plugin.DefaultPluginManager.processPluginDescriptor(DefaultPluginManager.java:137)
	at org.apache.maven.plugin.DefaultPluginManager.componentDiscovered(DefaultPluginManager.java:202)
	at org.codehaus.plexus.component.discovery.DefaultComponentDiscovererManager.fireComponentDiscoveryEvent(DefaultComponentDiscovererManager.java:47)
	at org.codehaus.plexus.component.discovery.AbstractComponentDiscoverer.findComponents(AbstractComponentDiscoverer.java:63)
	at org.codehaus.plexus.DefaultPlexusContainer.discoverComponents(DefaultPlexusContainer.java:493)
	at org.codehaus.plexus.DefaultPlexusContainer.addComponent(DefaultPlexusContainer.java:1058)
	at org.apache.maven.plugin.DefaultPluginManager.addPlugin(DefaultPluginManager.java:270)
	at org.apache.maven.plugin.DefaultPluginManager.verifyPluginForGoal(DefaultPluginManager.java:247)
	at org.apache.maven.plugin.DefaultPluginManager.processEdge(DefaultPluginManager.java:174)
	at org.apache.maven.plugin.DefaultPluginManager.processPluginDescriptor(DefaultPluginManager.java:137)
	at org.apache.maven.plugin.DefaultPluginManager.componentDiscovered(DefaultPluginManager.java:202)
	at org.codehaus.plexus.component.discovery.DefaultComponentDiscovererManager.fireComponentDiscoveryEvent(DefaultComponentDiscovererManager.java:47)
	at org.codehaus.plexus.component.discovery.AbstractComponentDiscoverer.findComponents(AbstractComponentDiscoverer.java:63)
	at org.codehaus.plexus.DefaultPlexusContainer.discoverComponents(DefaultPlexusContainer.java:493)
	at org.codehaus.plexus.DefaultPlexusContainer.addComponent(DefaultPlexusContainer.java:1058)
	at org.apache.maven.plugin.DefaultPluginManager.addPlugin(DefaultPluginManager.java:270)
	at org.apache.maven.plugin.DefaultPluginManager.verifyPluginForGoal(DefaultPluginManager.java:247)
	at org.apache.maven.lifecycle.phase.PluginDownloadPhase.execute(PluginDownloadPhase.java:54)
	at org.apache.maven.lifecycle.DefaultMavenLifecycleManager.execute(DefaultMavenLifecycleManager.java:48)
	at org.apache.maven.DefaultMaven.execute(DefaultMaven.java:121)
	at org.apache.maven.DefaultMaven.execute(DefaultMaven.java:82)
	at org.apache.maven.MavenCli.main(MavenCli.java:150)
	at sun.reflect.NativeMethodAccessorImpl.invoke0(Native Method)
	at sun.reflect.NativeMethodAccessorImpl.invoke(NativeMethodAccessorImpl.java:39)
	at sun.reflect.DelegatingMethodAccessorImpl.invoke(DelegatingMethodAccessorImpl.java:25)
	at java.lang.reflect.Method.invoke(Method.java:324)
	at org.codehaus.classworlds.Launcher.launchEnhanced(Launcher.java:350)
	at org.codehaus.classworlds.Launcher.launch(Launcher.java:290)
	at org.codehaus.classworlds.Launcher.main(Launcher.java:433)
Caused by: org.apache.maven.artifact.resolver.TransitiveArtifactResolutionException: Error retrieving metadata: 
	at org.apache.maven.artifact.resolver.DefaultArtifactResolver.collect(DefaultArtifactResolver.java:204)
	at org.apache.maven.artifact.resolver.DefaultArtifactResolver.resolveTransitively(DefaultArtifactResolver.java:118)
	... 33 more
Caused by: org.apache.maven.artifact.metadata.ArtifactMetadataRetrievalException: Cannot read artifact source: 
	at org.apache.maven.artifact.MavenMetadataSource.retrieve(MavenMetadataSource.java:82)
	at org.apache.maven.artifact.resolver.DefaultArtifactResolver.collect(DefaultArtifactResolver.java:200)
	... 34 more
Caused by: java.io.FileNotFoundException: /home/users/jvanzyl/maven-repo-local/plexus/poms/plexus-0.16.pom (No such file or directory)
	at java.io.FileInputStream.open(Native Method)
	at java.io.FileInputStream.<init>(FileInputStream.java:106)
	at java.io.FileReader.<init>(FileReader.java:55)
	at org.apache.maven.artifact.MavenMetadataSource.retrieve(MavenMetadataSource.java:76)
	... 35 more
org.apache.maven.artifact.resolver.ArtifactResolutionException: Error transitively resolving artifacts: 
	at org.apache.maven.artifact.resolver.DefaultArtifactResolver.resolveTransitively(DefaultArtifactResolver.java:125)
	at org.codehaus.plexus.DefaultPlexusContainer.addComponent(DefaultPlexusContainer.java:1092)
	at org.apache.maven.plugin.DefaultPluginManager.addPlugin(DefaultPluginManager.java:270)
	at org.apache.maven.plugin.DefaultPluginManager.verifyPluginForGoal(DefaultPluginManager.java:247)
	at org.apache.maven.plugin.DefaultPluginManager.processEdge(DefaultPluginManager.java:174)
	at org.apache.maven.plugin.DefaultPluginManager.processPluginDescriptor(DefaultPluginManager.java:137)
	at org.apache.maven.plugin.DefaultPluginManager.componentDiscovered(DefaultPluginManager.java:202)
	at org.codehaus.plexus.component.discovery.DefaultComponentDiscovererManager.fireComponentDiscoveryEvent(DefaultComponentDiscovererManager.java:47)
	at org.codehaus.plexus.component.discovery.AbstractComponentDiscoverer.findComponents(AbstractComponentDiscoverer.java:63)
	at org.codehaus.plexus.DefaultPlexusContainer.discoverComponents(DefaultPlexusContainer.java:493)
	at org.codehaus.plexus.DefaultPlexusContainer.addComponent(DefaultPlexusContainer.java:1058)
	at org.apache.maven.plugin.DefaultPluginManager.addPlugin(DefaultPluginManager.java:270)
	at org.apache.maven.plugin.DefaultPluginManager.verifyPluginForGoal(DefaultPluginManager.java:247)
	at org.apache.maven.lifecycle.phase.PluginDownloadPhase.execute(PluginDownloadPhase.java:54)
	at org.apache.maven.lifecycle.DefaultMavenLifecycleManager.execute(DefaultMavenLifecycleManager.java:48)
	at org.apache.maven.DefaultMaven.execute(DefaultMaven.java:121)
	at org.apache.maven.DefaultMaven.execute(DefaultMaven.java:82)
	at org.apache.maven.MavenCli.main(MavenCli.java:150)
	at sun.reflect.NativeMethodAccessorImpl.invoke0(Native Method)
	at sun.reflect.NativeMethodAccessorImpl.invoke(NativeMethodAccessorImpl.java:39)
	at sun.reflect.DelegatingMethodAccessorImpl.invoke(DelegatingMethodAccessorImpl.java:25)
	at java.lang.reflect.Method.invoke(Method.java:324)
	at org.codehaus.classworlds.Launcher.launchEnhanced(Launcher.java:350)
	at org.codehaus.classworlds.Launcher.launch(Launcher.java:290)
	at org.codehaus.classworlds.Launcher.main(Launcher.java:433)
Caused by: org.apache.maven.artifact.resolver.TransitiveArtifactResolutionException: Error retrieving metadata: 
	at org.apache.maven.artifact.resolver.DefaultArtifactResolver.collect(DefaultArtifactResolver.java:204)
	at org.apache.maven.artifact.resolver.DefaultArtifactResolver.resolveTransitively(DefaultArtifactResolver.java:118)
	... 24 more
Caused by: org.apache.maven.artifact.metadata.ArtifactMetadataRetrievalException: Cannot read artifact source: 
	at org.apache.maven.artifact.MavenMetadataSource.retrieve(MavenMetadataSource.java:82)
	at org.apache.maven.artifact.resolver.DefaultArtifactResolver.collect(DefaultArtifactResolver.java:200)
	... 25 more
Caused by: java.io.FileNotFoundException: /home/users/jvanzyl/maven-repo-local/surefire/poms/surefire-booter-1.1.pom (No such file or directory)
	at java.io.FileInputStream.open(Native Method)
	at java.io.FileInputStream.<init>(FileInputStream.java:106)
	at java.io.FileReader.<init>(FileReader.java:55)
	at org.apache.maven.artifact.MavenMetadataSource.retrieve(MavenMetadataSource.java:76)
	... 26 more
[INFO] ----------------------------------------------------------------------------
[ERROR] BUILD ERROR
[INFO] ----------------------------------------------------------------------------
[ERROR] Cause: 
org.apache.maven.artifact.resolver.ArtifactResolutionException: Error transitively resolving artifacts: 
	at org.apache.maven.artifact.resolver.DefaultArtifactResolver.resolveTransitively(DefaultArtifactResolver.java:125)
	at org.codehaus.plexus.DefaultPlexusContainer.addComponent(DefaultPlexusContainer.java:1092)
	at org.apache.maven.plugin.DefaultPluginManager.addPlugin(DefaultPluginManager.java:270)
	at org.apache.maven.plugin.DefaultPluginManager.verifyPluginForGoal(DefaultPluginManager.java:247)
	at org.apache.maven.lifecycle.phase.PluginDownloadPhase.execute(PluginDownloadPhase.java:54)
	at org.apache.maven.lifecycle.DefaultMavenLifecycleManager.execute(DefaultMavenLifecycleManager.java:48)
	at org.apache.maven.DefaultMaven.execute(DefaultMaven.java:121)
	at org.apache.maven.DefaultMaven.execute(DefaultMaven.java:82)
	at org.apache.maven.MavenCli.main(MavenCli.java:150)
	at sun.reflect.NativeMethodAccessorImpl.invoke0(Native Method)
	at sun.reflect.NativeMethodAccessorImpl.invoke(NativeMethodAccessorImpl.java:39)
	at sun.reflect.DelegatingMethodAccessorImpl.invoke(DelegatingMethodAccessorImpl.java:25)
	at java.lang.reflect.Method.invoke(Method.java:324)
	at org.codehaus.classworlds.Launcher.launchEnhanced(Launcher.java:350)
	at org.codehaus.classworlds.Launcher.launch(Launcher.java:290)
	at org.codehaus.classworlds.Launcher.main(Launcher.java:433)
Caused by: org.apache.maven.artifact.resolver.TransitiveArtifactResolutionException: Error retrieving metadata: 
	at org.apache.maven.artifact.resolver.DefaultArtifactResolver.collect(DefaultArtifactResolver.java:204)
	at org.apache.maven.artifact.resolver.DefaultArtifactResolver.resolveTransitively(DefaultArtifactResolver.java:118)
	... 15 more
Caused by: org.apache.maven.artifact.metadata.ArtifactMetadataRetrievalException: Cannot read artifact source: 
	at org.apache.maven.artifact.MavenMetadataSource.retrieve(MavenMetadataSource.java:82)
	at org.apache.maven.artifact.resolver.DefaultArtifactResolver.collect(DefaultArtifactResolver.java:200)
	... 16 more
Caused by: java.io.FileNotFoundException: /home/users/jvanzyl/maven-repo-local/maven/poms/wagon-api-1.0-alpha-1-SNAPSHOT.pom (No such file or directory)
	at java.io.FileInputStream.open(Native Method)
	at java.io.FileInputStream.<init>(FileInputStream.java:106)
	at java.io.FileReader.<init>(FileReader.java:55)
	at org.apache.maven.artifact.MavenMetadataSource.retrieve(MavenMetadataSource.java:76)
	... 17 more
[INFO] ----------------------------------------------------------------------------
[INFO] Total time: 0 seconds
[INFO] Finished at: Tue Aug 10 09:01:36 EDT 2004
[INFO] Final Memory: 0M/1M
[INFO] ----------------------------------------------------------------------------
[INFO] ----------------------------------------------------------------------------
[INFO] BUILD SUCCESSFUL
[INFO] ----------------------------------------------------------------------------
[INFO] Total time: 0 seconds
[INFO] Finished at: Tue Aug 10 09:01:36 EDT 2004
[INFO] Final Memory: 0M/1M
[INFO] ----------------------------------------------------------------------------
Exception in thread "main" org.apache.maven.it.VerificationException: org.apache.maven.it.VerificationException: Expected file was not found: ./target/classes/org/apache/maven/it0003/Person.class
	at org.apache.maven.it.Verifier.verify(Verifier.java:92)
	at org.apache.maven.it.Verifier.main(Verifier.java:197)
Caused by: org.apache.maven.it.VerificationException: Expected file was not found: ./target/classes/org/apache/maven/it0003/Person.class
	at org.apache.maven.it.Verifier.verifyExpectedResult(Verifier.java:145)
	at org.apache.maven.it.Verifier.verify(Verifier.java:87)
	... 1 more
----------------------------------------------------------
Running integration test it0004 ...
----------------------------------------------------------

Removing maven-core-it0004-1.0.pom from the local repository so we can verify pom installation ...

clean is not installed. Now installing into /home/users/jvanzyl/maven-repo-local ...
adding plugin maven:maven-clean-plugin:plugin:1.0-SNAPSHOT
[INFO] [clean:clean]
pom is not installed. Now installing into /home/users/jvanzyl/maven-repo-local ...
adding plugin maven:maven-pom-plugin:plugin:1.0-SNAPSHOT
[INFO] ----------------------------------------------------------------------------
[ERROR] BUILD ERROR
[INFO] ----------------------------------------------------------------------------
[ERROR] Cause: 
org.apache.maven.artifact.resolver.ArtifactResolutionException: Error transitively resolving artifacts: 
	at org.apache.maven.artifact.resolver.DefaultArtifactResolver.resolveTransitively(DefaultArtifactResolver.java:125)
	at org.codehaus.plexus.DefaultPlexusContainer.addComponent(DefaultPlexusContainer.java:1092)
	at org.apache.maven.plugin.DefaultPluginManager.addPlugin(DefaultPluginManager.java:270)
	at org.apache.maven.plugin.DefaultPluginManager.verifyPluginForGoal(DefaultPluginManager.java:247)
	at org.apache.maven.lifecycle.phase.PluginDownloadPhase.execute(PluginDownloadPhase.java:54)
	at org.apache.maven.lifecycle.DefaultMavenLifecycleManager.execute(DefaultMavenLifecycleManager.java:48)
	at org.apache.maven.DefaultMaven.execute(DefaultMaven.java:121)
	at org.apache.maven.DefaultMaven.execute(DefaultMaven.java:82)
	at org.apache.maven.MavenCli.main(MavenCli.java:150)
	at sun.reflect.NativeMethodAccessorImpl.invoke0(Native Method)
	at sun.reflect.NativeMethodAccessorImpl.invoke(NativeMethodAccessorImpl.java:39)
	at sun.reflect.DelegatingMethodAccessorImpl.invoke(DelegatingMethodAccessorImpl.java:25)
	at java.lang.reflect.Method.invoke(Method.java:324)
	at org.codehaus.classworlds.Launcher.launchEnhanced(Launcher.java:350)
	at org.codehaus.classworlds.Launcher.launch(Launcher.java:290)
	at org.codehaus.classworlds.Launcher.main(Launcher.java:433)
Caused by: org.apache.maven.artifact.resolver.TransitiveArtifactResolutionException: Error retrieving metadata: 
	at org.apache.maven.artifact.resolver.DefaultArtifactResolver.collect(DefaultArtifactResolver.java:204)
	at org.apache.maven.artifact.resolver.DefaultArtifactResolver.resolveTransitively(DefaultArtifactResolver.java:118)
	... 15 more
Caused by: org.apache.maven.artifact.metadata.ArtifactMetadataRetrievalException: Cannot read artifact source: 
	at org.apache.maven.artifact.MavenMetadataSource.retrieve(MavenMetadataSource.java:82)
	at org.apache.maven.artifact.resolver.DefaultArtifactResolver.collect(DefaultArtifactResolver.java:200)
	... 16 more
Caused by: java.io.FileNotFoundException: /home/users/jvanzyl/maven-repo-local/maven/poms/wagon-api-1.0-alpha-1-SNAPSHOT.pom (No such file or directory)
	at java.io.FileInputStream.open(Native Method)
	at java.io.FileInputStream.<init>(FileInputStream.java:106)
	at java.io.FileReader.<init>(FileReader.java:55)
	at org.apache.maven.artifact.MavenMetadataSource.retrieve(MavenMetadataSource.java:76)
	... 17 more
[INFO] ----------------------------------------------------------------------------
[INFO] Total time: 0 seconds
[INFO] Finished at: Tue Aug 10 09:01:37 EDT 2004
[INFO] Final Memory: 0M/1M
[INFO] ----------------------------------------------------------------------------
[INFO] ----------------------------------------------------------------------------
[INFO] BUILD SUCCESSFUL
[INFO] ----------------------------------------------------------------------------
[INFO] Total time: 0 seconds
[INFO] Finished at: Tue Aug 10 09:01:37 EDT 2004
[INFO] Final Memory: 0M/1M
[INFO] ----------------------------------------------------------------------------
Exception in thread "main" org.apache.maven.it.VerificationException: org.apache.maven.it.VerificationException: Expected file was not found: /home/users/jvanzyl/maven-repo-local/maven/poms/maven-core-it0004-1.0.pom
	at org.apache.maven.it.Verifier.verify(Verifier.java:92)
	at org.apache.maven.it.Verifier.main(Verifier.java:197)
Caused by: org.apache.maven.it.VerificationException: Expected file was not found: /home/users/jvanzyl/maven-repo-local/maven/poms/maven-core-it0004-1.0.pom
	at org.apache.maven.it.Verifier.verifyExpectedResult(Verifier.java:145)
	at org.apache.maven.it.Verifier.verify(Verifier.java:87)
	... 1 more
----------------------------------------------------------
Running integration test it0005 ...
----------------------------------------------------------

Removing maven-core-it0005-1.0.pom from the local repository so we can verify pom installation ...

clean is not installed. Now installing into /home/users/jvanzyl/maven-repo-local ...
adding plugin maven:maven-clean-plugin:plugin:1.0-SNAPSHOT
[INFO] [clean:clean]
pom is not installed. Now installing into /home/users/jvanzyl/maven-repo-local ...
adding plugin maven:maven-pom-plugin:plugin:1.0-SNAPSHOT
[INFO] ----------------------------------------------------------------------------
[ERROR] BUILD ERROR
[INFO] ----------------------------------------------------------------------------
[ERROR] Cause: 
org.apache.maven.artifact.resolver.ArtifactResolutionException: Error transitively resolving artifacts: 
	at org.apache.maven.artifact.resolver.DefaultArtifactResolver.resolveTransitively(DefaultArtifactResolver.java:125)
	at org.codehaus.plexus.DefaultPlexusContainer.addComponent(DefaultPlexusContainer.java:1092)
	at org.apache.maven.plugin.DefaultPluginManager.addPlugin(DefaultPluginManager.java:270)
	at org.apache.maven.plugin.DefaultPluginManager.verifyPluginForGoal(DefaultPluginManager.java:247)
	at org.apache.maven.lifecycle.phase.PluginDownloadPhase.execute(PluginDownloadPhase.java:54)
	at org.apache.maven.lifecycle.DefaultMavenLifecycleManager.execute(DefaultMavenLifecycleManager.java:48)
	at org.apache.maven.DefaultMaven.execute(DefaultMaven.java:121)
	at org.apache.maven.DefaultMaven.execute(DefaultMaven.java:82)
	at org.apache.maven.MavenCli.main(MavenCli.java:150)
	at sun.reflect.NativeMethodAccessorImpl.invoke0(Native Method)
	at sun.reflect.NativeMethodAccessorImpl.invoke(NativeMethodAccessorImpl.java:39)
	at sun.reflect.DelegatingMethodAccessorImpl.invoke(DelegatingMethodAccessorImpl.java:25)
	at java.lang.reflect.Method.invoke(Method.java:324)
	at org.codehaus.classworlds.Launcher.launchEnhanced(Launcher.java:350)
	at org.codehaus.classworlds.Launcher.launch(Launcher.java:290)
	at org.codehaus.classworlds.Launcher.main(Launcher.java:433)
Caused by: org.apache.maven.artifact.resolver.TransitiveArtifactResolutionException: Error retrieving metadata: 
	at org.apache.maven.artifact.resolver.DefaultArtifactResolver.collect(DefaultArtifactResolver.java:204)
	at org.apache.maven.artifact.resolver.DefaultArtifactResolver.resolveTransitively(DefaultArtifactResolver.java:118)
	... 15 more
Caused by: org.apache.maven.artifact.metadata.ArtifactMetadataRetrievalException: Cannot read artifact source: 
	at org.apache.maven.artifact.MavenMetadataSource.retrieve(MavenMetadataSource.java:82)
	at org.apache.maven.artifact.resolver.DefaultArtifactResolver.collect(DefaultArtifactResolver.java:200)
	... 16 more
Caused by: java.io.FileNotFoundException: /home/users/jvanzyl/maven-repo-local/maven/poms/wagon-api-1.0-alpha-1-SNAPSHOT.pom (No such file or directory)
	at java.io.FileInputStream.open(Native Method)
	at java.io.FileInputStream.<init>(FileInputStream.java:106)
	at java.io.FileReader.<init>(FileReader.java:55)
	at org.apache.maven.artifact.MavenMetadataSource.retrieve(MavenMetadataSource.java:76)
	... 17 more
[INFO] ----------------------------------------------------------------------------
[INFO] Total time: 0 seconds
[INFO] Finished at: Tue Aug 10 09:01:40 EDT 2004
[INFO] Final Memory: 0M/1M
[INFO] ----------------------------------------------------------------------------
[INFO] ----------------------------------------------------------------------------
[INFO] BUILD SUCCESSFUL
[INFO] ----------------------------------------------------------------------------
[INFO] Total time: 0 seconds
[INFO] Finished at: Tue Aug 10 09:01:40 EDT 2004
[INFO] Final Memory: 0M/1M
[INFO] ----------------------------------------------------------------------------
Exception in thread "main" org.apache.maven.it.VerificationException: org.apache.maven.it.VerificationException: Expected file was not found: /home/users/jvanzyl/maven-repo-local/maven/poms/maven-core-it0005-1.0-SNAPSHOT.pom
	at org.apache.maven.it.Verifier.verify(Verifier.java:92)
	at org.apache.maven.it.Verifier.main(Verifier.java:197)
Caused by: org.apache.maven.it.VerificationException: Expected file was not found: /home/users/jvanzyl/maven-repo-local/maven/poms/maven-core-it0005-1.0-SNAPSHOT.pom
	at org.apache.maven.it.Verifier.verifyExpectedResult(Verifier.java:145)
	at org.apache.maven.it.Verifier.verify(Verifier.java:87)
	... 1 more
----------------------------------------------------------
Running integration test it0006 ...
----------------------------------------------------------
clean is not installed. Now installing into /home/users/jvanzyl/maven-repo-local ...
adding plugin maven:maven-clean-plugin:plugin:1.0-SNAPSHOT
[INFO] [clean:clean]
jar is not installed. Now installing into /home/users/jvanzyl/maven-repo-local ...
adding plugin maven:maven-jar-plugin:plugin:1.0-SNAPSHOT
surefire is not installed. Now installing into /home/users/jvanzyl/maven-repo-local ...
adding plugin maven:maven-surefire-plugin:plugin:1.0-SNAPSHOT
compiler is not installed. Now installing into /home/users/jvanzyl/maven-repo-local ...
adding plugin maven:maven-compiler-plugin:plugin:1.0-SNAPSHOT
org.apache.maven.artifact.resolver.ArtifactResolutionException: Error transitively resolving artifacts: 
	at org.apache.maven.artifact.resolver.DefaultArtifactResolver.resolveTransitively(DefaultArtifactResolver.java:125)
	at org.codehaus.plexus.DefaultPlexusContainer.addComponent(DefaultPlexusContainer.java:1092)
	at org.apache.maven.plugin.DefaultPluginManager.addPlugin(DefaultPluginManager.java:270)
	at org.apache.maven.plugin.DefaultPluginManager.verifyPluginForGoal(DefaultPluginManager.java:247)
	at org.apache.maven.plugin.DefaultPluginManager.processEdge(DefaultPluginManager.java:174)
	at org.apache.maven.plugin.DefaultPluginManager.processPluginDescriptor(DefaultPluginManager.java:137)
	at org.apache.maven.plugin.DefaultPluginManager.componentDiscovered(DefaultPluginManager.java:202)
	at org.codehaus.plexus.component.discovery.DefaultComponentDiscovererManager.fireComponentDiscoveryEvent(DefaultComponentDiscovererManager.java:47)
	at org.codehaus.plexus.component.discovery.AbstractComponentDiscoverer.findComponents(AbstractComponentDiscoverer.java:63)
	at org.codehaus.plexus.DefaultPlexusContainer.discoverComponents(DefaultPlexusContainer.java:493)
	at org.codehaus.plexus.DefaultPlexusContainer.addComponent(DefaultPlexusContainer.java:1058)
	at org.apache.maven.plugin.DefaultPluginManager.addPlugin(DefaultPluginManager.java:270)
	at org.apache.maven.plugin.DefaultPluginManager.verifyPluginForGoal(DefaultPluginManager.java:247)
	at org.apache.maven.plugin.DefaultPluginManager.processEdge(DefaultPluginManager.java:174)
	at org.apache.maven.plugin.DefaultPluginManager.processPluginDescriptor(DefaultPluginManager.java:137)
	at org.apache.maven.plugin.DefaultPluginManager.componentDiscovered(DefaultPluginManager.java:202)
	at org.codehaus.plexus.component.discovery.DefaultComponentDiscovererManager.fireComponentDiscoveryEvent(DefaultComponentDiscovererManager.java:47)
	at org.codehaus.plexus.component.discovery.AbstractComponentDiscoverer.findComponents(AbstractComponentDiscoverer.java:63)
	at org.codehaus.plexus.DefaultPlexusContainer.discoverComponents(DefaultPlexusContainer.java:493)
	at org.codehaus.plexus.DefaultPlexusContainer.addComponent(DefaultPlexusContainer.java:1058)
	at org.apache.maven.plugin.DefaultPluginManager.addPlugin(DefaultPluginManager.java:270)
	at org.apache.maven.plugin.DefaultPluginManager.verifyPluginForGoal(DefaultPluginManager.java:247)
	at org.apache.maven.lifecycle.phase.PluginDownloadPhase.execute(PluginDownloadPhase.java:54)
	at org.apache.maven.lifecycle.DefaultMavenLifecycleManager.execute(DefaultMavenLifecycleManager.java:48)
	at org.apache.maven.DefaultMaven.execute(DefaultMaven.java:121)
	at org.apache.maven.DefaultMaven.execute(DefaultMaven.java:82)
	at org.apache.maven.MavenCli.main(MavenCli.java:150)
	at sun.reflect.NativeMethodAccessorImpl.invoke0(Native Method)
	at sun.reflect.NativeMethodAccessorImpl.invoke(NativeMethodAccessorImpl.java:39)
	at sun.reflect.DelegatingMethodAccessorImpl.invoke(DelegatingMethodAccessorImpl.java:25)
	at java.lang.reflect.Method.invoke(Method.java:324)
	at org.codehaus.classworlds.Launcher.launchEnhanced(Launcher.java:350)
	at org.codehaus.classworlds.Launcher.launch(Launcher.java:290)
	at org.codehaus.classworlds.Launcher.main(Launcher.java:433)
Caused by: org.apache.maven.artifact.resolver.TransitiveArtifactResolutionException: Error retrieving metadata: 
	at org.apache.maven.artifact.resolver.DefaultArtifactResolver.collect(DefaultArtifactResolver.java:204)
	at org.apache.maven.artifact.resolver.DefaultArtifactResolver.resolveTransitively(DefaultArtifactResolver.java:118)
	... 33 more
Caused by: org.apache.maven.artifact.metadata.ArtifactMetadataRetrievalException: Cannot read artifact source: 
	at org.apache.maven.artifact.MavenMetadataSource.retrieve(MavenMetadataSource.java:82)
	at org.apache.maven.artifact.resolver.DefaultArtifactResolver.collect(DefaultArtifactResolver.java:200)
	... 34 more
Caused by: java.io.FileNotFoundException: /home/users/jvanzyl/maven-repo-local/plexus/poms/plexus-compiler-javac-1.0.pom (No such file or directory)
	at java.io.FileInputStream.open(Native Method)
	at java.io.FileInputStream.<init>(FileInputStream.java:106)
	at java.io.FileReader.<init>(FileReader.java:55)
	at org.apache.maven.artifact.MavenMetadataSource.retrieve(MavenMetadataSource.java:76)
	... 35 more
resources is not installed. Now installing into /home/users/jvanzyl/maven-repo-local ...
adding plugin maven:maven-resources-plugin:plugin:1.0-SNAPSHOT
org.apache.maven.artifact.resolver.ArtifactResolutionException: Error transitively resolving artifacts: 
	at org.apache.maven.artifact.resolver.DefaultArtifactResolver.resolveTransitively(DefaultArtifactResolver.java:125)
	at org.codehaus.plexus.DefaultPlexusContainer.addComponent(DefaultPlexusContainer.java:1092)
	at org.apache.maven.plugin.DefaultPluginManager.addPlugin(DefaultPluginManager.java:270)
	at org.apache.maven.plugin.DefaultPluginManager.verifyPluginForGoal(DefaultPluginManager.java:247)
	at org.apache.maven.plugin.DefaultPluginManager.processEdge(DefaultPluginManager.java:174)
	at org.apache.maven.plugin.DefaultPluginManager.processPluginDescriptor(DefaultPluginManager.java:137)
	at org.apache.maven.plugin.DefaultPluginManager.componentDiscovered(DefaultPluginManager.java:202)
	at org.codehaus.plexus.component.discovery.DefaultComponentDiscovererManager.fireComponentDiscoveryEvent(DefaultComponentDiscovererManager.java:47)
	at org.codehaus.plexus.component.discovery.AbstractComponentDiscoverer.findComponents(AbstractComponentDiscoverer.java:63)
	at org.codehaus.plexus.DefaultPlexusContainer.discoverComponents(DefaultPlexusContainer.java:493)
	at org.codehaus.plexus.DefaultPlexusContainer.addComponent(DefaultPlexusContainer.java:1058)
	at org.apache.maven.plugin.DefaultPluginManager.addPlugin(DefaultPluginManager.java:270)
	at org.apache.maven.plugin.DefaultPluginManager.verifyPluginForGoal(DefaultPluginManager.java:247)
	at org.apache.maven.plugin.DefaultPluginManager.processEdge(DefaultPluginManager.java:174)
	at org.apache.maven.plugin.DefaultPluginManager.processPluginDescriptor(DefaultPluginManager.java:137)
	at org.apache.maven.plugin.DefaultPluginManager.componentDiscovered(DefaultPluginManager.java:202)
	at org.codehaus.plexus.component.discovery.DefaultComponentDiscovererManager.fireComponentDiscoveryEvent(DefaultComponentDiscovererManager.java:47)
	at org.codehaus.plexus.component.discovery.AbstractComponentDiscoverer.findComponents(AbstractComponentDiscoverer.java:63)
	at org.codehaus.plexus.DefaultPlexusContainer.discoverComponents(DefaultPlexusContainer.java:493)
	at org.codehaus.plexus.DefaultPlexusContainer.addComponent(DefaultPlexusContainer.java:1058)
	at org.apache.maven.plugin.DefaultPluginManager.addPlugin(DefaultPluginManager.java:270)
	at org.apache.maven.plugin.DefaultPluginManager.verifyPluginForGoal(DefaultPluginManager.java:247)
	at org.apache.maven.lifecycle.phase.PluginDownloadPhase.execute(PluginDownloadPhase.java:54)
	at org.apache.maven.lifecycle.DefaultMavenLifecycleManager.execute(DefaultMavenLifecycleManager.java:48)
	at org.apache.maven.DefaultMaven.execute(DefaultMaven.java:121)
	at org.apache.maven.DefaultMaven.execute(DefaultMaven.java:82)
	at org.apache.maven.MavenCli.main(MavenCli.java:150)
	at sun.reflect.NativeMethodAccessorImpl.invoke0(Native Method)
	at sun.reflect.NativeMethodAccessorImpl.invoke(NativeMethodAccessorImpl.java:39)
	at sun.reflect.DelegatingMethodAccessorImpl.invoke(DelegatingMethodAccessorImpl.java:25)
	at java.lang.reflect.Method.invoke(Method.java:324)
	at org.codehaus.classworlds.Launcher.launchEnhanced(Launcher.java:350)
	at org.codehaus.classworlds.Launcher.launch(Launcher.java:290)
	at org.codehaus.classworlds.Launcher.main(Launcher.java:433)
Caused by: org.apache.maven.artifact.resolver.TransitiveArtifactResolutionException: Error retrieving metadata: 
	at org.apache.maven.artifact.resolver.DefaultArtifactResolver.collect(DefaultArtifactResolver.java:204)
	at org.apache.maven.artifact.resolver.DefaultArtifactResolver.resolveTransitively(DefaultArtifactResolver.java:118)
	... 33 more
Caused by: org.apache.maven.artifact.metadata.ArtifactMetadataRetrievalException: Cannot read artifact source: 
	at org.apache.maven.artifact.MavenMetadataSource.retrieve(MavenMetadataSource.java:82)
	at org.apache.maven.artifact.resolver.DefaultArtifactResolver.collect(DefaultArtifactResolver.java:200)
	... 34 more
Caused by: java.io.FileNotFoundException: /home/users/jvanzyl/maven-repo-local/plexus/poms/plexus-0.16.pom (No such file or directory)
	at java.io.FileInputStream.open(Native Method)
	at java.io.FileInputStream.<init>(FileInputStream.java:106)
	at java.io.FileReader.<init>(FileReader.java:55)
	at org.apache.maven.artifact.MavenMetadataSource.retrieve(MavenMetadataSource.java:76)
	... 35 more
org.apache.maven.artifact.resolver.ArtifactResolutionException: Error transitively resolving artifacts: 
	at org.apache.maven.artifact.resolver.DefaultArtifactResolver.resolveTransitively(DefaultArtifactResolver.java:125)
	at org.codehaus.plexus.DefaultPlexusContainer.addComponent(DefaultPlexusContainer.java:1092)
	at org.apache.maven.plugin.DefaultPluginManager.addPlugin(DefaultPluginManager.java:270)
	at org.apache.maven.plugin.DefaultPluginManager.verifyPluginForGoal(DefaultPluginManager.java:247)
	at org.apache.maven.plugin.DefaultPluginManager.processEdge(DefaultPluginManager.java:174)
	at org.apache.maven.plugin.DefaultPluginManager.processPluginDescriptor(DefaultPluginManager.java:137)
	at org.apache.maven.plugin.DefaultPluginManager.componentDiscovered(DefaultPluginManager.java:202)
	at org.codehaus.plexus.component.discovery.DefaultComponentDiscovererManager.fireComponentDiscoveryEvent(DefaultComponentDiscovererManager.java:47)
	at org.codehaus.plexus.component.discovery.AbstractComponentDiscoverer.findComponents(AbstractComponentDiscoverer.java:63)
	at org.codehaus.plexus.DefaultPlexusContainer.discoverComponents(DefaultPlexusContainer.java:493)
	at org.codehaus.plexus.DefaultPlexusContainer.addComponent(DefaultPlexusContainer.java:1058)
	at org.apache.maven.plugin.DefaultPluginManager.addPlugin(DefaultPluginManager.java:270)
	at org.apache.maven.plugin.DefaultPluginManager.verifyPluginForGoal(DefaultPluginManager.java:247)
	at org.apache.maven.lifecycle.phase.PluginDownloadPhase.execute(PluginDownloadPhase.java:54)
	at org.apache.maven.lifecycle.DefaultMavenLifecycleManager.execute(DefaultMavenLifecycleManager.java:48)
	at org.apache.maven.DefaultMaven.execute(DefaultMaven.java:121)
	at org.apache.maven.DefaultMaven.execute(DefaultMaven.java:82)
	at org.apache.maven.MavenCli.main(MavenCli.java:150)
	at sun.reflect.NativeMethodAccessorImpl.invoke0(Native Method)
	at sun.reflect.NativeMethodAccessorImpl.invoke(NativeMethodAccessorImpl.java:39)
	at sun.reflect.DelegatingMethodAccessorImpl.invoke(DelegatingMethodAccessorImpl.java:25)
	at java.lang.reflect.Method.invoke(Method.java:324)
	at org.codehaus.classworlds.Launcher.launchEnhanced(Launcher.java:350)
	at org.codehaus.classworlds.Launcher.launch(Launcher.java:290)
	at org.codehaus.classworlds.Launcher.main(Launcher.java:433)
Caused by: org.apache.maven.artifact.resolver.TransitiveArtifactResolutionException: Error retrieving metadata: 
	at org.apache.maven.artifact.resolver.DefaultArtifactResolver.collect(DefaultArtifactResolver.java:204)
	at org.apache.maven.artifact.resolver.DefaultArtifactResolver.resolveTransitively(DefaultArtifactResolver.java:118)
	... 24 more
Caused by: org.apache.maven.artifact.metadata.ArtifactMetadataRetrievalException: Cannot read artifact source: 
	at org.apache.maven.artifact.MavenMetadataSource.retrieve(MavenMetadataSource.java:82)
	at org.apache.maven.artifact.resolver.DefaultArtifactResolver.collect(DefaultArtifactResolver.java:200)
	... 25 more
Caused by: java.io.FileNotFoundException: /home/users/jvanzyl/maven-repo-local/surefire/poms/surefire-booter-1.1.pom (No such file or directory)
	at java.io.FileInputStream.open(Native Method)
	at java.io.FileInputStream.<init>(FileInputStream.java:106)
	at java.io.FileReader.<init>(FileReader.java:55)
	at org.apache.maven.artifact.MavenMetadataSource.retrieve(MavenMetadataSource.java:76)
	... 26 more
[INFO] ----------------------------------------------------------------------------
[ERROR] BUILD ERROR
[INFO] ----------------------------------------------------------------------------
[ERROR] Cause: 
org.apache.maven.artifact.resolver.ArtifactResolutionException: Error transitively resolving artifacts: 
	at org.apache.maven.artifact.resolver.DefaultArtifactResolver.resolveTransitively(DefaultArtifactResolver.java:125)
	at org.codehaus.plexus.DefaultPlexusContainer.addComponent(DefaultPlexusContainer.java:1092)
	at org.apache.maven.plugin.DefaultPluginManager.addPlugin(DefaultPluginManager.java:270)
	at org.apache.maven.plugin.DefaultPluginManager.verifyPluginForGoal(DefaultPluginManager.java:247)
	at org.apache.maven.lifecycle.phase.PluginDownloadPhase.execute(PluginDownloadPhase.java:54)
	at org.apache.maven.lifecycle.DefaultMavenLifecycleManager.execute(DefaultMavenLifecycleManager.java:48)
	at org.apache.maven.DefaultMaven.execute(DefaultMaven.java:121)
	at org.apache.maven.DefaultMaven.execute(DefaultMaven.java:82)
	at org.apache.maven.MavenCli.main(MavenCli.java:150)
	at sun.reflect.NativeMethodAccessorImpl.invoke0(Native Method)
	at sun.reflect.NativeMethodAccessorImpl.invoke(NativeMethodAccessorImpl.java:39)
	at sun.reflect.DelegatingMethodAccessorImpl.invoke(DelegatingMethodAccessorImpl.java:25)
	at java.lang.reflect.Method.invoke(Method.java:324)
	at org.codehaus.classworlds.Launcher.launchEnhanced(Launcher.java:350)
	at org.codehaus.classworlds.Launcher.launch(Launcher.java:290)
	at org.codehaus.classworlds.Launcher.main(Launcher.java:433)
Caused by: org.apache.maven.artifact.resolver.TransitiveArtifactResolutionException: Error retrieving metadata: 
	at org.apache.maven.artifact.resolver.DefaultArtifactResolver.collect(DefaultArtifactResolver.java:204)
	at org.apache.maven.artifact.resolver.DefaultArtifactResolver.resolveTransitively(DefaultArtifactResolver.java:118)
	... 15 more
Caused by: org.apache.maven.artifact.metadata.ArtifactMetadataRetrievalException: Cannot read artifact source: 
	at org.apache.maven.artifact.MavenMetadataSource.retrieve(MavenMetadataSource.java:82)
	at org.apache.maven.artifact.resolver.DefaultArtifactResolver.collect(DefaultArtifactResolver.java:200)
	... 16 more
Caused by: java.io.FileNotFoundException: /home/users/jvanzyl/maven-repo-local/plexus/poms/plexus-0.16.pom (No such file or directory)
	at java.io.FileInputStream.open(Native Method)
	at java.io.FileInputStream.<init>(FileInputStream.java:106)
	at java.io.FileReader.<init>(FileReader.java:55)
	at org.apache.maven.artifact.MavenMetadataSource.retrieve(MavenMetadataSource.java:76)
	... 17 more
[INFO] ----------------------------------------------------------------------------
[INFO] Total time: 0 seconds
[INFO] Finished at: Tue Aug 10 09:01:42 EDT 2004
[INFO] Final Memory: 0M/1M
[INFO] ----------------------------------------------------------------------------
[INFO] ----------------------------------------------------------------------------
[INFO] BUILD SUCCESSFUL
[INFO] ----------------------------------------------------------------------------
[INFO] Total time: 0 seconds
[INFO] Finished at: Tue Aug 10 09:01:42 EDT 2004
[INFO] Final Memory: 0M/1M
[INFO] ----------------------------------------------------------------------------
-----------------------------------------------------------------------------------> OK

Creating m2 distribution for public consumption: http://www.codehaus.org/~jvanzyl/m2/m2-20045910.085951.tar.gz

./ci.sh: line 142: cd: m2-build/maven-components/maven-core/dist: No such file or directory

Mime
View raw message