maven-m2-dev mailing list archives

Site index · List index
Message view « Date » · « Thread »
Top « Date » · « Thread »
From Jason van Zyl <jvan...@maven.org>
Subject Re: [maven2 build] Tue Aug 17 17:07:00 EDT 2004
Date Wed, 18 Aug 2004 02:23:53 GMT
On Tue, 2004-08-17 at 20:31, Brett Porter wrote:
> On that note, any chance we can setup a maven user and grant all our private
> keys access so we can modify the CI process ourselves?

No problem, I've actually started a setup of three boxes that we will
all have access to for testing the bootstrap and integration tests.

maven-{osx,windows,linux}.codehaus.org 

will soon resolve and they will be the boxes that the CI stuff runs on.
I'm just taking a little breather this week on maven proper and working
on some doco tools. But if you want to do some work on the CI machines
we can sync up in IRC and you can go to down. I could definitely use
help with the windows machines.

> - Brett
> 
> Quoting Brett Porter <brett@apache.org>:
> 
> > I've built clean successfully - Jason can you try a clean build and see how
> > it goes?
> > 
> > Incidentally, I have added a clean step to buildProject in MBoot, which I
> > will
> > commit tonight.
> > 
> > Thanks,
> > Brett
> > 
> > Quoting jvanzyl@maven.org:
> > 
> > > 
> > > Performing an update of maven-components ...
> > > 
> > > Updates occured, build required ...
> > > 
> > > P
> > >
> >
> maven-artifact/src/main/java/org/apache/maven/artifact/manager/DefaultWagonManager.java
> > > P
> > >
> >
> maven-artifact/src/test/java/org/apache/maven/artifact/ArtifactComponentTestCase.java
> > > P maven-core/src/main/java/org/apache/maven/DefaultMaven.java
> > > P
> > >
> > maven-core/src/main/java/org/apache/maven/project/DefaultMavenProjectBuilder.java
> > > 
> > > -----------------------------------------------------------------------
> > >  Building mboot ... 
> > > -----------------------------------------------------------------------
> > > -----------------------------------------------------------------------
> > >  Building maven2 components ... 
> > > -----------------------------------------------------------------------
> > > Using the following for your maven.repo.local:
> > > /home/users/jvanzyl/maven-repo-local
> > > Checking for MBoot's dependencies ...
> > > Installing POM:
> > >
> > /home/users/jvanzyl/maven-repo-local/maven/poms/maven-component-2.0-SNAPSHOT.pom
> > > Installing POM:
> > >
> >
> /home/users/jvanzyl/maven-repo-local/maven/poms/maven-plugin-parent-2.0-SNAPSHOT.pom
> > > Building project in
> > /home/users/jvanzyl/m2-build/maven-components/maven-model
> > > ...
> > > --------------------------------------------------------------------
> > > Building project in
> > > /home/users/jvanzyl/m2-build/maven-components/maven-model
> > > Downloading dependencies ...
> > > Model exists!
> > > Generating java in
> > >
> > /home/users/jvanzyl/m2-build/maven-components/maven-model/target/generated-sources
> > > from /home/users/jvanzyl/m2-build/maven-components/maven-model/maven.mdo
> > > Generating java in
> > >
> > /home/users/jvanzyl/m2-build/maven-components/maven-model/target/generated-sources
> > > from /home/users/jvanzyl/m2-build/maven-components/maven-model/maven.mdo
> > > Generating xpp3 unmarshaller in
> > >
> > /home/users/jvanzyl/m2-build/maven-components/maven-model/target/generated-sources
> > > from /home/users/jvanzyl/m2-build/maven-components/maven-model/maven.mdo
> > > Generating xpp3 marshaller in
> > >
> > /home/users/jvanzyl/m2-build/maven-components/maven-model/target/generated-sources
> > > from /home/users/jvanzyl/m2-build/maven-components/maven-model/maven.mdo
> > > Generating xpp3 unmarshaller in
> > >
> > /home/users/jvanzyl/m2-build/maven-components/maven-model/target/generated-sources
> > > from /home/users/jvanzyl/m2-build/maven-components/maven-model/maven.mdo
> > > Generating xpp3 marshaller in
> > >
> > /home/users/jvanzyl/m2-build/maven-components/maven-model/target/generated-sources
> > > from /home/users/jvanzyl/m2-build/maven-components/maven-model/maven.mdo
> > > Compiling sources ...
> > > Packaging resources ...
> > > Compiling test sources ...
> > > Packaging test resources ...
> > > 
> > > -------------------------------------------------------
> > >  T E S T S
> > > -------------------------------------------------------
> > > There are no test to run.
> > > 
> > > Resume :
> > > [surefire] Tests run: 0, Failures: 0, Errors: 0
> > > 
> > > Installing POM:
> > >
> > /home/users/jvanzyl/maven-repo-local/maven/poms/maven-model-2.0-SNAPSHOT.pom
> > > Installing JAR:
> > >
> > /home/users/jvanzyl/maven-repo-local/maven/jars/maven-model-2.0-SNAPSHOT.jar
> > > --------------------------------------------------------------------
> > > Building project in
> > > /home/users/jvanzyl/m2-build/maven-components/maven-plugin ...
> > > --------------------------------------------------------------------
> > > Building project in
> > > /home/users/jvanzyl/m2-build/maven-components/maven-plugin
> > > Downloading dependencies ...
> > > Compiling sources ...
> > > Packaging resources ...
> > > Compiling test sources ...
> > > Packaging test resources ...
> > > 
> > > -------------------------------------------------------
> > >  T E S T S
> > > -------------------------------------------------------
> > > [surefire] Running org.apache.maven.plugin.BeanTest
> > > [surefire] Tests run: 1, Failures: 0, Errors: 0, Time elapsed: 0.005 sec
> > > [surefire] Running org.apache.maven.plugin.TestPluginTest
> > > [surefire] Tests run: 1, Failures: 0, Errors: 0, Time elapsed: 0 sec
> > > There are no test to run.
> > > 
> > > Resume :
> > > [surefire] Tests run: 2, Failures: 0, Errors: 0
> > > 
> > > Installing POM:
> > >
> > /home/users/jvanzyl/maven-repo-local/maven/poms/maven-plugin-2.0-SNAPSHOT.pom
> > > Installing JAR:
> > >
> > /home/users/jvanzyl/maven-repo-local/maven/jars/maven-plugin-2.0-SNAPSHOT.jar
> > > --------------------------------------------------------------------
> > > Building project in
> > > /home/users/jvanzyl/m2-build/maven-components/maven-plugin-tools ...
> > > --------------------------------------------------------------------
> > > Building project in
> > > /home/users/jvanzyl/m2-build/maven-components/maven-plugin-tools
> > > Downloading dependencies ...
> > > Compiling sources ...
> > > Packaging resources ...
> > > Compiling test sources ...
> > > Packaging test resources ...
> > > 
> > > -------------------------------------------------------
> > >  T E S T S
> > > -------------------------------------------------------
> > > [surefire] Running
> > > org.apache.maven.plugin.generator.jelly.JellyHarnessGeneratorTest
> > > [surefire] Tests run: 1, Failures: 0, Errors: 0, Time elapsed: 0.135 sec
> > > [surefire] Running org.apache.maven.plugin.generator.BeanGeneratorTest
> > > [surefire] Tests run: 1, Failures: 0, Errors: 0, Time elapsed: 0.146 sec
> > > [surefire] Running
> > > org.apache.maven.plugin.generator.PluginDescriptorGeneratorTest
> > > [surefire] Tests run: 1, Failures: 0, Errors: 0, Time elapsed: 0.07 sec
> > > [surefire] Running
> > org.apache.maven.plugin.generator.PluginXdocGeneratorTest
> > > [surefire] Tests run: 1, Failures: 0, Errors: 0, Time elapsed: 0.007 sec
> > > There are no test to run.
> > > 
> > > Resume :
> > > [surefire] Tests run: 4, Failures: 0, Errors: 0
> > > 
> > > Installing POM:
> > >
> >
> /home/users/jvanzyl/maven-repo-local/maven/poms/maven-plugin-tools-2.0-SNAPSHOT.pom
> > > Installing JAR:
> > >
> >
> /home/users/jvanzyl/maven-repo-local/maven/jars/maven-plugin-tools-2.0-SNAPSHOT.jar
> > > --------------------------------------------------------------------
> > > Building project in
> > > /home/users/jvanzyl/m2-build/maven-components/maven-artifact ...
> > > --------------------------------------------------------------------
> > > Building project in
> > > /home/users/jvanzyl/m2-build/maven-components/maven-artifact
> > > Downloading dependencies ...
> > > Compiling sources ...
> > > Packaging resources ...
> > > Compiling test sources ...
> > > Packaging test resources ...
> > > 
> > > -------------------------------------------------------
> > >  T E S T S
> > > -------------------------------------------------------
> > > [surefire] Running org.apache.maven.artifact.deployer.ArtifactDeployerTest
> > > [surefire] Tests run: 1, Failures: 0, Errors: 0, Time elapsed: 0.37 sec
> > > [INFO] Installing
> > >
> >
> /home/users/jvanzyl/m2-build/maven-components/maven-artifact/src/test/resources/artifact-install/artifact-1.0.jar
> > > to
> > >
> >
> target/test-classes/repositories/installer/local-repository/maven/jars/artifact-1.0.jar
> > > [surefire] Running
> > org.apache.maven.artifact.installer.ArtifactInstallerTest
> > > [surefire] Tests run: 1, Failures: 0, Errors: 0, Time elapsed: 0.078 sec
> > > [ERROR] Nonexistent component: org.apache.maven.wagon.Wagond
> > > [surefire] Running
> > org.apache.maven.artifact.manager.DefaultWagonManagerTest
> > > [surefire] Tests run: 1, Failures: 0, Errors: 0, Time elapsed: 0.033 sec
> > > [surefire] Running org.apache.maven.artifact.resolver.ArtifactResolverTest
> > > [surefire] Tests run: 8, Failures: 0, Errors: 0, Time elapsed: 0.028 sec
> > > There are no test to run.
> > > 
> > > Resume :
> > > [surefire] Tests run: 11, Failures: 0, Errors: 0
> > > 
> > > Installing POM:
> > >
> > /home/users/jvanzyl/maven-repo-local/maven/poms/maven-artifact-2.0-SNAPSHOT.pom
> > > Installing JAR:
> > >
> > /home/users/jvanzyl/maven-repo-local/maven/jars/maven-artifact-2.0-SNAPSHOT.jar
> > > --------------------------------------------------------------------
> > > Building project in
> > /home/users/jvanzyl/m2-build/maven-components/maven-core
> > > ...
> > > --------------------------------------------------------------------
> > > Building project in
> > /home/users/jvanzyl/m2-build/maven-components/maven-core
> > > Downloading dependencies ...
> > > Compiling sources ...
> > > Packaging resources ...
> > > Compiling test sources ...
> > > Packaging test resources ...
> > > 
> > > -------------------------------------------------------
> > >  T E S T S
> > > -------------------------------------------------------
> > > [surefire] Running org.apache.maven.decoration.DefaultGoalDecoratorTest
> > > [surefire] Tests run: 3, Failures: 0, Errors: 0, Time elapsed: 0 sec
> > > [surefire] Running org.apache.maven.decoration.GoalDecorationParserTest
> > > [surefire] Tests run: 5, Failures: 0, Errors: 0, Time elapsed: 0 sec
> > > [surefire] Running org.apache.maven.decoration.GoalDecoratorBindingsTest
> > > [surefire] Tests run: 7, Failures: 0, Errors: 0, Time elapsed: 0 sec
> > > org.apache.maven.project.ProjectBuildingException: Error building project
> > > from
> > >
> >
> /home/users/jvanzyl/m2-build/maven-components/maven-core/target/test-classes/pom.xml
> > > 	at
> > >
> >
> org.apache.maven.project.DefaultMavenProjectBuilder.build(DefaultMavenProjectBuilder.java:200)
> > > 	at
> > >
> >
> org.apache.maven.project.DefaultMavenProjectBuilder.build(DefaultMavenProjectBuilder.java:96)
> > > 	at
> > >
> > org.apache.maven.MavenTestCase.createGoalExecutionContext(MavenTestCase.java:102)
> > > 	at
> > >
> > org.apache.maven.MavenTestCase.createGoalExecutionContext(MavenTestCase.java:84)
> > > 	at
> > >
> >
> org.apache.maven.lifecycle.goal.phase.GoalResolutionPhaseTest.runTest(GoalResolutionPhaseTest.java:274)
> > > 	at
> > >
> >
> org.apache.maven.lifecycle.goal.phase.GoalResolutionPhaseTest.testT1_ShouldFind_PreGoal_MainGoal_PostGoal(GoalResolutionPhaseTest.java:64)
> > > 	at sun.reflect.NativeMethodAccessorImpl.invoke0(Native Method)
> > > 	at
> > >
> > sun.reflect.NativeMethodAccessorImpl.invoke(NativeMethodAccessorImpl.java:39)
> > > 	at
> > >
> >
> sun.reflect.DelegatingMethodAccessorImpl.invoke(DelegatingMethodAccessorImpl.java:25)
> > > 	at java.lang.reflect.Method.invoke(Method.java:324)
> > > 	at junit.framework.TestCase.runTest(TestCase.java:154)
> > > 	at junit.framework.TestCase.runBare(TestCase.java:127)
> > > 	at junit.framework.TestResult$1.protect(TestResult.java:106)
> > > 	at junit.framework.TestResult.runProtected(TestResult.java:124)
> > > 	at junit.framework.TestResult.run(TestResult.java:109)
> > > 	at junit.framework.TestCase.run(TestCase.java:118)
> > > 	at junit.framework.TestSuite.runTest(TestSuite.java:208)
> > > 	at junit.framework.TestSuite.run(TestSuite.java:203)
> > > 	at sun.reflect.NativeMethodAccessorImpl.invoke0(Native Method)
> > > 	at
> > >
> > sun.reflect.NativeMethodAccessorImpl.invoke(NativeMethodAccessorImpl.java:39)
> > > 	at
> > >
> >
> sun.reflect.DelegatingMethodAccessorImpl.invoke(DelegatingMethodAccessorImpl.java:25)
> > > 	at java.lang.reflect.Method.invoke(Method.java:324)
> > > 	at
> > > org.codehaus.surefire.battery.JUnitBattery.execute(JUnitBattery.java:161)
> > > 	at org.codehaus.surefire.Surefire.executeBattery(Surefire.java:149)
> > > 	at org.codehaus.surefire.Surefire.run(Surefire.java:103)
> > > 	at org.codehaus.surefire.Surefire.run(Surefire.java:55)
> > > 	at sun.reflect.NativeMethodAccessorImpl.invoke0(Native Method)
> > > 	at
> > >
> > sun.reflect.NativeMethodAccessorImpl.invoke(NativeMethodAccessorImpl.java:39)
> > > 	at
> > >
> >
> sun.reflect.DelegatingMethodAccessorImpl.invoke(DelegatingMethodAccessorImpl.java:25)
> > > 	at java.lang.reflect.Method.invoke(Method.java:324)
> > > 	at SurefireBooter.run(SurefireBooter.java:70)
> > > 	at SurefirePlugin.execute(SurefirePlugin.java:36)
> > > 	at MBoot.runTests(MBoot.java:709)
> > > 	at MBoot.buildProject(MBoot.java:507)
> > > 	at MBoot.run(MBoot.java:216)
> > > 	at MBoot.main(MBoot.java:139)
> > > Caused by: java.lang.NullPointerException
> > > 	at
> > >
> >
> org.apache.maven.project.inheritance.DefaultModelInheritanceAssembler.assembleModelInheritance(DefaultModelInheritanceAssembler.java:37)
> > > 	at
> > >
> >
> org.apache.maven.project.DefaultMavenProjectBuilder.build(DefaultMavenProjectBuilder.java:142)
> > > 	... 35 more
> > > org.apache.maven.project.ProjectBuildingException: Error building project
> > > from
> > >
> >
> /home/users/jvanzyl/m2-build/maven-components/maven-core/target/test-classes/pom.xml
> > > 	at
> > >
> >
> org.apache.maven.project.DefaultMavenProjectBuilder.build(DefaultMavenProjectBuilder.java:200)
> > > 	at
> > >
> >
> org.apache.maven.project.DefaultMavenProjectBuilder.build(DefaultMavenProjectBuilder.java:96)
> > > 	at
> > >
> > org.apache.maven.MavenTestCase.createGoalExecutionContext(MavenTestCase.java:102)
> > > 	at
> > >
> > org.apache.maven.MavenTestCase.createGoalExecutionContext(MavenTestCase.java:84)
> > > 	at
> > >
> >
> org.apache.maven.lifecycle.goal.phase.GoalResolutionPhaseTest.runTest(GoalResolutionPhaseTest.java:274)
> > > 	at
> > >
> >
> org.apache.maven.lifecycle.goal.phase.GoalResolutionPhaseTest.testT2_ShouldFind_Prereq_MainGoal(GoalResolutionPhaseTest.java:102)
> > > 	at sun.reflect.NativeMethodAccessorImpl.invoke0(Native Method)
> > > 	at
> > >
> > sun.reflect.NativeMethodAccessorImpl.invoke(NativeMethodAccessorImpl.java:39)
> > > 	at
> > >
> >
> sun.reflect.DelegatingMethodAccessorImpl.invoke(DelegatingMethodAccessorImpl.java:25)
> > > 	at java.lang.reflect.Method.invoke(Method.java:324)
> > > 	at junit.framework.TestCase.runTest(TestCase.java:154)
> > > 	at junit.framework.TestCase.runBare(TestCase.java:127)
> > > 	at junit.framework.TestResult$1.protect(TestResult.java:106)
> > > 	at junit.framework.TestResult.runProtected(TestResult.java:124)
> > > 	at junit.framework.TestResult.run(TestResult.java:109)
> > > 	at junit.framework.TestCase.run(TestCase.java:118)
> > > 	at junit.framework.TestSuite.runTest(TestSuite.java:208)
> > > 	at junit.framework.TestSuite.run(TestSuite.java:203)
> > > 	at sun.reflect.NativeMethodAccessorImpl.invoke0(Native Method)
> > > 	at
> > >
> > sun.reflect.NativeMethodAccessorImpl.invoke(NativeMethodAccessorImpl.java:39)
> > > 	at
> > >
> >
> sun.reflect.DelegatingMethodAccessorImpl.invoke(DelegatingMethodAccessorImpl.java:25)
> > > 	at java.lang.reflect.Method.invoke(Method.java:324)
> > > 	at
> > > org.codehaus.surefire.battery.JUnitBattery.execute(JUnitBattery.java:161)
> > > 	at org.codehaus.surefire.Surefire.executeBattery(Surefire.java:149)
> > > 	at org.codehaus.surefire.Surefire.run(Surefire.java:103)
> > > 	at org.codehaus.surefire.Surefire.run(Surefire.java:55)
> > > 	at sun.reflect.NativeMethodAccessorImpl.invoke0(Native Method)
> > > 	at
> > >
> > sun.reflect.NativeMethodAccessorImpl.invoke(NativeMethodAccessorImpl.java:39)
> > > 	at
> > >
> >
> sun.reflect.DelegatingMethodAccessorImpl.invoke(DelegatingMethodAccessorImpl.java:25)
> > > 	at java.lang.reflect.Method.invoke(Method.java:324)
> > > 	at SurefireBooter.run(SurefireBooter.java:70)
> > > 	at SurefirePlugin.execute(SurefirePlugin.java:36)
> > > 	at MBoot.runTests(MBoot.java:709)
> > > 	at MBoot.buildProject(MBoot.java:507)
> > > 	at MBoot.run(MBoot.java:216)
> > > 	at MBoot.main(MBoot.java:139)
> > > Caused by: java.lang.NullPointerException
> > > 	at
> > >
> >
> org.apache.maven.project.inheritance.DefaultModelInheritanceAssembler.assembleModelInheritance(DefaultModelInheritanceAssembler.java:37)
> > > 	at
> > >
> >
> org.apache.maven.project.DefaultMavenProjectBuilder.build(DefaultMavenProjectBuilder.java:142)
> > > 	... 35 more
> > > org.apache.maven.project.ProjectBuildingException: Error building project
> > > from
> > >
> >
> /home/users/jvanzyl/m2-build/maven-components/maven-core/target/test-classes/pom.xml
> > > 	at
> > >
> >
> org.apache.maven.project.DefaultMavenProjectBuilder.build(DefaultMavenProjectBuilder.java:200)
> > > 	at
> > >
> >
> org.apache.maven.project.DefaultMavenProjectBuilder.build(DefaultMavenProjectBuilder.java:96)
> > > 	at
> > >
> > org.apache.maven.MavenTestCase.createGoalExecutionContext(MavenTestCase.java:102)
> > > 	at
> > >
> > org.apache.maven.MavenTestCase.createGoalExecutionContext(MavenTestCase.java:84)
> > > 	at
> > >
> >
> org.apache.maven.lifecycle.goal.phase.GoalResolutionPhaseTest.runTest(GoalResolutionPhaseTest.java:274)
> > > 	at
> > >
> >
> org.apache.maven.lifecycle.goal.phase.GoalResolutionPhaseTest.testT3_ShouldFind_PreGoal_Prereq_MainGoal_PostGoal(GoalResolutionPhaseTest.java:159)
> > > 	at sun.reflect.NativeMethodAccessorImpl.invoke0(Native Method)
> > > 	at
> > >
> > sun.reflect.NativeMethodAccessorImpl.invoke(NativeMethodAccessorImpl.java:39)
> > > 	at
> > >
> >
> sun.reflect.DelegatingMethodAccessorImpl.invoke(DelegatingMethodAccessorImpl.java:25)
> > > 	at java.lang.reflect.Method.invoke(Method.java:324)
> > > 	at junit.framework.TestCase.runTest(TestCase.java:154)
> > > 	at junit.framework.TestCase.runBare(TestCase.java:127)
> > > 	at junit.framework.TestResult$1.protect(TestResult.java:106)
> > > 	at junit.framework.TestResult.runProtected(TestResult.java:124)
> > > 	at junit.framework.TestResult.run(TestResult.java:109)
> > > 	at junit.framework.TestCase.run(TestCase.java:118)
> > > 	at junit.framework.TestSuite.runTest(TestSuite.java:208)
> > > 	at junit.framework.TestSuite.run(TestSuite.java:203)
> > > 	at sun.reflect.NativeMethodAccessorImpl.invoke0(Native Method)
> > > 	at
> > >
> > sun.reflect.NativeMethodAccessorImpl.invoke(NativeMethodAccessorImpl.java:39)
> > > 	at
> > >
> >
> sun.reflect.DelegatingMethodAccessorImpl.invoke(DelegatingMethodAccessorImpl.java:25)
> > > 	at java.lang.reflect.Method.invoke(Method.java:324)
> > > 	at
> > > org.codehaus.surefire.battery.JUnitBattery.execute(JUnitBattery.java:161)
> > > 	at org.codehaus.surefire.Surefire.executeBattery(Surefire.java:149)
> > > 	at org.codehaus.surefire.Surefire.run(Surefire.java:103)
> > > 	at org.codehaus.surefire.Surefire.run(Surefire.java:55)
> > > 	at sun.reflect.NativeMethodAccessorImpl.invoke0(Native Method)
> > > 	at
> > >
> > sun.reflect.NativeMethodAccessorImpl.invoke(NativeMethodAccessorImpl.java:39)
> > > 	at
> > >
> >
> sun.reflect.DelegatingMethodAccessorImpl.invoke(DelegatingMethodAccessorImpl.java:25)
> > > 	at java.lang.reflect.Method.invoke(Method.java:324)
> > > 	at SurefireBooter.run(SurefireBooter.java:70)
> > > 	at SurefirePlugin.execute(SurefirePlugin.java:36)
> > > 	at MBoot.runTests(MBoot.java:709)
> > > 	at MBoot.buildProject(MBoot.java:507)
> > > 	at MBoot.run(MBoot.java:216)
> > > 	at MBoot.main(MBoot.java:139)
> > > Caused by: java.lang.NullPointerException
> > > 	at
> > >
> >
> org.apache.maven.project.inheritance.DefaultModelInheritanceAssembler.assembleModelInheritance(DefaultModelInheritanceAssembler.java:37)
> > > 	at
> > >
> >
> org.apache.maven.project.DefaultMavenProjectBuilder.build(DefaultMavenProjectBuilder.java:142)
> > > 	... 35 more
> > > org.apache.maven.project.ProjectBuildingException: Error building project
> > > from
> > >
> >
> /home/users/jvanzyl/m2-build/maven-components/maven-core/target/test-classes/pom.xml
> > > 	at
> > >
> >
> org.apache.maven.project.DefaultMavenProjectBuilder.build(DefaultMavenProjectBuilder.java:200)
> > > 	at
> > >
> >
> org.apache.maven.project.DefaultMavenProjectBuilder.build(DefaultMavenProjectBuilder.java:96)
> > > 	at
> > >
> > org.apache.maven.MavenTestCase.createGoalExecutionContext(MavenTestCase.java:102)
> > > 	at
> > >
> > org.apache.maven.MavenTestCase.createGoalExecutionContext(MavenTestCase.java:84)
> > > 	at
> > >
> >
> org.apache.maven.lifecycle.goal.phase.GoalResolutionPhaseTest.runTest(GoalResolutionPhaseTest.java:274)
> > > 	at
> > >
> >
> org.apache.maven.lifecycle.goal.phase.GoalResolutionPhaseTest.testT4_ShouldFind_PreGoal_Prereq_PostGoal_MainGoal(GoalResolutionPhaseTest.java:216)
> > > 	at sun.reflect.NativeMethodAccessorImpl.invoke0(Native Method)
> > > 	at
> > >
> > sun.reflect.NativeMethodAccessorImpl.invoke(NativeMethodAccessorImpl.java:39)
> > > 	at
> > >
> >
> sun.reflect.DelegatingMethodAccessorImpl.invoke(DelegatingMethodAccessorImpl.java:25)
> > > 	at java.lang.reflect.Method.invoke(Method.java:324)
> > > 	at junit.framework.TestCase.runTest(TestCase.java:154)
> > > 	at junit.framework.TestCase.runBare(TestCase.java:127)
> > > 	at junit.framework.TestResult$1.protect(TestResult.java:106)
> > > 	at junit.framework.TestResult.runProtected(TestResult.java:124)
> > > 	at junit.framework.TestResult.run(TestResult.java:109)
> > > 	at junit.framework.TestCase.run(TestCase.java:118)
> > > 	at junit.framework.TestSuite.runTest(TestSuite.java:208)
> > > 	at junit.framework.TestSuite.run(TestSuite.java:203)
> > > 	at sun.reflect.NativeMethodAccessorImpl.invoke0(Native Method)
> > > 	at
> > >
> > sun.reflect.NativeMethodAccessorImpl.invoke(NativeMethodAccessorImpl.java:39)
> > > 	at
> > >
> >
> sun.reflect.DelegatingMethodAccessorImpl.invoke(DelegatingMethodAccessorImpl.java:25)
> > > 	at java.lang.reflect.Method.invoke(Method.java:324)
> > > 	at
> > > org.codehaus.surefire.battery.JUnitBattery.execute(JUnitBattery.java:161)
> > > 	at org.codehaus.surefire.Surefire.executeBattery(Surefire.java:149)
> > > 	at org.codehaus.surefire.Surefire.run(Surefire.java:103)
> > > 	at org.codehaus.surefire.Surefire.run(Surefire.java:55)
> > > 	at sun.reflect.NativeMethodAccessorImpl.invoke0(Native Method)
> > > 	at
> > >
> > sun.reflect.NativeMethodAccessorImpl.invoke(NativeMethodAccessorImpl.java:39)
> > > 	at
> > >
> >
> sun.reflect.DelegatingMethodAccessorImpl.invoke(DelegatingMethodAccessorImpl.java:25)
> > > 	at java.lang.reflect.Method.invoke(Method.java:324)
> > > 	at SurefireBooter.run(SurefireBooter.java:70)
> > > 	at SurefirePlugin.execute(SurefirePlugin.java:36)
> > > 	at MBoot.runTests(MBoot.java:709)
> > > 	at MBoot.buildProject(MBoot.java:507)
> > > 	at MBoot.run(MBoot.java:216)
> > > 	at MBoot.main(MBoot.java:139)
> > > Caused by: java.lang.NullPointerException
> > > 	at
> > >
> >
> org.apache.maven.project.inheritance.DefaultModelInheritanceAssembler.assembleModelInheritance(DefaultModelInheritanceAssembler.java:37)
> > > 	at
> > >
> >
> org.apache.maven.project.DefaultMavenProjectBuilder.build(DefaultMavenProjectBuilder.java:142)
> > > 	... 35 more
> > > org.apache.maven.project.ProjectBuildingException: Error building project
> > > from
> > >
> >
> /home/users/jvanzyl/m2-build/maven-components/maven-core/target/test-classes/pom.xml
> > > 	at
> > >
> >
> org.apache.maven.project.DefaultMavenProjectBuilder.build(DefaultMavenProjectBuilder.java:200)
> > > 	at
> > >
> >
> org.apache.maven.project.DefaultMavenProjectBuilder.build(DefaultMavenProjectBuilder.java:96)
> > > 	at
> > >
> > org.apache.maven.MavenTestCase.createGoalExecutionContext(MavenTestCase.java:102)
> > > 	at
> > >
> > org.apache.maven.MavenTestCase.createGoalExecutionContext(MavenTestCase.java:84)
> > > 	at
> > >
> >
> org.apache.maven.lifecycle.goal.phase.GoalResolutionPhaseTest.runTest(GoalResolutionPhaseTest.java:274)
> > > 	at
> > >
> >
> org.apache.maven.lifecycle.goal.phase.GoalResolutionPhaseTest.testT5_ShouldFind_Prereq_PreGoal_MainGoal(GoalResolutionPhaseTest.java:267)
> > > 	at sun.reflect.NativeMethodAccessorImpl.invoke0(Native Method)
> > > 	at
> > >
> > sun.reflect.NativeMethodAccessorImpl.invoke(NativeMethodAccessorImpl.java:39)
> > > 	at
> > >
> >
> sun.reflect.DelegatingMethodAccessorImpl.invoke(DelegatingMethodAccessorImpl.java:25)
> > > 	at java.lang.reflect.Method.invoke(Method.java:324)
> > > 	at junit.framework.TestCase.runTest(TestCase.java:154)
> > > 	at junit.framework.TestCase.runBare(TestCase.java:127)
> > > 	at junit.framework.TestResult$1.protect(TestResult.java:106)
> > > 	at junit.framework.TestResult.runProtected(TestResult.java:124)
> > > 	at junit.framework.TestResult.run(TestResult.java:109)
> > > 	at junit.framework.TestCase.run(TestCase.java:118)
> > > 	at junit.framework.TestSuite.runTest(TestSuite.java:208)
> > > 	at junit.framework.TestSuite.run(TestSuite.java:203)
> > > 	at sun.reflect.NativeMethodAccessorImpl.invoke0(Native Method)
> > > 	at
> > >
> > sun.reflect.NativeMethodAccessorImpl.invoke(NativeMethodAccessorImpl.java:39)
> > > 	at
> > >
> >
> sun.reflect.DelegatingMethodAccessorImpl.invoke(DelegatingMethodAccessorImpl.java:25)
> > > 	at java.lang.reflect.Method.invoke(Method.java:324)
> > > 	at
> > > org.codehaus.surefire.battery.JUnitBattery.execute(JUnitBattery.java:161)
> > > 	at org.codehaus.surefire.Surefire.executeBattery(Surefire.java:149)
> > > 	at org.codehaus.surefire.Surefire.run(Surefire.java:103)
> > > 	at org.codehaus.surefire.Surefire.run(Surefire.java:55)
> > > 	at sun.reflect.NativeMethodAccessorImpl.invoke0(Native Method)
> > > 	at
> > >
> > sun.reflect.NativeMethodAccessorImpl.invoke(NativeMethodAccessorImpl.java:39)
> > > 	at
> > >
> >
> sun.reflect.DelegatingMethodAccessorImpl.invoke(DelegatingMethodAccessorImpl.java:25)
> > > 	at java.lang.reflect.Method.invoke(Method.java:324)
> > > 	at SurefireBooter.run(SurefireBooter.java:70)
> > > 	at SurefirePlugin.execute(SurefirePlugin.java:36)
> > > 	at MBoot.runTests(MBoot.java:709)
> > > 	at MBoot.buildProject(MBoot.java:507)
> > > 	at MBoot.run(MBoot.java:216)
> > > 	at MBoot.main(MBoot.java:139)
> > > Caused by: java.lang.NullPointerException
> > > 	at
> > >
> >
> org.apache.maven.project.inheritance.DefaultModelInheritanceAssembler.assembleModelInheritance(DefaultModelInheritanceAssembler.java:37)
> > > 	at
> > >
> >
> org.apache.maven.project.DefaultMavenProjectBuilder.build(DefaultMavenProjectBuilder.java:142)
> > > 	... 35 more
> > > [surefire] Running
> > > org.apache.maven.lifecycle.goal.phase.GoalResolutionPhaseTest
> > > [surefire] Tests run: 5, Failures: 0, Errors: 5, Time elapsed: 0.044 sec
> > > <<<<<<<< FAILURE !! 
> > > [surefire] Running org.apache.maven.lifecycle.MavenLifecycleManagerTest
> > > [surefire] Tests run: 1, Failures: 0, Errors: 0, Time elapsed: 0.047 sec
> > > org.apache.maven.project.ProjectBuildingException: Error building project
> > > from
> > >
> >
> /home/users/jvanzyl/m2-build/maven-components/maven-core/src/test/resources/pom.xml
> > > 	at
> > >
> >
> org.apache.maven.project.DefaultMavenProjectBuilder.build(DefaultMavenProjectBuilder.java:200)
> > > 	at
> > >
> >
> org.apache.maven.project.DefaultMavenProjectBuilder.build(DefaultMavenProjectBuilder.java:96)
> > > 	at
> > >
> >
> org.apache.maven.plugin.OgnlProjectValueExtractorTest.setUp(OgnlProjectValueExtractorTest.java:33)
> > > 	at junit.framework.TestCase.runBare(TestCase.java:125)
> > > 	at junit.framework.TestResult$1.protect(TestResult.java:106)
> > > 	at junit.framework.TestResult.runProtected(TestResult.java:124)
> > > 	at junit.framework.TestResult.run(TestResult.java:109)
> > > 	at junit.framework.TestCase.run(TestCase.java:118)
> > > 	at junit.framework.TestSuite.runTest(TestSuite.java:208)
> > > 	at junit.framework.TestSuite.run(TestSuite.java:203)
> > > 	at sun.reflect.NativeMethodAccessorImpl.invoke0(Native Method)
> > > 	at
> > >
> > sun.reflect.NativeMethodAccessorImpl.invoke(NativeMethodAccessorImpl.java:39)
> > > 	at
> > >
> >
> sun.reflect.DelegatingMethodAccessorImpl.invoke(DelegatingMethodAccessorImpl.java:25)
> > > 	at java.lang.reflect.Method.invoke(Method.java:324)
> > > 	at
> > > org.codehaus.surefire.battery.JUnitBattery.execute(JUnitBattery.java:161)
> > > 	at org.codehaus.surefire.Surefire.executeBattery(Surefire.java:149)
> > > 	at org.codehaus.surefire.Surefire.run(Surefire.java:103)
> > > 	at org.codehaus.surefire.Surefire.run(Surefire.java:55)
> > > 	at sun.reflect.NativeMethodAccessorImpl.invoke0(Native Method)
> > > 	at
> > >
> > sun.reflect.NativeMethodAccessorImpl.invoke(NativeMethodAccessorImpl.java:39)
> > > 	at
> > >
> >
> sun.reflect.DelegatingMethodAccessorImpl.invoke(DelegatingMethodAccessorImpl.java:25)
> > > 	at java.lang.reflect.Method.invoke(Method.java:324)
> > > 	at SurefireBooter.run(SurefireBooter.java:70)
> > > 	at SurefirePlugin.execute(SurefirePlugin.java:36)
> > > 	at MBoot.runTests(MBoot.java:709)
> > > 	at MBoot.buildProject(MBoot.java:507)
> > > 	at MBoot.run(MBoot.java:216)
> > > 	at MBoot.main(MBoot.java:139)
> > > Caused by: java.lang.NullPointerException
> > > 	at
> > >
> >
> org.apache.maven.project.inheritance.DefaultModelInheritanceAssembler.assembleModelInheritance(DefaultModelInheritanceAssembler.java:37)
> > > 	at
> > >
> >
> org.apache.maven.project.DefaultMavenProjectBuilder.build(DefaultMavenProjectBuilder.java:142)
> > > 	... 27 more
> > > org.apache.maven.project.ProjectBuildingException: Error building project
> > > from
> > >
> >
> /home/users/jvanzyl/m2-build/maven-components/maven-core/src/test/resources/pom.xml
> > > 	at
> > >
> >
> org.apache.maven.project.DefaultMavenProjectBuilder.build(DefaultMavenProjectBuilder.java:200)
> > > 	at
> > >
> >
> org.apache.maven.project.DefaultMavenProjectBuilder.build(DefaultMavenProjectBuilder.java:96)
> > > 	at
> > >
> >
> org.apache.maven.plugin.OgnlProjectValueExtractorTest.setUp(OgnlProjectValueExtractorTest.java:33)
> > > 	at junit.framework.TestCase.runBare(TestCase.java:125)
> > > 	at junit.framework.TestResult$1.protect(TestResult.java:106)
> > > 	at junit.framework.TestResult.runProtected(TestResult.java:124)
> > > 	at junit.framework.TestResult.run(TestResult.java:109)
> > > 	at junit.framework.TestCase.run(TestCase.java:118)
> > > 	at junit.framework.TestSuite.runTest(TestSuite.java:208)
> > > 	at junit.framework.TestSuite.run(TestSuite.java:203)
> > > 	at sun.reflect.NativeMethodAccessorImpl.invoke0(Native Method)
> > > 	at
> > >
> > sun.reflect.NativeMethodAccessorImpl.invoke(NativeMethodAccessorImpl.java:39)
> > > 	at
> > >
> >
> sun.reflect.DelegatingMethodAccessorImpl.invoke(DelegatingMethodAccessorImpl.java:25)
> > > 	at java.lang.reflect.Method.invoke(Method.java:324)
> > > 	at
> > > org.codehaus.surefire.battery.JUnitBattery.execute(JUnitBattery.java:161)
> > > 	at org.codehaus.surefire.Surefire.executeBattery(Surefire.java:149)
> > > 	at org.codehaus.surefire.Surefire.run(Surefire.java:103)
> > > 	at org.codehaus.surefire.Surefire.run(Surefire.java:55)
> > > 	at sun.reflect.NativeMethodAccessorImpl.invoke0(Native Method)
> > > 	at
> > >
> > sun.reflect.NativeMethodAccessorImpl.invoke(NativeMethodAccessorImpl.java:39)
> > > 	at
> > >
> >
> sun.reflect.DelegatingMethodAccessorImpl.invoke(DelegatingMethodAccessorImpl.java:25)
> > > 	at java.lang.reflect.Method.invoke(Method.java:324)
> > > 	at SurefireBooter.run(SurefireBooter.java:70)
> > > 	at SurefirePlugin.execute(SurefirePlugin.java:36)
> > > 	at MBoot.runTests(MBoot.java:709)
> > > 	at MBoot.buildProject(MBoot.java:507)
> > > 	at MBoot.run(MBoot.java:216)
> > > 	at MBoot.main(MBoot.java:139)
> > > Caused by: java.lang.NullPointerException
> > > 	at
> > >
> >
> org.apache.maven.project.inheritance.DefaultModelInheritanceAssembler.assembleModelInheritance(DefaultModelInheritanceAssembler.java:37)
> > > 	at
> > >
> >
> org.apache.maven.project.DefaultMavenProjectBuilder.build(DefaultMavenProjectBuilder.java:142)
> > > 	... 27 more
> > > org.apache.maven.project.ProjectBuildingException: Error building project
> > > from
> > >
> >
> /home/users/jvanzyl/m2-build/maven-components/maven-core/src/test/resources/pom.xml
> > > 	at
> > >
> >
> org.apache.maven.project.DefaultMavenProjectBuilder.build(DefaultMavenProjectBuilder.java:200)
> > > 	at
> > >
> >
> org.apache.maven.project.DefaultMavenProjectBuilder.build(DefaultMavenProjectBuilder.java:96)
> > > 	at
> > >
> >
> org.apache.maven.plugin.OgnlProjectValueExtractorTest.setUp(OgnlProjectValueExtractorTest.java:33)
> > > 	at junit.framework.TestCase.runBare(TestCase.java:125)
> > > 	at junit.framework.TestResult$1.protect(TestResult.java:106)
> > > 	at junit.framework.TestResult.runProtected(TestResult.java:124)
> > > 	at junit.framework.TestResult.run(TestResult.java:109)
> > > 	at junit.framework.TestCase.run(TestCase.java:118)
> > > 	at junit.framework.TestSuite.runTest(TestSuite.java:208)
> > > 	at junit.framework.TestSuite.run(TestSuite.java:203)
> > > 	at sun.reflect.NativeMethodAccessorImpl.invoke0(Native Method)
> > > 	at
> > >
> > sun.reflect.NativeMethodAccessorImpl.invoke(NativeMethodAccessorImpl.java:39)
> > > 	at
> > >
> >
> sun.reflect.DelegatingMethodAccessorImpl.invoke(DelegatingMethodAccessorImpl.java:25)
> > > 	at java.lang.reflect.Method.invoke(Method.java:324)
> > > 	at
> > > org.codehaus.surefire.battery.JUnitBattery.execute(JUnitBattery.java:161)
> > > 	at org.codehaus.surefire.Surefire.executeBattery(Surefire.java:149)
> > > 	at org.codehaus.surefire.Surefire.run(Surefire.java:103)
> > > 	at org.codehaus.surefire.Surefire.run(Surefire.java:55)
> > > 	at sun.reflect.NativeMethodAccessorImpl.invoke0(Native Method)
> > > 	at
> > >
> > sun.reflect.NativeMethodAccessorImpl.invoke(NativeMethodAccessorImpl.java:39)
> > > 	at
> > >
> >
> sun.reflect.DelegatingMethodAccessorImpl.invoke(DelegatingMethodAccessorImpl.java:25)
> > > 	at java.lang.reflect.Method.invoke(Method.java:324)
> > > 	at SurefireBooter.run(SurefireBooter.java:70)
> > > 	at SurefirePlugin.execute(SurefirePlugin.java:36)
> > > 	at MBoot.runTests(MBoot.java:709)
> > > 	at MBoot.buildProject(MBoot.java:507)
> > > 	at MBoot.run(MBoot.java:216)
> > > 	at MBoot.main(MBoot.java:139)
> > > Caused by: java.lang.NullPointerException
> > > 	at
> > >
> >
> org.apache.maven.project.inheritance.DefaultModelInheritanceAssembler.assembleModelInheritance(DefaultModelInheritanceAssembler.java:37)
> > > 	at
> > >
> >
> org.apache.maven.project.DefaultMavenProjectBuilder.build(DefaultMavenProjectBuilder.java:142)
> > > 	... 27 more
> > > org.apache.maven.project.ProjectBuildingException: Error building project
> > > from
> > >
> >
> /home/users/jvanzyl/m2-build/maven-components/maven-core/src/test/resources/pom.xml
> > > 	at
> > >
> >
> org.apache.maven.project.DefaultMavenProjectBuilder.build(DefaultMavenProjectBuilder.java:200)
> > > 	at
> > >
> >
> org.apache.maven.project.DefaultMavenProjectBuilder.build(DefaultMavenProjectBuilder.java:96)
> > > 	at
> > >
> >
> org.apache.maven.plugin.OgnlProjectValueExtractorTest.setUp(OgnlProjectValueExtractorTest.java:33)
> > > 	at junit.framework.TestCase.runBare(TestCase.java:125)
> > > 	at junit.framework.TestResult$1.protect(TestResult.java:106)
> > > 	at junit.framework.TestResult.runProtected(TestResult.java:124)
> > > 	at junit.framework.TestResult.run(TestResult.java:109)
> > > 	at junit.framework.TestCase.run(TestCase.java:118)
> > > 	at junit.framework.TestSuite.runTest(TestSuite.java:208)
> > > 	at junit.framework.TestSuite.run(TestSuite.java:203)
> > > 	at sun.reflect.NativeMethodAccessorImpl.invoke0(Native Method)
> > > 	at
> > >
> > sun.reflect.NativeMethodAccessorImpl.invoke(NativeMethodAccessorImpl.java:39)
> > > 	at
> > >
> >
> sun.reflect.DelegatingMethodAccessorImpl.invoke(DelegatingMethodAccessorImpl.java:25)
> > > 	at java.lang.reflect.Method.invoke(Method.java:324)
> > > 	at
> > > org.codehaus.surefire.battery.JUnitBattery.execute(JUnitBattery.java:161)
> > > 	at org.codehaus.surefire.Surefire.executeBattery(Surefire.java:149)
> > > 	at org.codehaus.surefire.Surefire.run(Surefire.java:103)
> > > 	at org.codehaus.surefire.Surefire.run(Surefire.java:55)
> > > 	at sun.reflect.NativeMethodAccessorImpl.invoke0(Native Method)
> > > 	at
> > >
> > sun.reflect.NativeMethodAccessorImpl.invoke(NativeMethodAccessorImpl.java:39)
> > > 	at
> > >
> >
> sun.reflect.DelegatingMethodAccessorImpl.invoke(DelegatingMethodAccessorImpl.java:25)
> > > 	at java.lang.reflect.Method.invoke(Method.java:324)
> > > 	at SurefireBooter.run(SurefireBooter.java:70)
> > > 	at SurefirePlugin.execute(SurefirePlugin.java:36)
> > > 	at MBoot.runTests(MBoot.java:709)
> > > 	at MBoot.buildProject(MBoot.java:507)
> > > 	at MBoot.run(MBoot.java:216)
> > > 	at MBoot.main(MBoot.java:139)
> > > Caused by: java.lang.NullPointerException
> > > 	at
> > >
> >
> org.apache.maven.project.inheritance.DefaultModelInheritanceAssembler.assembleModelInheritance(DefaultModelInheritanceAssembler.java:37)
> > > 	at
> > >
> >
> org.apache.maven.project.DefaultMavenProjectBuilder.build(DefaultMavenProjectBuilder.java:142)
> > > 	... 27 more
> > > org.apache.maven.project.ProjectBuildingException: Error building project
> > > from
> > >
> >
> /home/users/jvanzyl/m2-build/maven-components/maven-core/src/test/resources/pom.xml
> > > 	at
> > >
> >
> org.apache.maven.project.DefaultMavenProjectBuilder.build(DefaultMavenProjectBuilder.java:200)
> > > 	at
> > >
> >
> org.apache.maven.project.DefaultMavenProjectBuilder.build(DefaultMavenProjectBuilder.java:96)
> > > 	at
> > >
> >
> org.apache.maven.plugin.OgnlProjectValueExtractorTest.setUp(OgnlProjectValueExtractorTest.java:33)
> > > 	at junit.framework.TestCase.runBare(TestCase.java:125)
> > > 	at junit.framework.TestResult$1.protect(TestResult.java:106)
> > > 	at junit.framework.TestResult.runProtected(TestResult.java:124)
> > > 	at junit.framework.TestResult.run(TestResult.java:109)
> > > 	at junit.framework.TestCase.run(TestCase.java:118)
> > > 	at junit.framework.TestSuite.runTest(TestSuite.java:208)
> > > 	at junit.framework.TestSuite.run(TestSuite.java:203)
> > > 	at sun.reflect.NativeMethodAccessorImpl.invoke0(Native Method)
> > > 	at
> > >
> > sun.reflect.NativeMethodAccessorImpl.invoke(NativeMethodAccessorImpl.java:39)
> > > 	at
> > >
> >
> sun.reflect.DelegatingMethodAccessorImpl.invoke(DelegatingMethodAccessorImpl.java:25)
> > > 	at java.lang.reflect.Method.invoke(Method.java:324)
> > > 	at
> > > org.codehaus.surefire.battery.JUnitBattery.execute(JUnitBattery.java:161)
> > > 	at org.codehaus.surefire.Surefire.executeBattery(Surefire.java:149)
> > > 	at org.codehaus.surefire.Surefire.run(Surefire.java:103)
> > > 	at org.codehaus.surefire.Surefire.run(Surefire.java:55)
> > > 	at sun.reflect.NativeMethodAccessorImpl.invoke0(Native Method)
> > > 	at
> > >
> > sun.reflect.NativeMethodAccessorImpl.invoke(NativeMethodAccessorImpl.java:39)
> > > 	at
> > >
> >
> sun.reflect.DelegatingMethodAccessorImpl.invoke(DelegatingMethodAccessorImpl.java:25)
> > > 	at java.lang.reflect.Method.invoke(Method.java:324)
> > > 	at SurefireBooter.run(SurefireBooter.java:70)
> > > 	at SurefirePlugin.execute(SurefirePlugin.java:36)
> > > 	at MBoot.runTests(MBoot.java:709)
> > > 	at MBoot.buildProject(MBoot.java:507)
> > > 	at MBoot.run(MBoot.java:216)
> > > 	at MBoot.main(MBoot.java:139)
> > > Caused by: java.lang.NullPointerException
> > > 	at
> > >
> >
> org.apache.maven.project.inheritance.DefaultModelInheritanceAssembler.assembleModelInheritance(DefaultModelInheritanceAssembler.java:37)
> > > 	at
> > >
> >
> org.apache.maven.project.DefaultMavenProjectBuilder.build(DefaultMavenProjectBuilder.java:142)
> > > 	... 27 more
> > > [surefire] Running org.apache.maven.plugin.OgnlProjectValueExtractorTest
> > > [surefire] Tests run: 5, Failures: 0, Errors: 5, Time elapsed: 0.044 sec
> > > <<<<<<<< FAILURE !! 
> > > [surefire] Running org.apache.maven.plugin.PluginTest
> > > [surefire] Tests run: 1, Failures: 0, Errors: 0, Time elapsed: 0.022 sec
> > > org.apache.maven.project.ProjectBuildingException: Error building project
> > > from
> > >
> >
> /home/users/jvanzyl/m2-build/maven-components/maven-core/src/test/resources/projects/base-directory-alignment/project-which-needs-directory-alignment.xml
> > > 	at
> > >
> >
> org.apache.maven.project.DefaultMavenProjectBuilder.build(DefaultMavenProjectBuilder.java:200)
> > > 	at
> > >
> >
> org.apache.maven.project.ProjectBaseDirectoryAlignmentTest.testProjectDirectoryBaseDirectoryAlignment(ProjectBaseDirectoryAlignmentTest.java:20)
> > > 	at sun.reflect.NativeMethodAccessorImpl.invoke0(Native Method)
> > > 	at
> > >
> > sun.reflect.NativeMethodAccessorImpl.invoke(NativeMethodAccessorImpl.java:39)
> > > 	at
> > >
> >
> sun.reflect.DelegatingMethodAccessorImpl.invoke(DelegatingMethodAccessorImpl.java:25)
> > > 	at java.lang.reflect.Method.invoke(Method.java:324)
> > > 	at junit.framework.TestCase.runTest(TestCase.java:154)
> > > 	at junit.framework.TestCase.runBare(TestCase.java:127)
> > > 	at junit.framework.TestResult$1.protect(TestResult.java:106)
> > > 	at junit.framework.TestResult.runProtected(TestResult.java:124)
> > > 	at junit.framework.TestResult.run(TestResult.java:109)
> > > 	at junit.framework.TestCase.run(TestCase.java:118)
> > > 	at junit.framework.TestSuite.runTest(TestSuite.java:208)
> > > 	at junit.framework.TestSuite.run(TestSuite.java:203)
> > > 	at sun.reflect.NativeMethodAccessorImpl.invoke0(Native Method)
> > > 	at
> > >
> > sun.reflect.NativeMethodAccessorImpl.invoke(NativeMethodAccessorImpl.java:39)
> > > 	at
> > >
> >
> sun.reflect.DelegatingMethodAccessorImpl.invoke(DelegatingMethodAccessorImpl.java:25)
> > > 	at java.lang.reflect.Method.invoke(Method.java:324)
> > > 	at
> > > org.codehaus.surefire.battery.JUnitBattery.execute(JUnitBattery.java:161)
> > > 	at org.codehaus.surefire.Surefire.executeBattery(Surefire.java:149)
> > > 	at org.codehaus.surefire.Surefire.run(Surefire.java:103)
> > > 	at org.codehaus.surefire.Surefire.run(Surefire.java:55)
> > > 	at sun.reflect.NativeMethodAccessorImpl.invoke0(Native Method)
> > > 	at
> > >
> > sun.reflect.NativeMethodAccessorImpl.invoke(NativeMethodAccessorImpl.java:39)
> > > 	at
> > >
> >
> sun.reflect.DelegatingMethodAccessorImpl.invoke(DelegatingMethodAccessorImpl.java:25)
> > > 	at java.lang.reflect.Method.invoke(Method.java:324)
> > > 	at SurefireBooter.run(SurefireBooter.java:70)
> > > 	at SurefirePlugin.execute(SurefirePlugin.java:36)
> > > 	at MBoot.runTests(MBoot.java:709)
> > > 	at MBoot.buildProject(MBoot.java:507)
> > > 	at MBoot.run(MBoot.java:216)
> > > 	at MBoot.main(MBoot.java:139)
> > > Caused by: java.lang.NullPointerException
> > > 	at
> > >
> >
> org.apache.maven.project.inheritance.DefaultModelInheritanceAssembler.assembleModelInheritance(DefaultModelInheritanceAssembler.java:37)
> > > 	at
> > >
> >
> org.apache.maven.project.DefaultMavenProjectBuilder.build(DefaultMavenProjectBuilder.java:142)
> > > 	... 31 more
> > > [surefire] Running
> > > org.apache.maven.project.ProjectBaseDirectoryAlignmentTest
> > > [surefire] Tests run: 1, Failures: 0, Errors: 1, Time elapsed: 0.043 sec
> > > <<<<<<<< FAILURE !! 
> > > org.apache.maven.project.ProjectBuildingException: Error building project
> > > from
> > >
> >
> /home/users/jvanzyl/m2-build/maven-components/maven-core/src/test/resources/inheritance-repo/t00/maven/poms/p4-1.0.pom
> > > 	at
> > >
> >
> org.apache.maven.project.DefaultMavenProjectBuilder.build(DefaultMavenProjectBuilder.java:200)
> > > 	at
> > >
> >
> org.apache.maven.project.DefaultMavenProjectBuilder.build(DefaultMavenProjectBuilder.java:96)
> > > 	at
> > >
> >
> org.apache.maven.project.inheritance.t00.ProjectInheritanceTest.testProjectInheritance(ProjectInheritanceTest.java:39)
> > > 	at sun.reflect.NativeMethodAccessorImpl.invoke0(Native Method)
> > > 	at
> > >
> > sun.reflect.NativeMethodAccessorImpl.invoke(NativeMethodAccessorImpl.java:39)
> > > 	at
> > >
> >
> sun.reflect.DelegatingMethodAccessorImpl.invoke(DelegatingMethodAccessorImpl.java:25)
> > > 	at java.lang.reflect.Method.invoke(Method.java:324)
> > > 	at junit.framework.TestCase.runTest(TestCase.java:154)
> > > 	at junit.framework.TestCase.runBare(TestCase.java:127)
> > > 	at junit.framework.TestResult$1.protect(TestResult.java:106)
> > > 	at junit.framework.TestResult.runProtected(TestResult.java:124)
> > > 	at junit.framework.TestResult.run(TestResult.java:109)
> > > 	at junit.framework.TestCase.run(TestCase.java:118)
> > > 	at junit.framework.TestSuite.runTest(TestSuite.java:208)
> > > 	at junit.framework.TestSuite.run(TestSuite.java:203)
> > > 	at sun.reflect.NativeMethodAccessorImpl.invoke0(Native Method)
> > > 	at
> > >
> > sun.reflect.NativeMethodAccessorImpl.invoke(NativeMethodAccessorImpl.java:39)
> > > 	at
> > >
> >
> sun.reflect.DelegatingMethodAccessorImpl.invoke(DelegatingMethodAccessorImpl.java:25)
> > > 	at java.lang.reflect.Method.invoke(Method.java:324)
> > > 	at
> > > org.codehaus.surefire.battery.JUnitBattery.execute(JUnitBattery.java:161)
> > > 	at org.codehaus.surefire.Surefire.executeBattery(Surefire.java:149)
> > > 	at org.codehaus.surefire.Surefire.run(Surefire.java:103)
> > > 	at org.codehaus.surefire.Surefire.run(Surefire.java:55)
> > > 	at sun.reflect.NativeMethodAccessorImpl.invoke0(Native Method)
> > > 	at
> > >
> > sun.reflect.NativeMethodAccessorImpl.invoke(NativeMethodAccessorImpl.java:39)
> > > 	at
> > >
> >
> sun.reflect.DelegatingMethodAccessorImpl.invoke(DelegatingMethodAccessorImpl.java:25)
> > > 	at java.lang.reflect.Method.invoke(Method.java:324)
> > > 	at SurefireBooter.run(SurefireBooter.java:70)
> > > 	at SurefirePlugin.execute(SurefirePlugin.java:36)
> > > 	at MBoot.runTests(MBoot.java:709)
> > > 	at MBoot.buildProject(MBoot.java:507)
> > > 	at MBoot.run(MBoot.java:216)
> > > 	at MBoot.main(MBoot.java:139)
> > > Caused by: java.lang.NullPointerException
> > > 	at
> > >
> >
> org.apache.maven.project.inheritance.DefaultModelInheritanceAssembler.assembleModelInheritance(DefaultModelInheritanceAssembler.java:37)
> > > 	at
> > >
> >
> org.apache.maven.project.DefaultMavenProjectBuilder.build(DefaultMavenProjectBuilder.java:142)
> > > 	... 32 more
> > > [surefire] Running
> > > org.apache.maven.project.inheritance.t00.ProjectInheritanceTest
> > > [surefire] Tests run: 1, Failures: 0, Errors: 1, Time elapsed: 0.105 sec
> > > <<<<<<<< FAILURE !! 
> > > org.apache.maven.project.ProjectBuildingException: Error building project
> > > from
> > >
> >
> /home/users/jvanzyl/m2-build/maven-components/maven-core/src/test/resources/inheritance-repo/t01/maven/poms/p0-1.0.pom
> > > 	at
> > >
> >
> org.apache.maven.project.DefaultMavenProjectBuilder.build(DefaultMavenProjectBuilder.java:200)
> > > 	at
> > >
> >
> org.apache.maven.project.DefaultMavenProjectBuilder.build(DefaultMavenProjectBuilder.java:96)
> > > 	at
> > >
> >
> org.apache.maven.project.inheritance.t01.ProjectInheritanceTest.testProjectInheritance(ProjectInheritanceTest.java:42)
> > > 	at sun.reflect.NativeMethodAccessorImpl.invoke0(Native Method)
> > > 	at
> > >
> > sun.reflect.NativeMethodAccessorImpl.invoke(NativeMethodAccessorImpl.java:39)
> > > 	at
> > >
> >
> sun.reflect.DelegatingMethodAccessorImpl.invoke(DelegatingMethodAccessorImpl.java:25)
> > > 	at java.lang.reflect.Method.invoke(Method.java:324)
> > > 	at junit.framework.TestCase.runTest(TestCase.java:154)
> > > 	at junit.framework.TestCase.runBare(TestCase.java:127)
> > > 	at junit.framework.TestResult$1.protect(TestResult.java:106)
> > > 	at junit.framework.TestResult.runProtected(TestResult.java:124)
> > > 	at junit.framework.TestResult.run(TestResult.java:109)
> > > 	at junit.framework.TestCase.run(TestCase.java:118)
> > > 	at junit.framework.TestSuite.runTest(TestSuite.java:208)
> > > 	at junit.framework.TestSuite.run(TestSuite.java:203)
> > > 	at sun.reflect.NativeMethodAccessorImpl.invoke0(Native Method)
> > > 	at
> > >
> > sun.reflect.NativeMethodAccessorImpl.invoke(NativeMethodAccessorImpl.java:39)
> > > 	at
> > >
> >
> sun.reflect.DelegatingMethodAccessorImpl.invoke(DelegatingMethodAccessorImpl.java:25)
> > > 	at java.lang.reflect.Method.invoke(Method.java:324)
> > > 	at
> > > org.codehaus.surefire.battery.JUnitBattery.execute(JUnitBattery.java:161)
> > > 	at org.codehaus.surefire.Surefire.executeBattery(Surefire.java:149)
> > > 	at org.codehaus.surefire.Surefire.run(Surefire.java:103)
> > > 	at org.codehaus.surefire.Surefire.run(Surefire.java:55)
> > > 	at sun.reflect.NativeMethodAccessorImpl.invoke0(Native Method)
> > > 	at
> > >
> > sun.reflect.NativeMethodAccessorImpl.invoke(NativeMethodAccessorImpl.java:39)
> > > 	at
> > >
> >
> sun.reflect.DelegatingMethodAccessorImpl.invoke(DelegatingMethodAccessorImpl.java:25)
> > > 	at java.lang.reflect.Method.invoke(Method.java:324)
> > > 	at SurefireBooter.run(SurefireBooter.java:70)
> > > 	at SurefirePlugin.execute(SurefirePlugin.java:36)
> > > 	at MBoot.runTests(MBoot.java:709)
> > > 	at MBoot.buildProject(MBoot.java:507)
> > > 	at MBoot.run(MBoot.java:216)
> > > 	at MBoot.main(MBoot.java:139)
> > > Caused by: java.lang.NullPointerException
> > > 	at
> > >
> >
> org.apache.maven.project.inheritance.DefaultModelInheritanceAssembler.assembleModelInheritance(DefaultModelInheritanceAssembler.java:37)
> > > 	at
> > >
> >
> org.apache.maven.project.DefaultMavenProjectBuilder.build(DefaultMavenProjectBuilder.java:142)
> > > 	... 32 more
> > > [surefire] Running
> > > org.apache.maven.project.inheritance.t01.ProjectInheritanceTest
> > > [surefire] Tests run: 1, Failures: 0, Errors: 1, Time elapsed: 0.081 sec
> > > <<<<<<<< FAILURE !! 
> > > [surefire] Running
> > > org.apache.maven.project.validation.DefaultModelValidatorTest
> > > [surefire] Tests run: 5, Failures: 0, Errors: 0, Time elapsed: 0.031 sec
> > > There are no test to run.
> > > 
> > > Resume :
> > > [surefire] Tests run: 35, Failures: 0, Errors: 13
> > > 
> > > Exception in thread "main" java.lang.Exception: Tests error
> > > 	at MBoot.runTests(MBoot.java:713)
> > > 	at MBoot.buildProject(MBoot.java:507)
> > > 	at MBoot.run(MBoot.java:216)
> > > 	at MBoot.main(MBoot.java:139)
> > > 
> > > Creating m2 distribution for public consumption:
> > > http://www.codehaus.org/~jvanzyl/m2/m2-20040717.170700.tar.gz
> > > 
> > 
> > 

-- 
jvz.

Jason van Zyl
jason@maven.org
http://maven.apache.org

happiness is like a butterfly: the more you chase it, the more it will
elude you, but if you turn your attention to other things, it will come
and sit softly on your shoulder ...

 -- Thoreau 


Mime
View raw message