maven-m2-dev mailing list archives

Site index · List index
Message view « Date » · « Thread »
Top « Date » · « Thread »
From jvan...@maven.org
Subject [maven2 build] Mon Jul 26 12:07:00 EDT 2004
Date Mon, 26 Jul 2004 16:09:18 GMT

Performing an update of maven-components ...

Updates occured, build required ...

P maven-core/src/main/java/org/apache/maven/project/DefaultMavenProjectBuilder.java
P maven-core/src/main/resources/META-INF/plexus/components.xml
P maven-core/src/test/java/org/apache/maven/plugin/OgnlProjectValueExtractorTest.java

-----------------------------------------------------------------------
 Building mboot ... 
-----------------------------------------------------------------------
-----------------------------------------------------------------------
Maven MBoot
-----------------------------------------------------------------------
Installing mboot in /home/users/jvanzyl/mboot ...
-----------------------------------------------------------------------
Installing MBoot dependencies ... 
-----------------------------------------------------------------------
-----------------------------------------------------------------------
 Install the parent pom for all maven-component artifacts ... 
-----------------------------------------------------------------------
Installing POM in /home/users/jvanzyl/maven-repo-local/maven/poms/maven-component-2.0-SNAPSHOT.pom
-----------------------------------------------------------------------
 Building maven-model ... 
-----------------------------------------------------------------------
Generating java in target/generated-sources from maven.mdo
Generating xpp3 unmarshaller in target/generated-sources from maven.mdo
Generating xpp3 marshaller in target/generated-sources from maven.mdo
Generating java in target/generated-sources from maven.mdo
Generating xpp3 unmarshaller in target/generated-sources from maven.mdo
Generating xpp3 marshaller in target/generated-sources from maven.mdo
Generating xml schema in . from maven.mdo
Generating xdoc in target/generated-xdocs from maven.mdo
Building project in /home/users/jvanzyl/m2-build/maven-components/maven-model
Using the following for your maven.repo.local: /home/users/jvanzyl/maven-repo-local
Downloading dependency: plexus/jars/plexus-0.14-SNAPSHOT.jar
Downloading dependency: xstream/jars/xstream-1.0-SNAPSHOT.jar
Downloading dependency: classworlds/jars/classworlds-1.1-SNAPSHOT.jar
Building tests in /home/users/jvanzyl/m2-build/maven-components/maven-model
Running tests in /home/users/jvanzyl/m2-build/maven-components/maven-model

-------------------------------------------------------
 T E S T S
-------------------------------------------------------
There are no test to run.

Resume :
[surefire] Tests run: 0, Failures: 0, Errors: 0

Building jars (maven-model-2.0-SNAPSHOT.jar) in /home/users/jvanzyl/m2-build/maven-components/maven-model/target
Installing maven-model-2.0-SNAPSHOT.jar in /home/users/jvanzyl/maven-repo-local/maven/jars
Installing POM in /home/users/jvanzyl/maven-repo-local/maven/poms/maven-model-2.0-SNAPSHOT.pom
-----------------------------------------------------------------------
 Building maven-artifact ... 
-----------------------------------------------------------------------
Building project in /home/users/jvanzyl/m2-build/maven-components/maven-artifact
Using the following for your maven.repo.local: /home/users/jvanzyl/maven-repo-local
Downloading dependency: plexus/jars/plexus-0.14-SNAPSHOT.jar
Downloading dependency: xstream/jars/xstream-1.0-SNAPSHOT.jar
Downloading dependency: classworlds/jars/classworlds-1.1-SNAPSHOT.jar
Downloading dependency: maven/jars/maven-model-2.0-SNAPSHOT.jar
Downloading dependency: maven/jars/wagon-api-0.9-SNAPSHOT.jar
Building tests in /home/users/jvanzyl/m2-build/maven-components/maven-artifact
Running tests in /home/users/jvanzyl/m2-build/maven-components/maven-artifact

-------------------------------------------------------
 T E S T S
-------------------------------------------------------
Created temporary local repository: ./target/temp-repo-local
[INFO] Trying to download: /maven-test/jars/maven-test-b-1.0.jar  from file://dummy
[INFO] /maven-test/jars/maven-test-b-1.0.jar was not found in file://dummy
[INFO] Trying to download: /maven-test/jars/maven-test-b-1.0.jar  from file:///home/users/jvanzyl/m2-build/maven-components/maven-artifact/./target/test-classes/remote-repo-1
[INFO] Actual md5  : a5c3b5cd0605bb7331d1846cdc14b13b
[INFO] Expected md5: a5c3b5cd0605bb7331d1846cdc14b13b
[INFO] md5 is valid: true
[INFO] Trying to download: /maven-test/jars/maven-test-z-1.0.jar  from file://dummy
[INFO] /maven-test/jars/maven-test-z-1.0.jar was not found in file://dummy
[INFO] Trying to download: /maven-test/jars/maven-test-z-1.0.jar  from file:///home/users/jvanzyl/m2-build/maven-components/maven-artifact/./target/test-classes/remote-repo-1
[INFO] /maven-test/jars/maven-test-z-1.0.jar was not found in file:///home/users/jvanzyl/m2-build/maven-components/maven-artifact/./target/test-classes/remote-repo-1
[INFO] Trying to download: /maven-test/jars/maven-test-z-1.0.jar  from file:///home/users/jvanzyl/m2-build/maven-components/maven-artifact/./target/test-classes/remote-repo-2
[INFO] Actual md5  : d3b07384d113edec49eaa6238ad5ff00
[INFO] Expected md5: null
[INFO] md5 is valid: false
[INFO] Trying to download: /bizzare/jars/maven-test-b-1.0.jar  from file://dummy
[INFO] /bizzare/jars/maven-test-b-1.0.jar was not found in file://dummy
[INFO] Trying to download: /bizzare/jars/maven-test-b-1.0.jar  from file:///home/users/jvanzyl/m2-build/maven-components/maven-artifact/./target/test-classes/remote-repo-1
[INFO] /bizzare/jars/maven-test-b-1.0.jar was not found in file:///home/users/jvanzyl/m2-build/maven-components/maven-artifact/./target/test-classes/remote-repo-1
[INFO] Trying to download: /bizzare/jars/maven-test-b-1.0.jar  from file:///home/users/jvanzyl/m2-build/maven-components/maven-artifact/./target/test-classes/remote-repo-2
[INFO] /bizzare/jars/maven-test-b-1.0.jar was not found in file:///home/users/jvanzyl/m2-build/maven-components/maven-artifact/./target/test-classes/remote-repo-2
[surefire] Running org.apache.maven.artifact.downloader.DefaultArtifactDownloaderTest
[surefire] Tests run: 1, Failures: 0, Errors: 0, Time elapsed: 1.195 sec
[surefire] Running org.apache.maven.artifact.resolver.DefaultArtifactResolverTest
[surefire] Tests run: 1, Failures: 0, Errors: 0, Time elapsed: 0.071 sec
[INFO] Trying to download: /snapshot-test/jars/maven-snapshot-a-1.0-SNAPSHOT.jar  from file:///home/users/jvanzyl/m2-build/maven-components/maven-artifact/./target/test-classes/remote-repo-1
[INFO] Actual md5  : 2c18e486683a3db1e645ad8523223b72
[INFO] Expected md5: null
[INFO] md5 is valid: false
[surefire] Running org.apache.maven.artifact.snapshot.DefaultSnapshotResolverTest
[surefire] Tests run: 1, Failures: 0, Errors: 0, Time elapsed: 0.07 sec
There are no test to run.

Resume :
[surefire] Tests run: 3, Failures: 0, Errors: 0

Building jars (maven-artifact-2.0-SNAPSHOT.jar) in /home/users/jvanzyl/m2-build/maven-components/maven-artifact/target
Installing maven-artifact-2.0-SNAPSHOT.jar in /home/users/jvanzyl/maven-repo-local/maven/jars
Installing POM in /home/users/jvanzyl/maven-repo-local/maven/poms/maven-artifact-2.0-SNAPSHOT.pom
-----------------------------------------------------------------------
 Building maven-plugin ... 
-----------------------------------------------------------------------
Building project in /home/users/jvanzyl/m2-build/maven-components/maven-plugin
Using the following for your maven.repo.local: /home/users/jvanzyl/maven-repo-local
Downloading dependency: plexus/jars/plexus-0.14-SNAPSHOT.jar
Downloading dependency: xstream/jars/xstream-1.0-SNAPSHOT.jar
Downloading dependency: classworlds/jars/classworlds-1.1-SNAPSHOT.jar
Downloading dependency: modello/jars/modello-1.0-SNAPSHOT.jar
Building tests in /home/users/jvanzyl/m2-build/maven-components/maven-plugin
Running tests in /home/users/jvanzyl/m2-build/maven-components/maven-plugin

-------------------------------------------------------
 T E S T S
-------------------------------------------------------
[surefire] Running org.apache.maven.plugin.generator.jelly.JellyHarnessGeneratorTest
[surefire] Tests run: 1, Failures: 0, Errors: 0, Time elapsed: 0.165 sec
[surefire] Running org.apache.maven.plugin.generator.BeanGeneratorTest
[surefire] Tests run: 1, Failures: 0, Errors: 0, Time elapsed: 0.104 sec
[surefire] Running org.apache.maven.plugin.generator.PluginDescriptorGeneratorTest
[surefire] Tests run: 1, Failures: 0, Errors: 0, Time elapsed: 0.129 sec
[surefire] Running org.apache.maven.plugin.generator.PluginXdocGeneratorTest
[surefire] Tests run: 1, Failures: 0, Errors: 0, Time elapsed: 0.011 sec
[surefire] Running org.apache.maven.plugin.BeanTest
[surefire] Tests run: 1, Failures: 0, Errors: 0, Time elapsed: 0.006 sec
[surefire] Running org.apache.maven.plugin.TestPluginTest
[surefire] Tests run: 1, Failures: 0, Errors: 0, Time elapsed: 0 sec
There are no test to run.

Resume :
[surefire] Tests run: 6, Failures: 0, Errors: 0

Building jars (maven-plugin-2.0-SNAPSHOT.jar) in /home/users/jvanzyl/m2-build/maven-components/maven-plugin/target
Installing maven-plugin-2.0-SNAPSHOT.jar in /home/users/jvanzyl/maven-repo-local/maven/jars
Installing POM in /home/users/jvanzyl/maven-repo-local/maven/poms/maven-plugin-2.0-SNAPSHOT.pom
-----------------------------------------------------------------------
 Building maven-core ... 
-----------------------------------------------------------------------
Building project in /home/users/jvanzyl/m2-build/maven-components/maven-core
Using the following for your maven.repo.local: /home/users/jvanzyl/maven-repo-local
Downloading dependency: plexus/jars/plexus-0.14-SNAPSHOT.jar
Downloading dependency: xstream/jars/xstream-1.0-SNAPSHOT.jar
Downloading dependency: classworlds/jars/classworlds-1.1-SNAPSHOT.jar
Downloading dependency: maven/jars/maven-model-2.0-SNAPSHOT.jar
Downloading dependency: maven/jars/maven-artifact-2.0-SNAPSHOT.jar
Downloading dependency: maven/jars/maven-plugin-2.0-SNAPSHOT.jar
Downloading dependency: plexus/jars/plexus-i18n-1.0-beta-2-SNAPSHOT.jar
Downloading dependency: maven/jars/wagon-api-0.9-SNAPSHOT.jar
Downloading dependency: maven/jars/wagon-http-lightweight-0.9-SNAPSHOT.jar
Downloading dependency: maven/jars/wagon-ssh-0.9-SNAPSHOT.jar
Building tests in /home/users/jvanzyl/m2-build/maven-components/maven-core
Running tests in /home/users/jvanzyl/m2-build/maven-components/maven-core

-------------------------------------------------------
 T E S T S
-------------------------------------------------------
[INFO] Trying to download: /maven-test/poms/maven-test-z-1.0.pom  from file://dummy
[INFO] /maven-test/poms/maven-test-z-1.0.pom was not found in file://dummy
[WARNING] Version conflict: maven-test:maven-test-d:jar, using version: 1.1, found version:
1.2
[surefire] Running org.apache.maven.artifact.collector.DefaultArtifactCollectorTest
[surefire] Tests run: 1, Failures: 0, Errors: 0, Time elapsed: 0.493 sec
[surefire] Running org.apache.maven.artifact.installer.DefaultArtifactInstallerTest
[surefire] Tests run: 1, Failures: 0, Errors: 0, Time elapsed: 0.055 sec
[surefire] Running org.apache.maven.project.ProjectBaseDirectoryAlignmentTest
[surefire] Tests run: 1, Failures: 0, Errors: 0, Time elapsed: 0.081 sec
[surefire] Running org.apache.maven.project.inheritance.t00.ProjectInheritanceTest
[surefire] Tests run: 1, Failures: 0, Errors: 0, Time elapsed: 0.151 sec
[surefire] Running org.apache.maven.project.inheritance.t01.ProjectInheritanceTest
[surefire] Tests run: 1, Failures: 0, Errors: 0, Time elapsed: 0.319 sec
[surefire] Running org.apache.maven.project.validation.DefaultModelValidatorTest
[surefire] Tests run: 5, Failures: 0, Errors: 0, Time elapsed: 0.033 sec
[surefire] Running org.apache.maven.MavenTest
[surefire] Tests run: 1, Failures: 0, Errors: 0, Time elapsed: 0.049 sec
[surefire] Running org.apache.maven.lifecycle.phase.GoalDecorationPhaseTest
[surefire] Tests run: 2, Failures: 0, Errors: 0, Time elapsed: 0.039 sec
Resolved goals: [t1:preGoal, t1:main, t1:postGoal]
Resolved goals: [t2:prereq, t2:main]
Resolved goals: [t3:preGoal, t3:prereq, t3:main, t3:postGoal]
Resolved goals: [t4:prereq-preGoal, t4:prereq, t4:prereq-postGoal, t4:main]
Resolved goals: [t5:prereq, t5:preGoal, t5:main]
[surefire] Running org.apache.maven.lifecycle.phase.GoalResolutionPhaseTest
[surefire] Tests run: 5, Failures: 0, Errors: 0, Time elapsed: 0.029 sec
[surefire] Running org.apache.maven.lifecycle.MavenLifecycleManagerTest
[surefire] Tests run: 1, Failures: 0, Errors: 0, Time elapsed: 0.029 sec
org.apache.maven.project.ProjectBuildingException: Error building project from ./pom.xml
	at org.apache.maven.project.DefaultMavenProjectBuilder.build(DefaultMavenProjectBuilder.java:134)
	at org.apache.maven.project.DefaultMavenProjectBuilder.build(DefaultMavenProjectBuilder.java:84)
	at org.apache.maven.plugin.OgnlProjectValueExtractorTest.setUp(OgnlProjectValueExtractorTest.java:33)
	at junit.framework.TestCase.runBare(TestCase.java:125)
	at junit.framework.TestResult$1.protect(TestResult.java:106)
	at junit.framework.TestResult.runProtected(TestResult.java:124)
	at junit.framework.TestResult.run(TestResult.java:109)
	at junit.framework.TestCase.run(TestCase.java:118)
	at junit.framework.TestSuite.runTest(TestSuite.java:208)
	at junit.framework.TestSuite.run(TestSuite.java:203)
	at sun.reflect.NativeMethodAccessorImpl.invoke0(Native Method)
	at sun.reflect.NativeMethodAccessorImpl.invoke(NativeMethodAccessorImpl.java:39)
	at sun.reflect.DelegatingMethodAccessorImpl.invoke(DelegatingMethodAccessorImpl.java:25)
	at java.lang.reflect.Method.invoke(Method.java:324)
	at org.codehaus.surefire.battery.JUnitBattery.execute(JUnitBattery.java:161)
	at org.codehaus.surefire.Surefire.executeBattery(Surefire.java:149)
	at org.codehaus.surefire.Surefire.run(Surefire.java:103)
	at org.codehaus.surefire.Surefire.run(Surefire.java:55)
	at sun.reflect.NativeMethodAccessorImpl.invoke0(Native Method)
	at sun.reflect.NativeMethodAccessorImpl.invoke(NativeMethodAccessorImpl.java:39)
	at sun.reflect.DelegatingMethodAccessorImpl.invoke(DelegatingMethodAccessorImpl.java:25)
	at java.lang.reflect.Method.invoke(Method.java:324)
	at org.codehaus.surefire.SurefireBooter.run(SurefireBooter.java:69)
	at org.codehaus.surefire.SurefireBooter.main(SurefireBooter.java:169)
Caused by: org.apache.maven.project.ProjectBuildingException: Missing parent POM. 
	at org.apache.maven.project.DefaultMavenProjectBuilder.findParentModel(DefaultMavenProjectBuilder.java:238)
	at org.apache.maven.project.DefaultMavenProjectBuilder.assembleLineage(DefaultMavenProjectBuilder.java:168)
	at org.apache.maven.project.DefaultMavenProjectBuilder.build(DefaultMavenProjectBuilder.java:96)
	... 23 more
org.apache.maven.project.ProjectBuildingException: Error building project from ./pom.xml
	at org.apache.maven.project.DefaultMavenProjectBuilder.build(DefaultMavenProjectBuilder.java:134)
	at org.apache.maven.project.DefaultMavenProjectBuilder.build(DefaultMavenProjectBuilder.java:84)
	at org.apache.maven.plugin.OgnlProjectValueExtractorTest.setUp(OgnlProjectValueExtractorTest.java:33)
	at junit.framework.TestCase.runBare(TestCase.java:125)
	at junit.framework.TestResult$1.protect(TestResult.java:106)
	at junit.framework.TestResult.runProtected(TestResult.java:124)
	at junit.framework.TestResult.run(TestResult.java:109)
	at junit.framework.TestCase.run(TestCase.java:118)
	at junit.framework.TestSuite.runTest(TestSuite.java:208)
	at junit.framework.TestSuite.run(TestSuite.java:203)
	at sun.reflect.NativeMethodAccessorImpl.invoke0(Native Method)
	at sun.reflect.NativeMethodAccessorImpl.invoke(NativeMethodAccessorImpl.java:39)
	at sun.reflect.DelegatingMethodAccessorImpl.invoke(DelegatingMethodAccessorImpl.java:25)
	at java.lang.reflect.Method.invoke(Method.java:324)
	at org.codehaus.surefire.battery.JUnitBattery.execute(JUnitBattery.java:161)
	at org.codehaus.surefire.Surefire.executeBattery(Surefire.java:149)
	at org.codehaus.surefire.Surefire.run(Surefire.java:103)
	at org.codehaus.surefire.Surefire.run(Surefire.java:55)
	at sun.reflect.NativeMethodAccessorImpl.invoke0(Native Method)
	at sun.reflect.NativeMethodAccessorImpl.invoke(NativeMethodAccessorImpl.java:39)
	at sun.reflect.DelegatingMethodAccessorImpl.invoke(DelegatingMethodAccessorImpl.java:25)
	at java.lang.reflect.Method.invoke(Method.java:324)
	at org.codehaus.surefire.SurefireBooter.run(SurefireBooter.java:69)
	at org.codehaus.surefire.SurefireBooter.main(SurefireBooter.java:169)
Caused by: org.apache.maven.project.ProjectBuildingException: Missing parent POM. 
	at org.apache.maven.project.DefaultMavenProjectBuilder.findParentModel(DefaultMavenProjectBuilder.java:238)
	at org.apache.maven.project.DefaultMavenProjectBuilder.assembleLineage(DefaultMavenProjectBuilder.java:168)
	at org.apache.maven.project.DefaultMavenProjectBuilder.build(DefaultMavenProjectBuilder.java:96)
	... 23 more
org.apache.maven.project.ProjectBuildingException: Error building project from ./pom.xml
	at org.apache.maven.project.DefaultMavenProjectBuilder.build(DefaultMavenProjectBuilder.java:134)
	at org.apache.maven.project.DefaultMavenProjectBuilder.build(DefaultMavenProjectBuilder.java:84)
	at org.apache.maven.plugin.OgnlProjectValueExtractorTest.setUp(OgnlProjectValueExtractorTest.java:33)
	at junit.framework.TestCase.runBare(TestCase.java:125)
	at junit.framework.TestResult$1.protect(TestResult.java:106)
	at junit.framework.TestResult.runProtected(TestResult.java:124)
	at junit.framework.TestResult.run(TestResult.java:109)
	at junit.framework.TestCase.run(TestCase.java:118)
	at junit.framework.TestSuite.runTest(TestSuite.java:208)
	at junit.framework.TestSuite.run(TestSuite.java:203)
	at sun.reflect.NativeMethodAccessorImpl.invoke0(Native Method)
	at sun.reflect.NativeMethodAccessorImpl.invoke(NativeMethodAccessorImpl.java:39)
	at sun.reflect.DelegatingMethodAccessorImpl.invoke(DelegatingMethodAccessorImpl.java:25)
	at java.lang.reflect.Method.invoke(Method.java:324)
	at org.codehaus.surefire.battery.JUnitBattery.execute(JUnitBattery.java:161)
	at org.codehaus.surefire.Surefire.executeBattery(Surefire.java:149)
	at org.codehaus.surefire.Surefire.run(Surefire.java:103)
	at org.codehaus.surefire.Surefire.run(Surefire.java:55)
	at sun.reflect.NativeMethodAccessorImpl.invoke0(Native Method)
	at sun.reflect.NativeMethodAccessorImpl.invoke(NativeMethodAccessorImpl.java:39)
	at sun.reflect.DelegatingMethodAccessorImpl.invoke(DelegatingMethodAccessorImpl.java:25)
	at java.lang.reflect.Method.invoke(Method.java:324)
	at org.codehaus.surefire.SurefireBooter.run(SurefireBooter.java:69)
	at org.codehaus.surefire.SurefireBooter.main(SurefireBooter.java:169)
Caused by: org.apache.maven.project.ProjectBuildingException: Missing parent POM. 
	at org.apache.maven.project.DefaultMavenProjectBuilder.findParentModel(DefaultMavenProjectBuilder.java:238)
	at org.apache.maven.project.DefaultMavenProjectBuilder.assembleLineage(DefaultMavenProjectBuilder.java:168)
	at org.apache.maven.project.DefaultMavenProjectBuilder.build(DefaultMavenProjectBuilder.java:96)
	... 23 more
org.apache.maven.project.ProjectBuildingException: Error building project from ./pom.xml
	at org.apache.maven.project.DefaultMavenProjectBuilder.build(DefaultMavenProjectBuilder.java:134)
	at org.apache.maven.project.DefaultMavenProjectBuilder.build(DefaultMavenProjectBuilder.java:84)
	at org.apache.maven.plugin.OgnlProjectValueExtractorTest.setUp(OgnlProjectValueExtractorTest.java:33)
	at junit.framework.TestCase.runBare(TestCase.java:125)
	at junit.framework.TestResult$1.protect(TestResult.java:106)
	at junit.framework.TestResult.runProtected(TestResult.java:124)
	at junit.framework.TestResult.run(TestResult.java:109)
	at junit.framework.TestCase.run(TestCase.java:118)
	at junit.framework.TestSuite.runTest(TestSuite.java:208)
	at junit.framework.TestSuite.run(TestSuite.java:203)
	at sun.reflect.NativeMethodAccessorImpl.invoke0(Native Method)
	at sun.reflect.NativeMethodAccessorImpl.invoke(NativeMethodAccessorImpl.java:39)
	at sun.reflect.DelegatingMethodAccessorImpl.invoke(DelegatingMethodAccessorImpl.java:25)
	at java.lang.reflect.Method.invoke(Method.java:324)
	at org.codehaus.surefire.battery.JUnitBattery.execute(JUnitBattery.java:161)
	at org.codehaus.surefire.Surefire.executeBattery(Surefire.java:149)
	at org.codehaus.surefire.Surefire.run(Surefire.java:103)
	at org.codehaus.surefire.Surefire.run(Surefire.java:55)
	at sun.reflect.NativeMethodAccessorImpl.invoke0(Native Method)
	at sun.reflect.NativeMethodAccessorImpl.invoke(NativeMethodAccessorImpl.java:39)
	at sun.reflect.DelegatingMethodAccessorImpl.invoke(DelegatingMethodAccessorImpl.java:25)
	at java.lang.reflect.Method.invoke(Method.java:324)
	at org.codehaus.surefire.SurefireBooter.run(SurefireBooter.java:69)
	at org.codehaus.surefire.SurefireBooter.main(SurefireBooter.java:169)
Caused by: org.apache.maven.project.ProjectBuildingException: Missing parent POM. 
	at org.apache.maven.project.DefaultMavenProjectBuilder.findParentModel(DefaultMavenProjectBuilder.java:238)
	at org.apache.maven.project.DefaultMavenProjectBuilder.assembleLineage(DefaultMavenProjectBuilder.java:168)
	at org.apache.maven.project.DefaultMavenProjectBuilder.build(DefaultMavenProjectBuilder.java:96)
	... 23 more
[surefire] Running org.apache.maven.plugin.OgnlProjectValueExtractorTest
[surefire] Tests run: 4, Failures: 0, Errors: 4, Time elapsed: 0.046 sec <<<<<<<<
FAILURE !! 
[surefire] Running org.apache.maven.plugin.PluginTest
[surefire] Tests run: 1, Failures: 0, Errors: 0, Time elapsed: 0.025 sec
[surefire] Running org.apache.maven.decoration.DefaultGoalDecoratorTest
[surefire] Tests run: 3, Failures: 0, Errors: 0, Time elapsed: 0 sec
[surefire] Running org.apache.maven.decoration.GoalDecorationParserTest
[surefire] Tests run: 5, Failures: 0, Errors: 0, Time elapsed: 0.001 sec
[surefire] Running org.apache.maven.decoration.GoalDecoratorBindingsTest
[surefire] Tests run: 7, Failures: 0, Errors: 0, Time elapsed: 0 sec
There are no test to run.

Resume :
[surefire] Tests run: 39, Failures: 0, Errors: 4

Building jars (maven-core-2.0-SNAPSHOT.jar) in /home/users/jvanzyl/m2-build/maven-components/maven-core/target
Installing maven-core-2.0-SNAPSHOT.jar in /home/users/jvanzyl/maven-repo-local/maven/jars
Installing POM in /home/users/jvanzyl/maven-repo-local/maven/poms/maven-core-2.0-SNAPSHOT.pom
Installing POM in /home/users/jvanzyl/maven-repo-local/maven/poms/maven-plugin-parent-2.0-SNAPSHOT.pom
-----------------------------------------------------------------------
 Building maven-clean-plugin plugin ... 
-----------------------------------------------------------------------
Generating plugin descriptor for maven-clean-plugin ...
Generating bean adapter for maven-clean-plugin ...
Generating Jelly harness for maven-clean-plugin ...
Building project in /home/users/jvanzyl/m2-build/maven-components/maven-plugins/maven-clean-plugin
Using the following for your maven.repo.local: /home/users/jvanzyl/maven-repo-local
Downloading dependency: maven/jars/maven-model-2.0-SNAPSHOT.jar
Downloading dependency: maven/jars/maven-plugin-2.0-SNAPSHOT.jar
Downloading dependency: maven/jars/wagon-api-0.9-SNAPSHOT.jar
Downloading dependency: plexus/jars/plexus-0.14-SNAPSHOT.jar
Downloading dependency: classworlds/jars/classworlds-1.1-SNAPSHOT.jar
Downloading dependency: xstream/jars/xstream-1.0-SNAPSHOT.jar
Building tests in /home/users/jvanzyl/m2-build/maven-components/maven-plugins/maven-clean-plugin
Running tests in /home/users/jvanzyl/m2-build/maven-components/maven-plugins/maven-clean-plugin

-------------------------------------------------------
 T E S T S
-------------------------------------------------------
There are no test to run.

Resume :
[surefire] Tests run: 0, Failures: 0, Errors: 0

Building jars (maven-clean-plugin-2.0-SNAPSHOT.jar) in /home/users/jvanzyl/m2-build/maven-components/maven-plugins/maven-clean-plugin/target
-----------------------------------------------------------------------
 Building maven-compiler-plugin plugin ... 
-----------------------------------------------------------------------
Generating plugin descriptor for maven-compiler-plugin ...
Generating bean adapter for maven-compiler-plugin ...
Generating Jelly harness for maven-compiler-plugin ...
Building project in /home/users/jvanzyl/m2-build/maven-components/maven-plugins/maven-compiler-plugin
Using the following for your maven.repo.local: /home/users/jvanzyl/maven-repo-local
Downloading dependency: maven/jars/maven-model-2.0-SNAPSHOT.jar
Downloading dependency: maven/jars/maven-plugin-2.0-SNAPSHOT.jar
Downloading dependency: maven/jars/wagon-api-0.9-SNAPSHOT.jar
Downloading dependency: plexus/jars/plexus-0.14-SNAPSHOT.jar
Downloading dependency: classworlds/jars/classworlds-1.1-SNAPSHOT.jar
Downloading dependency: xstream/jars/xstream-1.0-SNAPSHOT.jar
Building tests in /home/users/jvanzyl/m2-build/maven-components/maven-plugins/maven-compiler-plugin
Running tests in /home/users/jvanzyl/m2-build/maven-components/maven-plugins/maven-compiler-plugin

-------------------------------------------------------
 T E S T S
-------------------------------------------------------
There are no test to run.

Resume :
[surefire] Tests run: 0, Failures: 0, Errors: 0

Building jars (maven-compiler-plugin-1.0-SNAPSHOT.jar) in /home/users/jvanzyl/m2-build/maven-components/maven-plugins/maven-compiler-plugin/target
-----------------------------------------------------------------------
 Building maven-install-plugin plugin ... 
-----------------------------------------------------------------------
Generating plugin descriptor for maven-install-plugin ...
Generating bean adapter for maven-install-plugin ...
Generating Jelly harness for maven-install-plugin ...
Building project in /home/users/jvanzyl/m2-build/maven-components/maven-plugins/maven-install-plugin
Using the following for your maven.repo.local: /home/users/jvanzyl/maven-repo-local
Downloading dependency: maven/jars/maven-model-2.0-SNAPSHOT.jar
Downloading dependency: maven/jars/maven-plugin-2.0-SNAPSHOT.jar
Downloading dependency: maven/jars/wagon-api-0.9-SNAPSHOT.jar
Downloading dependency: plexus/jars/plexus-0.14-SNAPSHOT.jar
Downloading dependency: classworlds/jars/classworlds-1.1-SNAPSHOT.jar
Downloading dependency: xstream/jars/xstream-1.0-SNAPSHOT.jar
Downloading dependency: maven/jars/maven-core-2.0-SNAPSHOT.jar
Building tests in /home/users/jvanzyl/m2-build/maven-components/maven-plugins/maven-install-plugin
Running tests in /home/users/jvanzyl/m2-build/maven-components/maven-plugins/maven-install-plugin

-------------------------------------------------------
 T E S T S
-------------------------------------------------------
There are no test to run.

Resume :
[surefire] Tests run: 0, Failures: 0, Errors: 0

Building jars (maven-install-plugin-1.0-SNAPSHOT.jar) in /home/users/jvanzyl/m2-build/maven-components/maven-plugins/maven-install-plugin/target
-----------------------------------------------------------------------
 Building maven-jar-plugin plugin ... 
-----------------------------------------------------------------------
Generating plugin descriptor for maven-jar-plugin ...
Generating bean adapter for maven-jar-plugin ...
Generating Jelly harness for maven-jar-plugin ...
Building project in /home/users/jvanzyl/m2-build/maven-components/maven-plugins/maven-jar-plugin
Using the following for your maven.repo.local: /home/users/jvanzyl/maven-repo-local
Downloading dependency: maven/jars/maven-model-2.0-SNAPSHOT.jar
Downloading dependency: maven/jars/maven-plugin-2.0-SNAPSHOT.jar
Downloading dependency: maven/jars/wagon-api-0.9-SNAPSHOT.jar
Downloading dependency: plexus/jars/plexus-0.14-SNAPSHOT.jar
Downloading dependency: classworlds/jars/classworlds-1.1-SNAPSHOT.jar
Downloading dependency: xstream/jars/xstream-1.0-SNAPSHOT.jar
Downloading dependency: maven/jars/maven-artifact-2.0-SNAPSHOT.jar
Downloading dependency: maven/jars/maven-core-2.0-SNAPSHOT.jar
Building tests in /home/users/jvanzyl/m2-build/maven-components/maven-plugins/maven-jar-plugin
Running tests in /home/users/jvanzyl/m2-build/maven-components/maven-plugins/maven-jar-plugin

-------------------------------------------------------
 T E S T S
-------------------------------------------------------
There are no test to run.

Resume :
[surefire] Tests run: 0, Failures: 0, Errors: 0

Building jars (maven-jar-plugin-1.0-SNAPSHOT.jar) in /home/users/jvanzyl/m2-build/maven-components/maven-plugins/maven-jar-plugin/target
-----------------------------------------------------------------------
 Building maven-pom-plugin plugin ... 
-----------------------------------------------------------------------
Generating plugin descriptor for maven-pom-plugin ...
Generating bean adapter for maven-pom-plugin ...
Generating Jelly harness for maven-pom-plugin ...
Building project in /home/users/jvanzyl/m2-build/maven-components/maven-plugins/maven-pom-plugin
Using the following for your maven.repo.local: /home/users/jvanzyl/maven-repo-local
Downloading dependency: maven/jars/maven-model-2.0-SNAPSHOT.jar
Downloading dependency: maven/jars/maven-plugin-2.0-SNAPSHOT.jar
Downloading dependency: maven/jars/wagon-api-0.9-SNAPSHOT.jar
Downloading dependency: plexus/jars/plexus-0.14-SNAPSHOT.jar
Downloading dependency: classworlds/jars/classworlds-1.1-SNAPSHOT.jar
Downloading dependency: xstream/jars/xstream-1.0-SNAPSHOT.jar
Downloading dependency: maven/jars/maven-core-2.0-SNAPSHOT.jar
Building tests in /home/users/jvanzyl/m2-build/maven-components/maven-plugins/maven-pom-plugin
Running tests in /home/users/jvanzyl/m2-build/maven-components/maven-plugins/maven-pom-plugin

-------------------------------------------------------
 T E S T S
-------------------------------------------------------
There are no test to run.

Resume :
[surefire] Tests run: 0, Failures: 0, Errors: 0

Building jars (maven-pom-plugin-1.0-SNAPSHOT.jar) in /home/users/jvanzyl/m2-build/maven-components/maven-plugins/maven-pom-plugin/target
-----------------------------------------------------------------------
 Building maven-plugin-plugin plugin ... 
-----------------------------------------------------------------------
Generating plugin descriptor for maven-plugin-plugin ...
Generating bean adapter for maven-plugin-plugin ...
Generating Jelly harness for maven-plugin-plugin ...
Building project in /home/users/jvanzyl/m2-build/maven-components/maven-plugins/maven-plugin-plugin
Using the following for your maven.repo.local: /home/users/jvanzyl/maven-repo-local
Downloading dependency: maven/jars/maven-model-2.0-SNAPSHOT.jar
Downloading dependency: maven/jars/maven-plugin-2.0-SNAPSHOT.jar
Downloading dependency: maven/jars/wagon-api-0.9-SNAPSHOT.jar
Downloading dependency: plexus/jars/plexus-0.14-SNAPSHOT.jar
Downloading dependency: classworlds/jars/classworlds-1.1-SNAPSHOT.jar
Downloading dependency: xstream/jars/xstream-1.0-SNAPSHOT.jar
Downloading dependency: maven/jars/maven-core-2.0-SNAPSHOT.jar
Building tests in /home/users/jvanzyl/m2-build/maven-components/maven-plugins/maven-plugin-plugin
Running tests in /home/users/jvanzyl/m2-build/maven-components/maven-plugins/maven-plugin-plugin

-------------------------------------------------------
 T E S T S
-------------------------------------------------------
There are no test to run.

Resume :
[surefire] Tests run: 0, Failures: 0, Errors: 0

Building jars (maven-plugin-plugin-1.0-SNAPSHOT.jar) in /home/users/jvanzyl/m2-build/maven-components/maven-plugins/maven-plugin-plugin/target
-----------------------------------------------------------------------
 Building maven-resources-plugin plugin ... 
-----------------------------------------------------------------------
Generating plugin descriptor for maven-resources-plugin ...
Generating bean adapter for maven-resources-plugin ...
Generating Jelly harness for maven-resources-plugin ...
Building project in /home/users/jvanzyl/m2-build/maven-components/maven-plugins/maven-resources-plugin
Using the following for your maven.repo.local: /home/users/jvanzyl/maven-repo-local
Downloading dependency: maven/jars/maven-model-2.0-SNAPSHOT.jar
Downloading dependency: maven/jars/maven-plugin-2.0-SNAPSHOT.jar
Downloading dependency: maven/jars/wagon-api-0.9-SNAPSHOT.jar
Downloading dependency: plexus/jars/plexus-0.14-SNAPSHOT.jar
Downloading dependency: classworlds/jars/classworlds-1.1-SNAPSHOT.jar
Downloading dependency: xstream/jars/xstream-1.0-SNAPSHOT.jar
Downloading dependency: maven/jars/maven-core-2.0-SNAPSHOT.jar
Downloading dependency: maven/jars/maven-model-2.0-SNAPSHOT.jar
Building tests in /home/users/jvanzyl/m2-build/maven-components/maven-plugins/maven-resources-plugin
Running tests in /home/users/jvanzyl/m2-build/maven-components/maven-plugins/maven-resources-plugin

-------------------------------------------------------
 T E S T S
-------------------------------------------------------
There are no test to run.

Resume :
[surefire] Tests run: 0, Failures: 0, Errors: 0

Building jars (maven-resources-plugin-1.0-SNAPSHOT.jar) in /home/users/jvanzyl/m2-build/maven-components/maven-plugins/maven-resources-plugin/target
-----------------------------------------------------------------------
 Building maven-surefire-plugin plugin ... 
-----------------------------------------------------------------------
Generating plugin descriptor for maven-surefire-plugin ...
Generating bean adapter for maven-surefire-plugin ...
Generating Jelly harness for maven-surefire-plugin ...
Building project in /home/users/jvanzyl/m2-build/maven-components/maven-plugins/maven-surefire-plugin
Using the following for your maven.repo.local: /home/users/jvanzyl/maven-repo-local
Downloading dependency: maven/jars/maven-model-2.0-SNAPSHOT.jar
Downloading dependency: maven/jars/maven-plugin-2.0-SNAPSHOT.jar
Downloading dependency: maven/jars/wagon-api-0.9-SNAPSHOT.jar
Downloading dependency: plexus/jars/plexus-0.14-SNAPSHOT.jar
Downloading dependency: classworlds/jars/classworlds-1.1-SNAPSHOT.jar
Downloading dependency: xstream/jars/xstream-1.0-SNAPSHOT.jar
Building tests in /home/users/jvanzyl/m2-build/maven-components/maven-plugins/maven-surefire-plugin
Running tests in /home/users/jvanzyl/m2-build/maven-components/maven-plugins/maven-surefire-plugin

-------------------------------------------------------
 T E S T S
-------------------------------------------------------
There are no test to run.

Resume :
[surefire] Tests run: 0, Failures: 0, Errors: 0

Building jars (maven-surefire-plugin-1.0-SNAPSHOT.jar) in /home/users/jvanzyl/m2-build/maven-components/maven-plugins/maven-surefire-plugin/target
M2_HOME = /home/users/jvanzyl/m2

Running maven-core integration tests ...


The verifier needs to be built ... 

Building project in /home/users/jvanzyl/m2-build/maven-components/maven-core-it-verifier
Using the following for your maven.repo.local: /home/users/jvanzyl/maven-repo-local
Building tests in /home/users/jvanzyl/m2-build/maven-components/maven-core-it-verifier
Running tests in /home/users/jvanzyl/m2-build/maven-components/maven-core-it-verifier

-------------------------------------------------------
 T E S T S
-------------------------------------------------------
There are no test to run.

Resume :
[surefire] Tests run: 0, Failures: 0, Errors: 0

Building jars (maven-core-it-verifier-1.0.jar) in /home/users/jvanzyl/m2-build/maven-components/maven-core-it-verifier/target
Installing maven-core-it-verifier-1.0.jar in /home/users/jvanzyl/maven-repo-local/maven/jars
Installing POM in /home/users/jvanzyl/maven-repo-local/maven/poms/maven-core-it-verifier-1.0.pom
----------------------------------------------------------
Running integration test it0000 ...
----------------------------------------------------------
[INFO] [clean:clean]
Deleting directory /home/users/jvanzyl/m2-build/maven-components/maven-core-it/it0000/target
[INFO] Trying to download: /junit/poms/junit-3.8.1.pom  from http://www.ibiblio.org/maven
[INFO] /junit/poms/junit-3.8.1.pom was not found in http://www.ibiblio.org/maven
[INFO] [compiler:compile]
[INFO] [compiler:testCompile]
[INFO] [resources:resources]
[INFO] [resources:testResources]
[INFO] [surefire:test]

-------------------------------------------------------
 T E S T S
-------------------------------------------------------
[surefire] Running org.apache.maven.it0000.PersonTest
[surefire] Tests run: 1, Failures: 0, Errors: 0, Time elapsed: 0.002 sec
There are no test to run.

Resume :
[surefire] Tests run: 1, Failures: 0, Errors: 0

[INFO] [jar:jar]
[INFO] ----------------------------------------------------------------------------
[INFO] BUILD SUCCESSFUL
[INFO] ----------------------------------------------------------------------------
[INFO] Total time: 3 seconds
[INFO] Finished at: Mon Jul 26 12:09:00 EDT 2004
[INFO] Final Memory: 0M/2M
[INFO] ----------------------------------------------------------------------------
-----------------------------------------------------------------------------------> OK
----------------------------------------------------------
Running integration test it0001 ...
----------------------------------------------------------
[INFO] [clean:clean]
Deleting directory /home/users/jvanzyl/m2-build/maven-components/maven-core-it/it0001/target
[INFO] Trying to download: /junit/poms/junit-3.8.1.pom  from http://www.ibiblio.org/maven
[INFO] /junit/poms/junit-3.8.1.pom was not found in http://www.ibiblio.org/maven
[INFO] [compiler:compile]
[INFO] [compiler:testCompile]
[INFO] [resources:resources]
[INFO] [resources:testResources]
[INFO] [surefire:test]

-------------------------------------------------------
 T E S T S
-------------------------------------------------------
[surefire] Running org.apache.maven.it0001.PersonTest
[surefire] Tests run: 1, Failures: 0, Errors: 0, Time elapsed: 0.002 sec
There are no test to run.

Resume :
[surefire] Tests run: 1, Failures: 0, Errors: 0

[INFO] [jar:jar]
[INFO] ----------------------------------------------------------------------------
[INFO] BUILD SUCCESSFUL
[INFO] ----------------------------------------------------------------------------
[INFO] Total time: 1 seconds
[INFO] Finished at: Mon Jul 26 12:09:03 EDT 2004
[INFO] Final Memory: 0M/2M
[INFO] ----------------------------------------------------------------------------
-----------------------------------------------------------------------------------> OK
----------------------------------------------------------
Running integration test it0002 ...
----------------------------------------------------------

Removing maven-it-support-1.0.jar from the local repository so we can verify its downloading
...

[INFO] Trying to download: /maven/jars/maven-it-support-1.0.jar  from http://www.ibiblio.org/maven
[INFO] Actual md5  : a3b77a2bd0a230999598367ad8fc4f77
[INFO] Expected md5: a3b77a2bd0a230999598367ad8fc4f77
[INFO] md5 is valid: true
[INFO] [clean:clean]
Deleting directory /home/users/jvanzyl/m2-build/maven-components/maven-core-it/it0002/target
[INFO] Trying to download: /junit/poms/junit-3.8.1.pom  from http://www.ibiblio.org/maven
[INFO] /junit/poms/junit-3.8.1.pom was not found in http://www.ibiblio.org/maven
[INFO] Trying to download: /maven/poms/maven-it-support-1.0.pom  from http://www.ibiblio.org/maven
[INFO] /maven/poms/maven-it-support-1.0.pom was not found in http://www.ibiblio.org/maven
[INFO] [compiler:compile]
[INFO] [compiler:testCompile]
[INFO] [resources:resources]
[INFO] [resources:testResources]
[INFO] [surefire:test]

-------------------------------------------------------
 T E S T S
-------------------------------------------------------
[surefire] Running org.apache.maven.it0001.PersonTest
[surefire] Tests run: 1, Failures: 0, Errors: 0, Time elapsed: 0.002 sec
[surefire] Running org.apache.maven.it0002.PersonTest
[surefire] Tests run: 1, Failures: 0, Errors: 0, Time elapsed: 0 sec
There are no test to run.

Resume :
[surefire] Tests run: 2, Failures: 0, Errors: 0

[INFO] [jar:jar]
[INFO] ----------------------------------------------------------------------------
[INFO] BUILD SUCCESSFUL
[INFO] ----------------------------------------------------------------------------
[INFO] Total time: 3 seconds
[INFO] Finished at: Mon Jul 26 12:09:08 EDT 2004
[INFO] Final Memory: 0M/2M
[INFO] ----------------------------------------------------------------------------
-----------------------------------------------------------------------------------> OK
----------------------------------------------------------
Running integration test it0003 ...
----------------------------------------------------------

Removing maven-core-it0003-1.0.jar from the local repository so we can verify jar installation
...

[INFO] [clean:clean]
Deleting directory /home/users/jvanzyl/m2-build/maven-components/maven-core-it/it0003/target
[INFO] Trying to download: /junit/poms/junit-3.8.1.pom  from http://www.ibiblio.org/maven
[INFO] /junit/poms/junit-3.8.1.pom was not found in http://www.ibiblio.org/maven
[INFO] [compiler:compile]
[INFO] [compiler:testCompile]
[INFO] [resources:resources]
[INFO] [resources:testResources]
[INFO] [surefire:test]

-------------------------------------------------------
 T E S T S
-------------------------------------------------------
[surefire] Running org.apache.maven.it0003.PersonTest
[surefire] Tests run: 1, Failures: 0, Errors: 0, Time elapsed: 0.003 sec
There are no test to run.

Resume :
[surefire] Tests run: 1, Failures: 0, Errors: 0

[INFO] [jar:jar]
[INFO] [jar:install]
[INFO] Install jar file in /home/users/jvanzyl/maven-repo-local/maven/jars/maven-core-it0003-1.0.jar
[INFO] Install pom file in /home/users/jvanzyl/maven-repo-local/maven/poms/maven-core-it0003-1.0.pom
[INFO] ----------------------------------------------------------------------------
[INFO] BUILD SUCCESSFUL
[INFO] ----------------------------------------------------------------------------
[INFO] Total time: 1 seconds
[INFO] Finished at: Mon Jul 26 12:09:10 EDT 2004
[INFO] Final Memory: 0M/1M
[INFO] ----------------------------------------------------------------------------
-----------------------------------------------------------------------------------> OK
----------------------------------------------------------
Running integration test it0004 ...
----------------------------------------------------------

Removing maven-core-it0004-1.0.pom from the local repository so we can verify pom installation
...

[INFO] [clean:clean]
[INFO] [pom:install]
[INFO] Install pom file in /home/users/jvanzyl/maven-repo-local/maven/poms/maven-core-it0004-1.0.pom
[INFO] ----------------------------------------------------------------------------
[INFO] BUILD SUCCESSFUL
[INFO] ----------------------------------------------------------------------------
[INFO] Total time: 0 seconds
[INFO] Finished at: Mon Jul 26 12:09:12 EDT 2004
[INFO] Final Memory: 0M/1M
[INFO] ----------------------------------------------------------------------------
-----------------------------------------------------------------------------------> OK
----------------------------------------------------------
Running integration test it0005 ...
----------------------------------------------------------

Removing maven-core-it0005-1.0.pom from the local repository so we can verify pom installation
...

[INFO] [clean:clean]
[INFO] [pom:install]
[INFO] Install pom file in /home/users/jvanzyl/maven-repo-local/maven/poms/maven-core-it0005-1.0-SNAPSHOT.pom
[INFO] Install pom file in /home/users/jvanzyl/maven-repo-local/maven/poms/maven-core-it0005-1.0-SNAPSHOT.pom
[INFO] ----------------------------------------------------------------------------
[INFO] BUILD SUCCESSFUL
[INFO] ----------------------------------------------------------------------------
[INFO] Total time: 0 seconds
[INFO] Finished at: Mon Jul 26 12:09:14 EDT 2004
[INFO] Final Memory: 0M/1M
[INFO] ----------------------------------------------------------------------------
-----------------------------------------------------------------------------------> OK
----------------------------------------------------------
Running integration test it0006 ...
----------------------------------------------------------
[INFO] [clean:clean]
Deleting directory /home/users/jvanzyl/m2-build/maven-components/maven-core-it/it0006/target
[INFO] Trying to download: /junit/poms/junit-3.8.1.pom  from http://www.ibiblio.org/maven
[INFO] /junit/poms/junit-3.8.1.pom was not found in http://www.ibiblio.org/maven
[INFO] [clean:clean]
[INFO] [compiler:compile]
[INFO] [compiler:testCompile]
[INFO] [resources:resources]
[INFO] [resources:testResources]
[INFO] [surefire:test]

-------------------------------------------------------
 T E S T S
-------------------------------------------------------
[surefire] Running org.apache.maven.it0000.PersonTest
[surefire] Tests run: 1, Failures: 0, Errors: 0, Time elapsed: 0.005 sec
There are no test to run.

Resume :
[surefire] Tests run: 1, Failures: 0, Errors: 0

[INFO] [jar:jar]
[INFO] [jar:install]
[INFO] Install jar file in /home/users/jvanzyl/maven-repo-local/maven/jars/maven-core-it0006-1.0.jar
[INFO] Install pom file in /home/users/jvanzyl/maven-repo-local/maven/poms/maven-core-it0006-1.0.pom
[INFO] [compiler:testCompile]
[INFO] [resources:resources]
[INFO] [resources:testResources]
[INFO] [surefire:test]

-------------------------------------------------------
 T E S T S
-------------------------------------------------------
[surefire] Running org.apache.maven.it0000.PersonTest
[surefire] Tests run: 1, Failures: 0, Errors: 0, Time elapsed: 0.002 sec
There are no test to run.

Resume :
[surefire] Tests run: 1, Failures: 0, Errors: 0

[INFO] [jar:jar]
[INFO] ----------------------------------------------------------------------------
[INFO] BUILD SUCCESSFUL
[INFO] ----------------------------------------------------------------------------
[INFO] Total time: 2 seconds
[INFO] Finished at: Mon Jul 26 12:09:17 EDT 2004
[INFO] Final Memory: 0M/2M
[INFO] ----------------------------------------------------------------------------
-----------------------------------------------------------------------------------> OK

Creating m2 distribution for public consumption: http://www.codehaus.org/~jvanzyl/m2/m2-20040726.120700.tar.gz


Mime
View raw message