maven-m2-dev mailing list archives

Site index · List index
Message view « Date » · « Thread »
Top « Date » · « Thread »
From jvan...@maven.org
Subject [maven2 build] Thu Jun 24 10:36:37 EDT 2004
Date Thu, 24 Jun 2004 14:38:09 GMT

Performing a clean check out of maven-components ...

Updates occured, build required ...


-----------------------------------------------------------------------
 Building mboot ... 
-----------------------------------------------------------------------
-----------------------------------------------------------------------
Maven MBoot
-----------------------------------------------------------------------
Installing mboot in /home/users/jvanzyl/mboot ...
-----------------------------------------------------------------------
Installing MBoot dependencies ... 
-----------------------------------------------------------------------
-----------------------------------------------------------------------
 Install the parent pom for all maven-component artifacts ... 
-----------------------------------------------------------------------
Installing POM in /home/users/jvanzyl/maven-repo-local/maven/poms/maven-component-2.0-SNAPSHOT.pom
-----------------------------------------------------------------------
 Building maven-model ... 
-----------------------------------------------------------------------
Generating java in target/generated-sources from maven.mdo
Generating xpp3 unmarshaller in target/generated-sources from maven.mdo
Generating xpp3 marshaller in target/generated-sources from maven.mdo
Generating java in target/generated-sources from maven.mdo
Generating xpp3 unmarshaller in target/generated-sources from maven.mdo
Generating xpp3 marshaller in target/generated-sources from maven.mdo
Generating xml schema in . from maven.mdo
Generating xdoc in target/generated-xdocs from maven.mdo
Building project in /home/users/jvanzyl/m2-build/maven-components/maven-model
Using the following for your maven.repo.local: /home/users/jvanzyl/maven-repo-local
Downloading dependency: plexus/jars/plexus-0.14-SNAPSHOT.jar
....................................................................................................
.
Downloading dependency: classworlds/jars/classworlds-1.1-SNAPSHOT.jar
.........................
.
Building tests in /home/users/jvanzyl/m2-build/maven-components/maven-model
Running tests in /home/users/jvanzyl/m2-build/maven-components/maven-model

-------------------------------------------------------
T E S T S
-------------------------------------------------------
[surefire] Running org.codehaus.surefire.battery.DirectoryBattery
[surefire] Tests run: 0, Failures: 0, Errors: 0, Time elapsed: 0 sec
Building jars (maven-model-2.0-SNAPSHOT.jar) in /home/users/jvanzyl/m2-build/maven-components/maven-model/target
Installing maven-model-2.0-SNAPSHOT.jar in /home/users/jvanzyl/maven-repo-local/maven/jars
Installing POM in /home/users/jvanzyl/maven-repo-local/maven/poms/maven-model-2.0-SNAPSHOT.pom
-----------------------------------------------------------------------
 Building maven-artifact ... 
-----------------------------------------------------------------------
Building project in /home/users/jvanzyl/m2-build/maven-components/maven-artifact
Using the following for your maven.repo.local: /home/users/jvanzyl/maven-repo-local
Downloading dependency: maven/jars/wagon-api-0.9-SNAPSHOT.jar
................................
.
Building tests in /home/users/jvanzyl/m2-build/maven-components/maven-artifact
Running tests in /home/users/jvanzyl/m2-build/maven-components/maven-artifact

-------------------------------------------------------
T E S T S
-------------------------------------------------------
[surefire] Running org.codehaus.surefire.battery.DirectoryBattery
[surefire] Tests run: 0, Failures: 0, Errors: 0, Time elapsed: 0 sec
Created temporary local repository: ./target/temp-repo-local
[INFO] Trying to download: /maven-test/jars/maven-test-b-1.0.jar  from file://dummy
[INFO] /maven-test/jars/maven-test-b-1.0.jar was not found in file://dummy
[INFO] Trying to download: /maven-test/jars/maven-test-b-1.0.jar  from file:///home/users/jvanzyl/m2-build/maven-components/maven-artifact/./target/test-classes/remote-repo-1
[INFO] Actual md5  : a5c3b5cd0605bb7331d1846cdc14b13b
[INFO] Expected md5: a5c3b5cd0605bb7331d1846cdc14b13b
[INFO] md5 is valid: true
[INFO] Trying to download: /maven-test/jars/maven-test-z-1.0.jar  from file://dummy
[INFO] /maven-test/jars/maven-test-z-1.0.jar was not found in file://dummy
[INFO] Trying to download: /maven-test/jars/maven-test-z-1.0.jar  from file:///home/users/jvanzyl/m2-build/maven-components/maven-artifact/./target/test-classes/remote-repo-1
[INFO] /maven-test/jars/maven-test-z-1.0.jar was not found in file:///home/users/jvanzyl/m2-build/maven-components/maven-artifact/./target/test-classes/remote-repo-1
[INFO] Trying to download: /maven-test/jars/maven-test-z-1.0.jar  from file:///home/users/jvanzyl/m2-build/maven-components/maven-artifact/./target/test-classes/remote-repo-2
[INFO] Actual md5  : d3b07384d113edec49eaa6238ad5ff00
[INFO] Expected md5: null
[INFO] md5 is valid: false
[INFO] Trying to download: /bizzare/jars/maven-test-b-1.0.jar  from file://dummy
[INFO] /bizzare/jars/maven-test-b-1.0.jar was not found in file://dummy
[INFO] Trying to download: /bizzare/jars/maven-test-b-1.0.jar  from file:///home/users/jvanzyl/m2-build/maven-components/maven-artifact/./target/test-classes/remote-repo-1
[INFO] /bizzare/jars/maven-test-b-1.0.jar was not found in file:///home/users/jvanzyl/m2-build/maven-components/maven-artifact/./target/test-classes/remote-repo-1
[INFO] Trying to download: /bizzare/jars/maven-test-b-1.0.jar  from file:///home/users/jvanzyl/m2-build/maven-components/maven-artifact/./target/test-classes/remote-repo-2
[INFO] /bizzare/jars/maven-test-b-1.0.jar was not found in file:///home/users/jvanzyl/m2-build/maven-components/maven-artifact/./target/test-classes/remote-repo-2
[surefire] Running org.apache.maven.artifact.downloader.DefaultArtifactDownloaderTest
[surefire] Tests run: 1, Failures: 0, Errors: 0, Time elapsed: 0.462 sec
[surefire] Running org.apache.maven.artifact.resolver.DefaultArtifactResolverTest
[surefire] Tests run: 1, Failures: 0, Errors: 0, Time elapsed: 0.039 sec
[INFO] Trying to download: /snapshot-test/jars/maven-snapshot-a-1.0-SNAPSHOT.jar  from file:///home/users/jvanzyl/m2-build/maven-components/maven-artifact/./target/test-classes/remote-repo-1
[INFO] Actual md5  : 2c18e486683a3db1e645ad8523223b72
[INFO] Expected md5: null
[INFO] md5 is valid: false
[INFO] Trying to download: /snapshot-test/jars/maven-snapshot-c-1.0-SNAPSHOT.jar  from file:///home/users/jvanzyl/m2-build/maven-components/maven-artifact/./target/test-classes/remote-repo-1
[INFO] Actual md5  : 2c18e486683a3db1e645ad8523223b72
[INFO] Expected md5: null
[INFO] md5 is valid: false
[surefire] Running org.apache.maven.artifact.snapshot.DefaultSnapshotResolverTest
[surefire] Tests run: 1, Failures: 0, Errors: 0, Time elapsed: 0.05 sec
Building jars (maven-artifact-2.0-SNAPSHOT.jar) in /home/users/jvanzyl/m2-build/maven-components/maven-artifact/target
Installing maven-artifact-2.0-SNAPSHOT.jar in /home/users/jvanzyl/maven-repo-local/maven/jars
Installing POM in /home/users/jvanzyl/maven-repo-local/maven/poms/maven-artifact-2.0-SNAPSHOT.pom
-----------------------------------------------------------------------
 Building maven-plugin ... 
-----------------------------------------------------------------------
Building project in /home/users/jvanzyl/m2-build/maven-components/maven-plugin
Using the following for your maven.repo.local: /home/users/jvanzyl/maven-repo-local
Building tests in /home/users/jvanzyl/m2-build/maven-components/maven-plugin
Running tests in /home/users/jvanzyl/m2-build/maven-components/maven-plugin

-------------------------------------------------------
T E S T S
-------------------------------------------------------
[surefire] Running org.codehaus.surefire.battery.DirectoryBattery
[surefire] Tests run: 0, Failures: 0, Errors: 0, Time elapsed: 0 sec
[surefire] Running org.apache.maven.plugin.generator.jelly.JellyHarnessGeneratorTest
[surefire] Tests run: 1, Failures: 0, Errors: 0, Time elapsed: 0.136 sec
[surefire] Running org.apache.maven.plugin.generator.BeanGeneratorTest
[surefire] Tests run: 1, Failures: 0, Errors: 0, Time elapsed: 0.073 sec
[surefire] Running org.apache.maven.plugin.generator.PluginDescriptorGeneratorTest
[surefire] Tests run: 1, Failures: 0, Errors: 0, Time elapsed: 0.015 sec
[surefire] Running org.apache.maven.plugin.generator.PluginXdocGeneratorTest
[surefire] Tests run: 1, Failures: 0, Errors: 0, Time elapsed: 0.021 sec
[surefire] Running org.apache.maven.plugin.BeanTest
[surefire] Tests run: 1, Failures: 0, Errors: 0, Time elapsed: 0.004 sec
[surefire] Running org.apache.maven.plugin.TestPluginTest
[surefire] Tests run: 1, Failures: 0, Errors: 0, Time elapsed: 0 sec
Building jars (maven-plugin-2.0-SNAPSHOT.jar) in /home/users/jvanzyl/m2-build/maven-components/maven-plugin/target
Installing maven-plugin-2.0-SNAPSHOT.jar in /home/users/jvanzyl/maven-repo-local/maven/jars
Installing POM in /home/users/jvanzyl/maven-repo-local/maven/poms/maven-plugin-2.0-SNAPSHOT.pom
-----------------------------------------------------------------------
 Building maven-core ... 
-----------------------------------------------------------------------
Building project in /home/users/jvanzyl/m2-build/maven-components/maven-core
Using the following for your maven.repo.local: /home/users/jvanzyl/maven-repo-local
Downloading dependency: commons-cli/jars/commons-cli-1.0-beta-2.jar
....................
.
Downloading dependency: plexus/jars/plexus-i18n-1.0-beta-2-SNAPSHOT.jar
......
.
Downloading dependency: ognl/jars/ognl-2.5.1.jar
.....................................................................................................
.
Downloading dependency: marmalade/jars/marmalade-core-0.1.jar
....................................
.
Downloading dependency: marmalade/jars/marmalade-el-ognl-0.1.jar
.
.
Downloading dependency: tagalog/jars/tagalog-0.1.jar
......................
.
Downloading dependency: plexus/jars/plexus-compiler-api-1.0.jar
.....
.
Downloading dependency: plexus/jars/plexus-compiler-javac-1.0.jar
...
.
Downloading dependency: maven/jars/wagon-http-0.9-SNAPSHOT.jar
.....
.
Downloading dependency: commons-httpclient/jars/commons-httpclient-2.0-rc2.jar
...........................................................................................................................................
.
Downloading dependency: commons-logging/jars/commons-logging-1.0.3.jar
......................
.
Downloading dependency: commons-lang/jars/commons-lang-1.0.1.jar
............................................
.
src/main/java/org/apache/maven/project/MavenProject.java:400: cannot resolve symbol
symbol  : method setSiteAddress (java.lang.String)
location: class org.apache.maven.model.Model
        getModel().setSiteAddress( siteAddress );
                ^
src/main/java/org/apache/maven/project/MavenProject.java:405: cannot resolve symbol
symbol  : method getSiteAddress ()
location: class org.apache.maven.model.Model
        return getModel().getSiteAddress();
                       ^
src/main/java/org/apache/maven/project/MavenProject.java:410: cannot resolve symbol
symbol  : method setSiteDirectory (java.lang.String)
location: class org.apache.maven.model.Model
        getModel().setSiteDirectory( siteDirectory );
                ^
src/main/java/org/apache/maven/project/MavenProject.java:415: cannot resolve symbol
symbol  : method getSiteDirectory ()
location: class org.apache.maven.model.Model
        return getModel().getSiteDirectory();
                       ^
4 errors
Failed compiling classes!
cp: cannot stat `target/maven*.jar': No such file or directory
Installing POM in /home/users/jvanzyl/maven-repo-local/maven/poms/maven-plugin-parent-2.0-SNAPSHOT.pom
-----------------------------------------------------------------------
 Building maven-clean-plugin plugin ... 
-----------------------------------------------------------------------
Generating plugin descriptor for maven-clean-plugin ...
Generating bean adapter for maven-clean-plugin ...
Generating Jelly harness for maven-clean-plugin ...
Building project in /home/users/jvanzyl/m2-build/maven-components/maven-plugins/maven-clean-plugin
Using the following for your maven.repo.local: /home/users/jvanzyl/maven-repo-local
Building tests in /home/users/jvanzyl/m2-build/maven-components/maven-plugins/maven-clean-plugin
Running tests in /home/users/jvanzyl/m2-build/maven-components/maven-plugins/maven-clean-plugin

-------------------------------------------------------
T E S T S
-------------------------------------------------------
[surefire] Running org.codehaus.surefire.battery.DirectoryBattery
[surefire] Tests run: 0, Failures: 0, Errors: 0, Time elapsed: 0 sec
Building jars (maven-clean-plugin-2.0-SNAPSHOT.jar) in /home/users/jvanzyl/m2-build/maven-components/maven-plugins/maven-clean-plugin/target
-----------------------------------------------------------------------
 Building maven-compiler-plugin plugin ... 
-----------------------------------------------------------------------
Generating plugin descriptor for maven-compiler-plugin ...
Generating bean adapter for maven-compiler-plugin ...
Generating Jelly harness for maven-compiler-plugin ...
Building project in /home/users/jvanzyl/m2-build/maven-components/maven-plugins/maven-compiler-plugin
Using the following for your maven.repo.local: /home/users/jvanzyl/maven-repo-local
Building tests in /home/users/jvanzyl/m2-build/maven-components/maven-plugins/maven-compiler-plugin
Running tests in /home/users/jvanzyl/m2-build/maven-components/maven-plugins/maven-compiler-plugin

-------------------------------------------------------
T E S T S
-------------------------------------------------------
[surefire] Running org.codehaus.surefire.battery.DirectoryBattery
[surefire] Tests run: 0, Failures: 0, Errors: 0, Time elapsed: 0 sec
Building jars (maven-compiler-plugin-2.0-SNAPSHOT.jar) in /home/users/jvanzyl/m2-build/maven-components/maven-plugins/maven-compiler-plugin/target
-----------------------------------------------------------------------
 Building maven-install-plugin plugin ... 
-----------------------------------------------------------------------
Generating plugin descriptor for maven-install-plugin ...
Generating bean adapter for maven-install-plugin ...
Generating Jelly harness for maven-install-plugin ...
Building project in /home/users/jvanzyl/m2-build/maven-components/maven-plugins/maven-install-plugin
Using the following for your maven.repo.local: /home/users/jvanzyl/maven-repo-local
Downloading dependency: maven/jars/maven-core-2.0-SNAPSHOT.jar
..............................................................................................................
.
src/main/java/org/apache/maven/plugin/install/InstallMojo.java:22: package org.apache.maven.project
does not exist
import org.apache.maven.project.MavenProject;
                                ^
src/main/java/org/apache/maven/plugin/install/InstallMojo.java:23: cannot resolve symbol
symbol  : class MavenCore 
location: package maven
import org.apache.maven.MavenCore;
                        ^
target/generated-sources/org/apache/maven/plugin/install/InstallMojoBean.java:12: cannot resolve
symbol
symbol  : class MavenCore 
location: package maven
import org.apache.maven.MavenCore;
                        ^
target/generated-sources/org/apache/maven/plugin/install/InstallMojoBean.java:13: package
org.apache.maven.project does not exist
import org.apache.maven.project.MavenProject;
                                ^
target/generated-sources/org/apache/maven/plugin/install/InstallMojoBean.java:41: cannot resolve
symbol
symbol  : class MavenCore 
location: package maven
    public void setMavenCore(org.apache.maven.MavenCore mavenCore)
                                             ^
target/generated-sources/org/apache/maven/plugin/install/InstallMojoBean.java:51: package
org.apache.maven.project does not exist
    public void setProject(org.apache.maven.project.MavenProject project)
                                                   ^
src/main/java/org/apache/maven/plugin/install/InstallMojo.java:60: cannot resolve symbol
symbol  : class MavenProject 
location: class org.apache.maven.plugin.install.InstallMojo
        MavenProject project = (MavenProject) request.getParameter( "project" );
        ^
src/main/java/org/apache/maven/plugin/install/InstallMojo.java:60: cannot resolve symbol
symbol  : class MavenProject 
location: class org.apache.maven.plugin.install.InstallMojo
        MavenProject project = (MavenProject) request.getParameter( "project" );
                                ^
src/main/java/org/apache/maven/plugin/install/InstallMojo.java:64: cannot resolve symbol
symbol  : class MavenCore 
location: class org.apache.maven.plugin.install.InstallMojo
        MavenCore mavenCore = ( MavenCore ) request.getParameter( "mavenCore" );
        ^
src/main/java/org/apache/maven/plugin/install/InstallMojo.java:64: cannot resolve symbol
symbol  : class MavenCore 
location: class org.apache.maven.plugin.install.InstallMojo
        MavenCore mavenCore = ( MavenCore ) request.getParameter( "mavenCore" );
                                ^
10 errors
Failed compiling classes!
cp: cannot stat `../maven-plugins/maven-install-plugin/target/maven-install-plugin*.jar':
No such file or directory
-----------------------------------------------------------------------
 Building maven-jar-plugin plugin ... 
-----------------------------------------------------------------------
Generating plugin descriptor for maven-jar-plugin ...
Generating bean adapter for maven-jar-plugin ...
Generating Jelly harness for maven-jar-plugin ...
Building project in /home/users/jvanzyl/m2-build/maven-components/maven-plugins/maven-jar-plugin
Using the following for your maven.repo.local: /home/users/jvanzyl/maven-repo-local
src/main/java/org/apache/maven/plugin/jar/JarDeployMojo.java:22: package org.apache.maven.project
does not exist
import org.apache.maven.project.MavenProject;
                                ^
src/main/java/org/apache/maven/plugin/jar/JarDeployMojo.java:23: package org.apache.maven.artifact.installer
does not exist
import org.apache.maven.artifact.installer.ArtifactInstaller;
                                           ^
src/main/java/org/apache/maven/plugin/jar/JarDeployMojo.java:24: package org.apache.maven.artifact.deployer
does not exist
import org.apache.maven.artifact.deployer.ArtifactDeployer;
                                          ^
src/main/java/org/apache/maven/plugin/jar/JarInstallMojo.java:22: package org.apache.maven.project
does not exist
import org.apache.maven.project.MavenProject;
                                ^
src/main/java/org/apache/maven/plugin/jar/JarInstallMojo.java:23: package org.apache.maven.artifact.installer
does not exist
import org.apache.maven.artifact.installer.ArtifactInstaller;
                                           ^
target/generated-sources/org/apache/maven/plugin/jar/JarDeployMojoBean.java:12: package org.apache.maven.artifact.deployer
does not exist
import org.apache.maven.artifact.deployer.ArtifactDeployer;
                                          ^
target/generated-sources/org/apache/maven/plugin/jar/JarDeployMojoBean.java:13: package org.apache.maven.project
does not exist
import org.apache.maven.project.MavenProject;
                                ^
target/generated-sources/org/apache/maven/plugin/jar/JarDeployMojoBean.java:41: package org.apache.maven.artifact.deployer
does not exist
    public void setDeployer(org.apache.maven.artifact.deployer.ArtifactDeployer deployer)
                                                              ^
target/generated-sources/org/apache/maven/plugin/jar/JarDeployMojoBean.java:71: package org.apache.maven.project
does not exist
    public void setProject(org.apache.maven.project.MavenProject project)
                                                   ^
target/generated-sources/org/apache/maven/plugin/jar/JarInstallMojoBean.java:12: package org.apache.maven.artifact.installer
does not exist
import org.apache.maven.artifact.installer.ArtifactInstaller;
                                           ^
target/generated-sources/org/apache/maven/plugin/jar/JarInstallMojoBean.java:13: package org.apache.maven.project
does not exist
import org.apache.maven.project.MavenProject;
                                ^
target/generated-sources/org/apache/maven/plugin/jar/JarInstallMojoBean.java:41: package org.apache.maven.artifact.installer
does not exist
    public void setInstaller(org.apache.maven.artifact.installer.ArtifactInstaller installer)
                                                                ^
target/generated-sources/org/apache/maven/plugin/jar/JarInstallMojoBean.java:71: package org.apache.maven.project
does not exist
    public void setProject(org.apache.maven.project.MavenProject project)
                                                   ^
src/main/java/org/apache/maven/plugin/jar/JarDeployMojo.java:77: cannot resolve symbol
symbol  : class MavenProject 
location: class org.apache.maven.plugin.jar.JarDeployMojo
        MavenProject project = (MavenProject) request.getParameter( "project" );
        ^
src/main/java/org/apache/maven/plugin/jar/JarDeployMojo.java:77: cannot resolve symbol
symbol  : class MavenProject 
location: class org.apache.maven.plugin.jar.JarDeployMojo
        MavenProject project = (MavenProject) request.getParameter( "project" );
                                ^
src/main/java/org/apache/maven/plugin/jar/JarDeployMojo.java:79: cannot resolve symbol
symbol  : class ArtifactDeployer 
location: class org.apache.maven.plugin.jar.JarDeployMojo
        ArtifactDeployer artifactDeployer = (ArtifactDeployer) request.getParameter( "deployer"
);
        ^
src/main/java/org/apache/maven/plugin/jar/JarDeployMojo.java:79: cannot resolve symbol
symbol  : class ArtifactDeployer 
location: class org.apache.maven.plugin.jar.JarDeployMojo
        ArtifactDeployer artifactDeployer = (ArtifactDeployer) request.getParameter( "deployer"
);
                                             ^
src/main/java/org/apache/maven/plugin/jar/JarInstallMojo.java:76: cannot resolve symbol
symbol  : class MavenProject 
location: class org.apache.maven.plugin.jar.JarInstallMojo
        MavenProject project = (MavenProject) request.getParameter( "project" );
        ^
src/main/java/org/apache/maven/plugin/jar/JarInstallMojo.java:76: cannot resolve symbol
symbol  : class MavenProject 
location: class org.apache.maven.plugin.jar.JarInstallMojo
        MavenProject project = (MavenProject) request.getParameter( "project" );
                                ^
src/main/java/org/apache/maven/plugin/jar/JarInstallMojo.java:78: cannot resolve symbol
symbol  : class ArtifactInstaller 
location: class org.apache.maven.plugin.jar.JarInstallMojo
        ArtifactInstaller artifactInstaller = (ArtifactInstaller) request.getParameter( "installer"
);
        ^
src/main/java/org/apache/maven/plugin/jar/JarInstallMojo.java:78: cannot resolve symbol
symbol  : class ArtifactInstaller 
location: class org.apache.maven.plugin.jar.JarInstallMojo
        ArtifactInstaller artifactInstaller = (ArtifactInstaller) request.getParameter( "installer"
);
                                               ^
21 errors
Failed compiling classes!
cp: cannot stat `../maven-plugins/maven-jar-plugin/target/maven-jar-plugin*.jar': No such
file or directory
-----------------------------------------------------------------------
 Building maven-plugin-plugin plugin ... 
-----------------------------------------------------------------------
Generating plugin descriptor for maven-plugin-plugin ...
Generating bean adapter for maven-plugin-plugin ...
Generating Jelly harness for maven-plugin-plugin ...
Building project in /home/users/jvanzyl/m2-build/maven-components/maven-plugins/maven-plugin-plugin
Using the following for your maven.repo.local: /home/users/jvanzyl/maven-repo-local
Building tests in /home/users/jvanzyl/m2-build/maven-components/maven-plugins/maven-plugin-plugin
Running tests in /home/users/jvanzyl/m2-build/maven-components/maven-plugins/maven-plugin-plugin

-------------------------------------------------------
T E S T S
-------------------------------------------------------
[surefire] Running org.codehaus.surefire.battery.DirectoryBattery
[surefire] Tests run: 0, Failures: 0, Errors: 0, Time elapsed: 0 sec
Building jars (maven-plugin-plugin-1.0-SNAPSHOT.jar) in /home/users/jvanzyl/m2-build/maven-components/maven-plugins/maven-plugin-plugin/target
-----------------------------------------------------------------------
 Building maven-resources-plugin plugin ... 
-----------------------------------------------------------------------
Generating plugin descriptor for maven-resources-plugin ...
Generating bean adapter for maven-resources-plugin ...
Generating Jelly harness for maven-resources-plugin ...
Building project in /home/users/jvanzyl/m2-build/maven-components/maven-plugins/maven-resources-plugin
Using the following for your maven.repo.local: /home/users/jvanzyl/maven-repo-local
Building tests in /home/users/jvanzyl/m2-build/maven-components/maven-plugins/maven-resources-plugin
src/test/java/org/apache/maven/plugin/resources/ResourcesMojoTest.java:22: package org.apache.maven.project
does not exist
import org.apache.maven.project.MavenProjectBuilder;
                                ^
src/test/java/org/apache/maven/plugin/resources/ResourcesMojoTest.java:23: package org.apache.maven.project
does not exist
import org.apache.maven.project.MavenProject;
                                ^
src/test/java/org/apache/maven/plugin/resources/ResourcesMojoTest.java:83: cannot resolve
symbol
symbol  : class MavenProjectBuilder 
location: class org.apache.maven.plugin.resources.ResourcesMojoTest
        MavenProjectBuilder builder = (MavenProjectBuilder) embedder.lookup( MavenProjectBuilder.ROLE
);
        ^
src/test/java/org/apache/maven/plugin/resources/ResourcesMojoTest.java:83: cannot resolve
symbol
symbol  : class MavenProjectBuilder 
location: class org.apache.maven.plugin.resources.ResourcesMojoTest
        MavenProjectBuilder builder = (MavenProjectBuilder) embedder.lookup( MavenProjectBuilder.ROLE
);
                                       ^
src/test/java/org/apache/maven/plugin/resources/ResourcesMojoTest.java:83: cannot resolve
symbol
symbol  : variable MavenProjectBuilder 
location: class org.apache.maven.plugin.resources.ResourcesMojoTest
        MavenProjectBuilder builder = (MavenProjectBuilder) embedder.lookup( MavenProjectBuilder.ROLE
);
                                                                             ^
5 errors
Failed compiling test classes!
cp: cannot stat `../maven-plugins/maven-resources-plugin/target/maven-resources-plugin*.jar':
No such file or directory
-----------------------------------------------------------------------
 Building maven-surefire-plugin plugin ... 
-----------------------------------------------------------------------
Generating plugin descriptor for maven-surefire-plugin ...
Generating bean adapter for maven-surefire-plugin ...
Generating Jelly harness for maven-surefire-plugin ...
Building project in /home/users/jvanzyl/m2-build/maven-components/maven-plugins/maven-surefire-plugin
Using the following for your maven.repo.local: /home/users/jvanzyl/maven-repo-local
Building tests in /home/users/jvanzyl/m2-build/maven-components/maven-plugins/maven-surefire-plugin
Running tests in /home/users/jvanzyl/m2-build/maven-components/maven-plugins/maven-surefire-plugin

-------------------------------------------------------
T E S T S
-------------------------------------------------------
[surefire] Running org.codehaus.surefire.battery.DirectoryBattery
[surefire] Tests run: 0, Failures: 0, Errors: 0, Time elapsed: 0 sec
Building jars (maven-surefire-plugin-1.0-SNAPSHOT.jar) in /home/users/jvanzyl/m2-build/maven-components/maven-plugins/maven-surefire-plugin/target
M2_HOME = /home/users/jvanzyl/m2

Running maven-core integration tests ...


The verifier needs to be built ... 

Building project in /home/users/jvanzyl/m2-build/maven-components/maven-core-it-verifier
Using the following for your maven.repo.local: /home/users/jvanzyl/maven-repo-local
Building tests in /home/users/jvanzyl/m2-build/maven-components/maven-core-it-verifier
Running tests in /home/users/jvanzyl/m2-build/maven-components/maven-core-it-verifier

-------------------------------------------------------
T E S T S
-------------------------------------------------------
[surefire] Running org.codehaus.surefire.battery.DirectoryBattery
[surefire] Tests run: 0, Failures: 0, Errors: 0, Time elapsed: 0 sec
Building jars (maven-core-it-verifier-1.0.jar) in /home/users/jvanzyl/m2-build/maven-components/maven-core-it-verifier/target
Installing maven-core-it-verifier-1.0.jar in /home/users/jvanzyl/maven-repo-local/maven/jars
Installing POM in /home/users/jvanzyl/maven-repo-local/maven/poms/maven-core-it-verifier-1.0.pom
----------------------------------------------------------
Running integration test it0000 ...
----------------------------------------------------------
Exception in thread "main" java.lang.ClassNotFoundException: org.apache.maven.MavenCli
	at java.net.URLClassLoader$1.run(URLClassLoader.java:199)
	at java.security.AccessController.doPrivileged(Native Method)
	at java.net.URLClassLoader.findClass(URLClassLoader.java:187)
	at java.lang.ClassLoader.loadClass(ClassLoader.java:289)
	at sun.misc.Launcher$AppClassLoader.loadClass(Launcher.java:274)
	at java.lang.ClassLoader.loadClass(ClassLoader.java:235)
	at org.codehaus.classworlds.RealmClassLoader.loadClass(RealmClassLoader.java:101)
	at org.codehaus.classworlds.DefaultClassRealm.getClassFromRealm(DefaultClassRealm.java:202)
	at org.codehaus.classworlds.DefaultClassRealm.loadClass(DefaultClassRealm.java:194)
	at org.codehaus.classworlds.Launcher.getMainClass(Launcher.java:150)
	at org.codehaus.classworlds.Launcher.launchEnhanced(Launcher.java:325)
	at org.codehaus.classworlds.Launcher.launch(Launcher.java:288)
	at org.codehaus.classworlds.Launcher.main(Launcher.java:431)
Exception in thread "main" org.apache.maven.it.VerificationException: org.apache.maven.it.VerificationException:
Expected file was not found: ./target/classes/org/apache/maven/it0000/Person.class
	at org.apache.maven.it.Verifier.verify(Verifier.java:60)
	at org.apache.maven.it.Verifier.main(Verifier.java:165)
Caused by: org.apache.maven.it.VerificationException: Expected file was not found: ./target/classes/org/apache/maven/it0000/Person.class
	at org.apache.maven.it.Verifier.verifyExpectedResult(Verifier.java:113)
	at org.apache.maven.it.Verifier.verify(Verifier.java:55)
	... 1 more
----------------------------------------------------------
Running integration test it0001 ...
----------------------------------------------------------
Exception in thread "main" java.lang.ClassNotFoundException: org.apache.maven.MavenCli
	at java.net.URLClassLoader$1.run(URLClassLoader.java:199)
	at java.security.AccessController.doPrivileged(Native Method)
	at java.net.URLClassLoader.findClass(URLClassLoader.java:187)
	at java.lang.ClassLoader.loadClass(ClassLoader.java:289)
	at sun.misc.Launcher$AppClassLoader.loadClass(Launcher.java:274)
	at java.lang.ClassLoader.loadClass(ClassLoader.java:235)
	at org.codehaus.classworlds.RealmClassLoader.loadClass(RealmClassLoader.java:101)
	at org.codehaus.classworlds.DefaultClassRealm.getClassFromRealm(DefaultClassRealm.java:202)
	at org.codehaus.classworlds.DefaultClassRealm.loadClass(DefaultClassRealm.java:194)
	at org.codehaus.classworlds.Launcher.getMainClass(Launcher.java:150)
	at org.codehaus.classworlds.Launcher.launchEnhanced(Launcher.java:325)
	at org.codehaus.classworlds.Launcher.launch(Launcher.java:288)
	at org.codehaus.classworlds.Launcher.main(Launcher.java:431)
Exception in thread "main" org.apache.maven.it.VerificationException: org.apache.maven.it.VerificationException:
Expected file was not found: ./target/classes/org/apache/maven/it0001/Person.class
	at org.apache.maven.it.Verifier.verify(Verifier.java:60)
	at org.apache.maven.it.Verifier.main(Verifier.java:165)
Caused by: org.apache.maven.it.VerificationException: Expected file was not found: ./target/classes/org/apache/maven/it0001/Person.class
	at org.apache.maven.it.Verifier.verifyExpectedResult(Verifier.java:113)
	at org.apache.maven.it.Verifier.verify(Verifier.java:55)
	... 1 more
----------------------------------------------------------
Running integration test it0002 ...
----------------------------------------------------------

Removing maven-it-support-1.0.jar from the local repository so we can verify its downloading
...

Exception in thread "main" java.lang.ClassNotFoundException: org.apache.maven.MavenCli
	at java.net.URLClassLoader$1.run(URLClassLoader.java:199)
	at java.security.AccessController.doPrivileged(Native Method)
	at java.net.URLClassLoader.findClass(URLClassLoader.java:187)
	at java.lang.ClassLoader.loadClass(ClassLoader.java:289)
	at sun.misc.Launcher$AppClassLoader.loadClass(Launcher.java:274)
	at java.lang.ClassLoader.loadClass(ClassLoader.java:235)
	at org.codehaus.classworlds.RealmClassLoader.loadClass(RealmClassLoader.java:101)
	at org.codehaus.classworlds.DefaultClassRealm.getClassFromRealm(DefaultClassRealm.java:202)
	at org.codehaus.classworlds.DefaultClassRealm.loadClass(DefaultClassRealm.java:194)
	at org.codehaus.classworlds.Launcher.getMainClass(Launcher.java:150)
	at org.codehaus.classworlds.Launcher.launchEnhanced(Launcher.java:325)
	at org.codehaus.classworlds.Launcher.launch(Launcher.java:288)
	at org.codehaus.classworlds.Launcher.main(Launcher.java:431)
Exception in thread "main" org.apache.maven.it.VerificationException: org.apache.maven.it.VerificationException:
Expected file was not found: ./target/classes/org/apache/maven/it0002/Person.class
	at org.apache.maven.it.Verifier.verify(Verifier.java:60)
	at org.apache.maven.it.Verifier.main(Verifier.java:165)
Caused by: org.apache.maven.it.VerificationException: Expected file was not found: ./target/classes/org/apache/maven/it0002/Person.class
	at org.apache.maven.it.Verifier.verifyExpectedResult(Verifier.java:113)
	at org.apache.maven.it.Verifier.verify(Verifier.java:55)
	... 1 more
----------------------------------------------------------
Running integration test it0003 ...
----------------------------------------------------------

Removing maven-core-it0003-1.0.jar from the local repository so we can verify jar installation
...

Exception in thread "main" java.lang.ClassNotFoundException: org.apache.maven.MavenCli
	at java.net.URLClassLoader$1.run(URLClassLoader.java:199)
	at java.security.AccessController.doPrivileged(Native Method)
	at java.net.URLClassLoader.findClass(URLClassLoader.java:187)
	at java.lang.ClassLoader.loadClass(ClassLoader.java:289)
	at sun.misc.Launcher$AppClassLoader.loadClass(Launcher.java:274)
	at java.lang.ClassLoader.loadClass(ClassLoader.java:235)
	at org.codehaus.classworlds.RealmClassLoader.loadClass(RealmClassLoader.java:101)
	at org.codehaus.classworlds.DefaultClassRealm.getClassFromRealm(DefaultClassRealm.java:202)
	at org.codehaus.classworlds.DefaultClassRealm.loadClass(DefaultClassRealm.java:194)
	at org.codehaus.classworlds.Launcher.getMainClass(Launcher.java:150)
	at org.codehaus.classworlds.Launcher.launchEnhanced(Launcher.java:325)
	at org.codehaus.classworlds.Launcher.launch(Launcher.java:288)
	at org.codehaus.classworlds.Launcher.main(Launcher.java:431)
Exception in thread "main" org.apache.maven.it.VerificationException: org.apache.maven.it.VerificationException:
Expected file was not found: ./target/classes/org/apache/maven/it0003/Person.class
	at org.apache.maven.it.Verifier.verify(Verifier.java:60)
	at org.apache.maven.it.Verifier.main(Verifier.java:165)
Caused by: org.apache.maven.it.VerificationException: Expected file was not found: ./target/classes/org/apache/maven/it0003/Person.class
	at org.apache.maven.it.Verifier.verifyExpectedResult(Verifier.java:113)
	at org.apache.maven.it.Verifier.verify(Verifier.java:55)
	... 1 more

Creating m2 distribution for public consumption: http://www.codehaus.org/~jvanzyl/m2/m2-20043624.103637.tar.gz


Mime
View raw message