maven-m2-dev mailing list archives

Site index · List index
Message view « Date » · « Thread »
Top « Date » · « Thread »
From jvan...@maven.org
Subject [maven2 build] Wed Jun 16 00:07:00 EDT 2004
Date Wed, 16 Jun 2004 04:08:11 GMT

Performing an update of maven-components ...

Updates occured, build required ...

P ci.sh

-----------------------------------------------------------------------
 Building mboot ... 
-----------------------------------------------------------------------
-----------------------------------------------------------------------
Maven MBoot
-----------------------------------------------------------------------
Installing mboot in /home/users/jvanzyl/mboot ...
-----------------------------------------------------------------------
Installing MBoot dependencies ... 
-----------------------------------------------------------------------
-----------------------------------------------------------------------
 Install the parent pom for all maven-component artifacts ... 
-----------------------------------------------------------------------
Installing POM in /home/users/jvanzyl/maven-repo-local/maven/poms/maven-component-2.0-SNAPSHOT.pom
-----------------------------------------------------------------------
 Building maven-model ... 
-----------------------------------------------------------------------
Generating java in target/generated-sources from maven.mdo
Generating xpp3 unmarshaller in target/generated-sources from maven.mdo
Generating xpp3 marshaller in target/generated-sources from maven.mdo
Generating java in target/generated-sources from maven.mdo
Generating xpp3 unmarshaller in target/generated-sources from maven.mdo
Generating xpp3 marshaller in target/generated-sources from maven.mdo
Generating xml schema in . from maven.mdo
Generating xdoc in target/generated-xdocs from maven.mdo
Building project in /home/users/jvanzyl/m2-build/maven-components/maven-model
Using the following for your maven.repo.local: /home/users/jvanzyl/maven-repo-local
Building tests in /home/users/jvanzyl/m2-build/maven-components/maven-model
Running tests in /home/users/jvanzyl/m2-build/maven-components/maven-model

-------------------------------------------------------
T E S T S
-------------------------------------------------------
[surefire] Running org.codehaus.surefire.battery.DirectoryBattery
[surefire] Tests run: 0, Failures: 0, Errors: 0, Time elapsed: 0 sec
Building jars (maven-model-2.0-SNAPSHOT.jar) in /home/users/jvanzyl/m2-build/maven-components/maven-model/target
Installing maven-model-2.0-SNAPSHOT.jar in /home/users/jvanzyl/maven-repo-local/maven/jars
Installing POM in /home/users/jvanzyl/maven-repo-local/maven/poms/maven-model-2.0-SNAPSHOT.pom
-----------------------------------------------------------------------
 Building maven-artifact ... 
-----------------------------------------------------------------------
Building project in /home/users/jvanzyl/m2-build/maven-components/maven-artifact
Using the following for your maven.repo.local: /home/users/jvanzyl/maven-repo-local
Building tests in /home/users/jvanzyl/m2-build/maven-components/maven-artifact
Running tests in /home/users/jvanzyl/m2-build/maven-components/maven-artifact

-------------------------------------------------------
T E S T S
-------------------------------------------------------
[surefire] Running org.codehaus.surefire.battery.DirectoryBattery
[surefire] Tests run: 0, Failures: 0, Errors: 0, Time elapsed: 0 sec
Created temporary local repository: ./target/temp-repo-local
[INFO] Trying to download: /maven-test/jars/maven-test-b-1.0.jar  from file://dummy
[INFO] /maven-test/jars/maven-test-b-1.0.jar was not found in file://dummy
[INFO] Trying to download: /maven-test/jars/maven-test-b-1.0.jar  from file:///home/users/jvanzyl/m2-build/maven-components/maven-artifact/./target/test-classes/remote-repo-1
[INFO] Actual md5  : a5c3b5cd0605bb7331d1846cdc14b13b
[INFO] Expected md5: a5c3b5cd0605bb7331d1846cdc14b13b
[INFO] md5 is valid: true
[INFO] Trying to download: /maven-test/jars/maven-test-z-1.0.jar  from file://dummy
[INFO] /maven-test/jars/maven-test-z-1.0.jar was not found in file://dummy
[INFO] Trying to download: /maven-test/jars/maven-test-z-1.0.jar  from file:///home/users/jvanzyl/m2-build/maven-components/maven-artifact/./target/test-classes/remote-repo-1
[INFO] /maven-test/jars/maven-test-z-1.0.jar was not found in file:///home/users/jvanzyl/m2-build/maven-components/maven-artifact/./target/test-classes/remote-repo-1
[INFO] Trying to download: /maven-test/jars/maven-test-z-1.0.jar  from file:///home/users/jvanzyl/m2-build/maven-components/maven-artifact/./target/test-classes/remote-repo-2
[INFO] Actual md5  : d3b07384d113edec49eaa6238ad5ff00
[INFO] Expected md5: null
[INFO] md5 is valid: false
[INFO] Trying to download: /bizzare/jars/maven-test-b-1.0.jar  from file://dummy
[INFO] /bizzare/jars/maven-test-b-1.0.jar was not found in file://dummy
[INFO] Trying to download: /bizzare/jars/maven-test-b-1.0.jar  from file:///home/users/jvanzyl/m2-build/maven-components/maven-artifact/./target/test-classes/remote-repo-1
[INFO] /bizzare/jars/maven-test-b-1.0.jar was not found in file:///home/users/jvanzyl/m2-build/maven-components/maven-artifact/./target/test-classes/remote-repo-1
[INFO] Trying to download: /bizzare/jars/maven-test-b-1.0.jar  from file:///home/users/jvanzyl/m2-build/maven-components/maven-artifact/./target/test-classes/remote-repo-2
[INFO] /bizzare/jars/maven-test-b-1.0.jar was not found in file:///home/users/jvanzyl/m2-build/maven-components/maven-artifact/./target/test-classes/remote-repo-2
[surefire] Running org.apache.maven.artifact.downloader.DefaultArtifactDownloaderTest
[surefire] Tests run: 1, Failures: 0, Errors: 0, Time elapsed: 0.495 sec
[surefire] Running org.apache.maven.artifact.resolver.DefaultArtifactResolverTest
[surefire] Tests run: 1, Failures: 0, Errors: 0, Time elapsed: 0.053 sec
[INFO] Trying to download: /snapshot-test/jars/maven-snapshot-a-1.0-SNAPSHOT.jar  from file:///home/users/jvanzyl/m2-build/maven-components/maven-artifact/./target/test-classes/remote-repo-1
[INFO] Actual md5  : 2c18e486683a3db1e645ad8523223b72
[INFO] Expected md5: null
[INFO] md5 is valid: false
[surefire] Running org.apache.maven.artifact.snapshot.DefaultSnapshotResolverTest
[surefire] Tests run: 1, Failures: 0, Errors: 0, Time elapsed: 0.061 sec
Building jars (maven-artifact-2.0-SNAPSHOT.jar) in /home/users/jvanzyl/m2-build/maven-components/maven-artifact/target
Installing maven-artifact-2.0-SNAPSHOT.jar in /home/users/jvanzyl/maven-repo-local/maven/jars
Installing POM in /home/users/jvanzyl/maven-repo-local/maven/poms/maven-artifact-2.0-SNAPSHOT.pom
-----------------------------------------------------------------------
 Building maven-plugin ... 
-----------------------------------------------------------------------
Building project in /home/users/jvanzyl/m2-build/maven-components/maven-plugin
Using the following for your maven.repo.local: /home/users/jvanzyl/maven-repo-local
Building tests in /home/users/jvanzyl/m2-build/maven-components/maven-plugin
Running tests in /home/users/jvanzyl/m2-build/maven-components/maven-plugin

-------------------------------------------------------
T E S T S
-------------------------------------------------------
[surefire] Running org.codehaus.surefire.battery.DirectoryBattery
[surefire] Tests run: 0, Failures: 0, Errors: 0, Time elapsed: 0 sec
[surefire] Running org.apache.maven.plugin.generator.jelly.JellyHarnessGeneratorTest
[surefire] Tests run: 1, Failures: 0, Errors: 0, Time elapsed: 0.178 sec
[surefire] Running org.apache.maven.plugin.generator.BeanGeneratorTest
[surefire] Tests run: 1, Failures: 0, Errors: 0, Time elapsed: 0.059 sec
parameters.size() = 1
parameters.size() = 1
[surefire] Running org.apache.maven.plugin.generator.PluginDescriptorGeneratorTest
[surefire] Tests run: 1, Failures: 0, Errors: 0, Time elapsed: 0.048 sec
[surefire] Running org.apache.maven.plugin.generator.PluginXdocGeneratorTest
[surefire] Tests run: 1, Failures: 0, Errors: 0, Time elapsed: 0.018 sec
[surefire] Running org.apache.maven.plugin.BeanTest
[surefire] Tests run: 1, Failures: 0, Errors: 0, Time elapsed: 0.005 sec
[surefire] Running org.apache.maven.plugin.TestPluginTest
[surefire] Tests run: 1, Failures: 0, Errors: 0, Time elapsed: 0 sec
Building jars (maven-plugin-2.0-SNAPSHOT.jar) in /home/users/jvanzyl/m2-build/maven-components/maven-plugin/target
Installing maven-plugin-2.0-SNAPSHOT.jar in /home/users/jvanzyl/maven-repo-local/maven/jars
Installing POM in /home/users/jvanzyl/maven-repo-local/maven/poms/maven-plugin-2.0-SNAPSHOT.pom
-----------------------------------------------------------------------
 Building maven-core ... 
-----------------------------------------------------------------------
Building project in /home/users/jvanzyl/m2-build/maven-components/maven-core
Using the following for your maven.repo.local: /home/users/jvanzyl/maven-repo-local
Building tests in /home/users/jvanzyl/m2-build/maven-components/maven-core
Running tests in /home/users/jvanzyl/m2-build/maven-components/maven-core

-------------------------------------------------------
T E S T S
-------------------------------------------------------
[surefire] Running org.codehaus.surefire.battery.DirectoryBattery
[surefire] Tests run: 0, Failures: 0, Errors: 0, Time elapsed: 0 sec
error configuring resource: ./target/maven.home/plugins
[INFO] Trying to download: /maven-test/poms/maven-test-z-1.0.pom  from file://dummy
[INFO] /maven-test/poms/maven-test-z-1.0.pom was not found in file://dummy
[surefire] Running org.apache.maven.artifact.collector.DefaultArtifactCollectorTest
[surefire] Tests run: 1, Failures: 0, Errors: 0, Time elapsed: 0.711 sec
error configuring resource: ./target/maven.home/plugins
error configuring resource: ./target/maven.home/plugins
error configuring resource: ./target/maven.home/plugins
error configuring resource: ./target/maven.home/plugins
error configuring resource: ./target/maven.home/plugins
error configuring resource: ./target/maven.home/plugins
[surefire] Running org.apache.maven.project.DefaultProjectBuilderTest
[surefire] Tests run: 6, Failures: 0, Errors: 0, Time elapsed: 0.068 sec
error configuring resource: ./target/maven.home/plugins
error configuring resource: ./target/maven.home/plugins
error configuring resource: ./target/maven.home/plugins
[surefire] Running org.apache.maven.project.ProjectBaseDirectoryAlignmentTest
[surefire] Tests run: 3, Failures: 0, Errors: 0, Time elapsed: 0.078 sec
error configuring resource: ./target/maven.home/plugins
[surefire] Running org.apache.maven.project.ProjectReactorTest
[surefire] Tests run: 1, Failures: 0, Errors: 0, Time elapsed: 0.412 sec
error configuring resource: ./target/maven.home/plugins
error configuring resource: ./target/maven.home/plugins
error configuring resource: ./target/maven.home/plugins
error configuring resource: ./target/maven.home/plugins
[surefire] Running org.apache.maven.project.RecursiveProjectInheritanceTest
[surefire] Tests run: 4, Failures: 0, Errors: 0, Time elapsed: 0.153 sec
error configuring resource: ./target/maven.home/plugins
[surefire] Running org.apache.maven.MavenTest
[surefire] Tests run: 1, Failures: 0, Errors: 0, Time elapsed: 1.521 sec
error configuring resource: ./target/maven.home/plugins
[surefire] Running org.apache.maven.lifecycle.phase.GoalDecorationPhaseTest
[surefire] Tests run: 1, Failures: 0, Errors: 0, Time elapsed: 0.105 sec
error configuring resource: ./target/maven.home/plugins
[surefire] Running org.apache.maven.lifecycle.MavenLifecycleManagerTest
[surefire] Tests run: 1, Failures: 0, Errors: 0, Time elapsed: 0.03 sec
error configuring resource: ./target/maven.home/plugins
error configuring resource: ./target/maven.home/plugins
error configuring resource: ./target/maven.home/plugins
expected = /home/users/jvanzyl/m2-build/maven-components/maven-core/target/classes
actual = /home/users/jvanzyl/m2-build/maven-components/maven-core/target/classes
error configuring resource: ./target/maven.home/plugins
[surefire] Running org.apache.maven.plugin.OgnlProjectValueExtractorTest
[surefire] Tests run: 4, Failures: 0, Errors: 0, Time elapsed: 0.038 sec
error configuring resource: ./target/maven.home/plugins
[surefire] Running org.apache.maven.plugin.PluginTest
[surefire] Tests run: 1, Failures: 0, Errors: 0, Time elapsed: 0.03 sec
Building jars (maven-core-2.0-SNAPSHOT.jar) in /home/users/jvanzyl/m2-build/maven-components/maven-core/target
Installing maven-core-2.0-SNAPSHOT.jar in /home/users/jvanzyl/maven-repo-local/maven/jars
Installing POM in /home/users/jvanzyl/maven-repo-local/maven/poms/maven-core-2.0-SNAPSHOT.pom
Installing POM in /home/users/jvanzyl/maven-repo-local/maven/poms/maven-plugin-parent-2.0-SNAPSHOT.pom
-----------------------------------------------------------------------
 Building maven-clean-plugin plugin ... 
-----------------------------------------------------------------------
Generating plugin descriptor for maven-clean-plugin ...
parameters.size() = 1
Generating bean adapter for maven-clean-plugin ...
Generating Jelly harness for maven-clean-plugin ...
Building project in /home/users/jvanzyl/m2-build/maven-components/maven-plugins/maven-clean-plugin
Using the following for your maven.repo.local: /home/users/jvanzyl/maven-repo-local
Building tests in /home/users/jvanzyl/m2-build/maven-components/maven-plugins/maven-clean-plugin
Running tests in /home/users/jvanzyl/m2-build/maven-components/maven-plugins/maven-clean-plugin

-------------------------------------------------------
T E S T S
-------------------------------------------------------
[surefire] Running org.codehaus.surefire.battery.DirectoryBattery
[surefire] Tests run: 0, Failures: 0, Errors: 0, Time elapsed: 0 sec
Building jars (maven-clean-plugin-2.0-SNAPSHOT.jar) in /home/users/jvanzyl/m2-build/maven-components/maven-plugins/maven-clean-plugin/target
-----------------------------------------------------------------------
 Building maven-compiler-plugin plugin ... 
-----------------------------------------------------------------------
Generating plugin descriptor for maven-compiler-plugin ...
parameters.size() = 3
parameters.size() = 3
Generating bean adapter for maven-compiler-plugin ...
Generating Jelly harness for maven-compiler-plugin ...
Building project in /home/users/jvanzyl/m2-build/maven-components/maven-plugins/maven-compiler-plugin
Using the following for your maven.repo.local: /home/users/jvanzyl/maven-repo-local
Building tests in /home/users/jvanzyl/m2-build/maven-components/maven-plugins/maven-compiler-plugin
Running tests in /home/users/jvanzyl/m2-build/maven-components/maven-plugins/maven-compiler-plugin

-------------------------------------------------------
T E S T S
-------------------------------------------------------
[surefire] Running org.codehaus.surefire.battery.DirectoryBattery
[surefire] Tests run: 0, Failures: 0, Errors: 0, Time elapsed: 0 sec
Building jars (maven-compiler-plugin-2.0-SNAPSHOT.jar) in /home/users/jvanzyl/m2-build/maven-components/maven-plugins/maven-compiler-plugin/target
-----------------------------------------------------------------------
 Building maven-jar-plugin plugin ... 
-----------------------------------------------------------------------
Generating plugin descriptor for maven-jar-plugin ...
parameters.size() = 3
Generating bean adapter for maven-jar-plugin ...
Generating Jelly harness for maven-jar-plugin ...
Building project in /home/users/jvanzyl/m2-build/maven-components/maven-plugins/maven-jar-plugin
Using the following for your maven.repo.local: /home/users/jvanzyl/maven-repo-local
Building tests in /home/users/jvanzyl/m2-build/maven-components/maven-plugins/maven-jar-plugin
Running tests in /home/users/jvanzyl/m2-build/maven-components/maven-plugins/maven-jar-plugin

-------------------------------------------------------
T E S T S
-------------------------------------------------------
[surefire] Running org.codehaus.surefire.battery.DirectoryBattery
[surefire] Tests run: 0, Failures: 0, Errors: 0, Time elapsed: 0 sec
Building jars (maven-jar-plugin-1.0-SNAPSHOT.jar) in /home/users/jvanzyl/m2-build/maven-components/maven-plugins/maven-jar-plugin/target
-----------------------------------------------------------------------
 Building maven-plugin-plugin plugin ... 
-----------------------------------------------------------------------
Generating plugin descriptor for maven-plugin-plugin ...
Exception in thread "main" org.apache.maven.plugin.InvalidParameterException: The description
element in parameter # 1 is invalid. It cannot be null.
	at org.apache.maven.plugin.generator.AbstractGenerator.validateParameter(AbstractGenerator.java:130)
	at org.apache.maven.plugin.generator.AbstractGenerator.execute(AbstractGenerator.java:81)
	at org.apache.maven.plugin.generator.Main.main(Main.java:48)
Generating bean adapter for maven-plugin-plugin ...
Exception in thread "main" org.apache.maven.plugin.InvalidParameterException: The description
element in parameter # 1 is invalid. It cannot be null.
	at org.apache.maven.plugin.generator.AbstractGenerator.validateParameter(AbstractGenerator.java:130)
	at org.apache.maven.plugin.generator.AbstractGenerator.execute(AbstractGenerator.java:81)
	at org.apache.maven.plugin.generator.Main.main(Main.java:48)
Generating Jelly harness for maven-plugin-plugin ...
Exception in thread "main" org.apache.maven.plugin.InvalidParameterException: The description
element in parameter # 1 is invalid. It cannot be null.
	at org.apache.maven.plugin.generator.AbstractGenerator.validateParameter(AbstractGenerator.java:130)
	at org.apache.maven.plugin.generator.AbstractGenerator.execute(AbstractGenerator.java:81)
	at org.apache.maven.plugin.generator.Main.main(Main.java:48)
Building project in /home/users/jvanzyl/m2-build/maven-components/maven-plugins/maven-plugin-plugin
Using the following for your maven.repo.local: /home/users/jvanzyl/maven-repo-local
Building tests in /home/users/jvanzyl/m2-build/maven-components/maven-plugins/maven-plugin-plugin
Running tests in /home/users/jvanzyl/m2-build/maven-components/maven-plugins/maven-plugin-plugin

-------------------------------------------------------
T E S T S
-------------------------------------------------------
[surefire] Running org.codehaus.surefire.battery.DirectoryBattery
[surefire] Tests run: 0, Failures: 0, Errors: 0, Time elapsed: 0 sec
Building jars (maven-plugin-plugin-1.0-SNAPSHOT.jar) in /home/users/jvanzyl/m2-build/maven-components/maven-plugins/maven-plugin-plugin/target
-----------------------------------------------------------------------
 Building maven-resources-plugin plugin ... 
-----------------------------------------------------------------------
Generating plugin descriptor for maven-resources-plugin ...
parameters.size() = 2
parameters.size() = 2
Generating bean adapter for maven-resources-plugin ...
Generating Jelly harness for maven-resources-plugin ...
Building project in /home/users/jvanzyl/m2-build/maven-components/maven-plugins/maven-resources-plugin
Using the following for your maven.repo.local: /home/users/jvanzyl/maven-repo-local
Building tests in /home/users/jvanzyl/m2-build/maven-components/maven-plugins/maven-resources-plugin
Running tests in /home/users/jvanzyl/m2-build/maven-components/maven-plugins/maven-resources-plugin

-------------------------------------------------------
T E S T S
-------------------------------------------------------
[surefire] Running org.codehaus.surefire.battery.DirectoryBattery
[surefire] Tests run: 0, Failures: 0, Errors: 0, Time elapsed: 0 sec
Building jars (maven-resources-plugin-1.0-SNAPSHOT.jar) in /home/users/jvanzyl/m2-build/maven-components/maven-plugins/maven-resources-plugin/target
-----------------------------------------------------------------------
 Building maven-surefire-plugin plugin ... 
-----------------------------------------------------------------------
Generating plugin descriptor for maven-surefire-plugin ...
parameters.size() = 5
Generating bean adapter for maven-surefire-plugin ...
Generating Jelly harness for maven-surefire-plugin ...
Building project in /home/users/jvanzyl/m2-build/maven-components/maven-plugins/maven-surefire-plugin
Using the following for your maven.repo.local: /home/users/jvanzyl/maven-repo-local
Building tests in /home/users/jvanzyl/m2-build/maven-components/maven-plugins/maven-surefire-plugin
Running tests in /home/users/jvanzyl/m2-build/maven-components/maven-plugins/maven-surefire-plugin

-------------------------------------------------------
T E S T S
-------------------------------------------------------
[surefire] Running org.codehaus.surefire.battery.DirectoryBattery
[surefire] Tests run: 0, Failures: 0, Errors: 0, Time elapsed: 0 sec
Building jars (maven-surefire-plugin-1.0-SNAPSHOT.jar) in /home/users/jvanzyl/m2-build/maven-components/maven-plugins/maven-surefire-plugin/target
M2_HOME = /home/users/jvanzyl/m2

Creating m2 distribution for public consumption: http://www.codehaus.org/~jvanzyl/m2/m2-20040716.000700.tar.gz


Running maven-core integration tests ...

Running integration test it0000 ...
pluginId = clean
[clean:clean]
Deleting directory /home/users/jvanzyl/m2-build/maven-components/maven-core-it/it0000/target
pluginId = jar
[compiler:compile]
[compiler:testCompile]
[resources:resources]
[resources:testResources]
[surefire:test]

-------------------------------------------------------
T E S T S
-------------------------------------------------------
[surefire] Running org.codehaus.surefire.battery.DirectoryBattery
[surefire] Tests run: 0, Failures: 0, Errors: 0, Time elapsed: 0 sec
[surefire] Running org.apache.maven.it0000.PersonTest
[surefire] Tests run: 1, Failures: 0, Errors: 0, Time elapsed: 0.003 sec
[jar:jar]
target/classes
Running integration test it0001 ...
pluginId = clean
[clean:clean]
Deleting directory /home/users/jvanzyl/m2-build/maven-components/maven-core-it/it0001/target
pluginId = jar
[compiler:compile]
[compiler:testCompile]
[resources:resources]
[resources:testResources]
[surefire:test]

-------------------------------------------------------
T E S T S
-------------------------------------------------------
[surefire] Running org.codehaus.surefire.battery.DirectoryBattery
[surefire] Tests run: 0, Failures: 0, Errors: 0, Time elapsed: 0 sec
[surefire] Running org.apache.maven.it0001.PersonTest
[surefire] Tests run: 1, Failures: 0, Errors: 0, Time elapsed: 0.003 sec
[jar:jar]
target/classes

Mime
View raw message