maven-m2-dev mailing list archives

Site index · List index
Message view « Date » · « Thread »
Top « Date » · « Thread »
From jvan...@maven.org
Subject [maven2 build] Mon Jun 14 09:07:00 EDT 2004
Date Mon, 14 Jun 2004 13:07:35 GMT

Performing an update of maven-components ...

Updates occured, build required ...

P maven-plugin/src/test/java/org/apache/maven/plugin/generator/AbstractGeneratorTestCase.java
P maven-plugin/src/test/resources/source/IdeaMojoOne.java
P maven-plugin/src/test/resources/source/IdeaMojoTwo.java
P maven-plugins/maven-jar-plugin/src/main/java/org/apache/maven/plugin/jar/JarInstallMojo.java
P maven-plugins/maven-jar-plugin/src/main/java/org/apache/maven/plugin/jar/JarMojo.java
P maven-plugins/maven-plugin-plugin/src/main/java/org/apache/maven/plugin/plugin/DescriptorGenerator.java
P maven-plugins/maven-resources-plugin/src/main/java/org/apache/maven/plugin/resources/ResourcesMojo.java
P maven-plugins/maven-resources-plugin/src/main/java/org/apache/maven/plugin/resources/TestResourcesMojo.java
P maven-plugins/maven-surefire-plugin/src/main/java/org/apache/maven/test/SurefirePlugin.java

-----------------------------------------------------------------------
 Building mboot ... 
-----------------------------------------------------------------------
-----------------------------------------------------------------------
Maven MBoot
-----------------------------------------------------------------------
Installing mboot in /home/users/jvanzyl/mboot ...
-----------------------------------------------------------------------
Installing MBoot dependencies ... 
-----------------------------------------------------------------------
-----------------------------------------------------------------------
 Install the parent pom for all maven-component artifacts ... 
-----------------------------------------------------------------------
Installing POM in /home/users/jvanzyl/maven-repo-local/maven/poms/maven-component-2.0-SNAPSHOT.pom
-----------------------------------------------------------------------
 Building maven-model ... 
-----------------------------------------------------------------------
Generating java in target/generated-sources from maven.mdo
Generating xpp3 unmarshaller in target/generated-sources from maven.mdo
Generating xpp3 marshaller in target/generated-sources from maven.mdo
Generating java in target/generated-sources from maven.mdo
Generating xpp3 unmarshaller in target/generated-sources from maven.mdo
Generating xpp3 marshaller in target/generated-sources from maven.mdo
Generating xml schema in . from maven.mdo
Generating xdoc in target/generated-xdocs from maven.mdo
Building project in /home/users/jvanzyl/m2/maven-components/maven-model
Using the following for your maven.repo.local: /home/users/jvanzyl/maven-repo-local
Building tests in /home/users/jvanzyl/m2/maven-components/maven-model
Running tests in /home/users/jvanzyl/m2/maven-components/maven-model

-------------------------------------------------------
T E S T S
-------------------------------------------------------
[surefire] Running org.codehaus.surefire.battery.DirectoryBattery
[surefire] Tests run: 0, Failures: 0, Errors: 0, Time elapsed: 0 sec
Building jars (maven-model-2.0-SNAPSHOT.jar) in /home/users/jvanzyl/m2/maven-components/maven-model/target
Installing maven-model-2.0-SNAPSHOT.jar in /home/users/jvanzyl/maven-repo-local/maven/jars
Installing POM in /home/users/jvanzyl/maven-repo-local/maven/poms/maven-model-2.0-SNAPSHOT.pom
-----------------------------------------------------------------------
 Building maven-artifact ... 
-----------------------------------------------------------------------
Building project in /home/users/jvanzyl/m2/maven-components/maven-artifact
Using the following for your maven.repo.local: /home/users/jvanzyl/maven-repo-local
Downloading dependency: maven/jars/maven-project-2.0-SNAPSHOT.jar
Exception in thread "main" java.lang.Exception: java.lang.Exception: Failed to download maven/jars/maven-project-2.0-SNAPSHOT.jar
	at ArtifactDownloader.downloadDependencies(ArtifactDownloader.java:117)
	at Bootstrapper.downloadDependencies(Bootstrapper.java:92)
	at Bootstrapper.execute(Bootstrapper.java:62)
	at Bootstrapper.main(Bootstrapper.java:42)
Caused by: java.lang.Exception: Failed to download maven/jars/maven-project-2.0-SNAPSHOT.jar
	at ArtifactDownloader.downloadDependencies(ArtifactDownloader.java:112)
	... 3 more
Failed running project parser!
-----------------------------------------------------------------------
 Building maven-plugin ... 
-----------------------------------------------------------------------
Building project in /home/users/jvanzyl/m2/maven-components/maven-plugin
Using the following for your maven.repo.local: /home/users/jvanzyl/maven-repo-local
Building tests in /home/users/jvanzyl/m2/maven-components/maven-plugin
Running tests in /home/users/jvanzyl/m2/maven-components/maven-plugin

-------------------------------------------------------
T E S T S
-------------------------------------------------------
[surefire] Running org.codehaus.surefire.battery.DirectoryBattery
[surefire] Tests run: 0, Failures: 0, Errors: 0, Time elapsed: 0 sec
[surefire] Running org.apache.maven.plugin.generator.jelly.JellyHarnessGeneratorTest
[surefire] Tests run: 1, Failures: 0, Errors: 0, Time elapsed: 0.147 sec
[surefire] Running org.apache.maven.plugin.generator.BeanGeneratorTest
[surefire] Tests run: 1, Failures: 0, Errors: 0, Time elapsed: 0.056 sec
[surefire] Running org.apache.maven.plugin.generator.PluginDescriptorGeneratorTest
[surefire] Tests run: 1, Failures: 0, Errors: 0, Time elapsed: 0.04 sec
[surefire] Running org.apache.maven.plugin.generator.PluginXdocGeneratorTest
[surefire] Tests run: 1, Failures: 0, Errors: 0, Time elapsed: 0.019 sec
[surefire] Running org.apache.maven.plugin.BeanTest
[surefire] Tests run: 1, Failures: 0, Errors: 0, Time elapsed: 0.005 sec
[surefire] Running org.apache.maven.plugin.TestPluginTest
[surefire] Tests run: 1, Failures: 0, Errors: 0, Time elapsed: 0 sec
Building jars (maven-plugin-2.0-SNAPSHOT.jar) in /home/users/jvanzyl/m2/maven-components/maven-plugin/target
Installing maven-plugin-2.0-SNAPSHOT.jar in /home/users/jvanzyl/maven-repo-local/maven/jars
Installing POM in /home/users/jvanzyl/maven-repo-local/maven/poms/maven-plugin-2.0-SNAPSHOT.pom
-----------------------------------------------------------------------
 Building maven-core ... 
-----------------------------------------------------------------------
Building project in /home/users/jvanzyl/m2/maven-components/maven-core
Using the following for your maven.repo.local: /home/users/jvanzyl/maven-repo-local
Downloading dependency: maven/jars/maven-artifact-2.0-SNAPSHOT.jar
Exception in thread "main" java.lang.Exception: java.lang.Exception: Failed to download maven/jars/maven-artifact-2.0-SNAPSHOT.jar
	at ArtifactDownloader.downloadDependencies(ArtifactDownloader.java:117)
	at Bootstrapper.downloadDependencies(Bootstrapper.java:92)
	at Bootstrapper.execute(Bootstrapper.java:62)
	at Bootstrapper.main(Bootstrapper.java:42)
Caused by: java.lang.Exception: Failed to download maven/jars/maven-artifact-2.0-SNAPSHOT.jar
	at ArtifactDownloader.downloadDependencies(ArtifactDownloader.java:112)
	... 3 more
Failed running project parser!
cp: cannot stat `target/maven*.jar': No such file or directory
cat: bootstrap.deps: No such file or directory
Installing POM in /home/users/jvanzyl/maven-repo-local/maven/poms/maven-plugin-parent-2.0-SNAPSHOT.pom
-----------------------------------------------------------------------
 Building maven-clean-plugin plugin ... 
-----------------------------------------------------------------------
Generating plugin descriptor for maven-clean-plugin ...
Exception in thread "main" java.lang.NullPointerException
	at com.thoughtworks.xstream.xml.text.PrettyPrintXMLWriter.writeText(PrettyPrintXMLWriter.java:52)
	at org.apache.maven.plugin.generator.PluginDescriptorGenerator.element(PluginDescriptorGenerator.java:216)
	at org.apache.maven.plugin.generator.PluginDescriptorGenerator.processPluginDescriptor(PluginDescriptorGenerator.java:121)
	at org.apache.maven.plugin.generator.PluginDescriptorGenerator.processPluginDescriptors(PluginDescriptorGenerator.java:42)
	at org.apache.maven.plugin.generator.AbstractGenerator.execute(AbstractGenerator.java:72)
	at org.apache.maven.plugin.generator.Main.main(Main.java:48)
Generating bean adapter for maven-clean-plugin ...
Generating Jelly harness for maven-clean-plugin ...
Building project in /home/users/jvanzyl/m2/maven-components/maven-plugins/maven-clean-plugin
Using the following for your maven.repo.local: /home/users/jvanzyl/maven-repo-local
Downloading dependency: maven/jars/maven-project-2.0-SNAPSHOT.jar
Exception in thread "main" java.lang.Exception: java.lang.Exception: Failed to download maven/jars/maven-project-2.0-SNAPSHOT.jar
	at ArtifactDownloader.downloadDependencies(ArtifactDownloader.java:117)
	at Bootstrapper.downloadDependencies(Bootstrapper.java:92)
	at Bootstrapper.execute(Bootstrapper.java:62)
	at Bootstrapper.main(Bootstrapper.java:42)
Caused by: java.lang.Exception: Failed to download maven/jars/maven-project-2.0-SNAPSHOT.jar
	at ArtifactDownloader.downloadDependencies(ArtifactDownloader.java:112)
	... 3 more
Failed running project parser!
cp: cannot stat `../maven-plugins/maven-clean-plugin/target/maven-clean-plugin*.jar': No such
file or directory
-----------------------------------------------------------------------
 Building maven-compiler-plugin plugin ... 
-----------------------------------------------------------------------
Generating plugin descriptor for maven-compiler-plugin ...
Generating bean adapter for maven-compiler-plugin ...
Generating Jelly harness for maven-compiler-plugin ...
Building project in /home/users/jvanzyl/m2/maven-components/maven-plugins/maven-compiler-plugin
Using the following for your maven.repo.local: /home/users/jvanzyl/maven-repo-local
Downloading dependency: maven/jars/maven-project-2.0-SNAPSHOT.jar
Exception in thread "main" java.lang.Exception: java.lang.Exception: Failed to download maven/jars/maven-project-2.0-SNAPSHOT.jar
	at ArtifactDownloader.downloadDependencies(ArtifactDownloader.java:117)
	at Bootstrapper.downloadDependencies(Bootstrapper.java:92)
	at Bootstrapper.execute(Bootstrapper.java:62)
	at Bootstrapper.main(Bootstrapper.java:42)
Caused by: java.lang.Exception: Failed to download maven/jars/maven-project-2.0-SNAPSHOT.jar
	at ArtifactDownloader.downloadDependencies(ArtifactDownloader.java:112)
	... 3 more
Failed running project parser!
cp: cannot stat `../maven-plugins/maven-compiler-plugin/target/maven-compiler-plugin*.jar':
No such file or directory
-----------------------------------------------------------------------
 Building maven-jar-plugin plugin ... 
-----------------------------------------------------------------------
Generating plugin descriptor for maven-jar-plugin ...
Exception in thread "main" java.lang.NullPointerException
	at com.thoughtworks.xstream.xml.text.PrettyPrintXMLWriter.writeText(PrettyPrintXMLWriter.java:52)
	at org.apache.maven.plugin.generator.PluginDescriptorGenerator.element(PluginDescriptorGenerator.java:216)
	at org.apache.maven.plugin.generator.PluginDescriptorGenerator.processPluginDescriptor(PluginDescriptorGenerator.java:121)
	at org.apache.maven.plugin.generator.PluginDescriptorGenerator.processPluginDescriptors(PluginDescriptorGenerator.java:42)
	at org.apache.maven.plugin.generator.AbstractGenerator.execute(AbstractGenerator.java:72)
	at org.apache.maven.plugin.generator.Main.main(Main.java:48)
Generating bean adapter for maven-jar-plugin ...
Generating Jelly harness for maven-jar-plugin ...
Building project in /home/users/jvanzyl/m2/maven-components/maven-plugins/maven-jar-plugin
Using the following for your maven.repo.local: /home/users/jvanzyl/maven-repo-local
Downloading dependency: maven/jars/maven-project-2.0-SNAPSHOT.jar
Exception in thread "main" java.lang.Exception: java.lang.Exception: Failed to download maven/jars/maven-project-2.0-SNAPSHOT.jar
	at ArtifactDownloader.downloadDependencies(ArtifactDownloader.java:117)
	at Bootstrapper.downloadDependencies(Bootstrapper.java:92)
	at Bootstrapper.execute(Bootstrapper.java:62)
	at Bootstrapper.main(Bootstrapper.java:42)
Caused by: java.lang.Exception: Failed to download maven/jars/maven-project-2.0-SNAPSHOT.jar
	at ArtifactDownloader.downloadDependencies(ArtifactDownloader.java:112)
	... 3 more
Failed running project parser!
cp: cannot stat `../maven-plugins/maven-jar-plugin/target/maven-jar-plugin*.jar': No such
file or directory
-----------------------------------------------------------------------
 Building maven-plugin-plugin plugin ... 
-----------------------------------------------------------------------
Generating plugin descriptor for maven-plugin-plugin ...
Generating bean adapter for maven-plugin-plugin ...
Generating Jelly harness for maven-plugin-plugin ...
Building project in /home/users/jvanzyl/m2/maven-components/maven-plugins/maven-plugin-plugin
Using the following for your maven.repo.local: /home/users/jvanzyl/maven-repo-local
Downloading dependency: maven/jars/maven-project-2.0-SNAPSHOT.jar
Exception in thread "main" java.lang.Exception: java.lang.Exception: Failed to download maven/jars/maven-project-2.0-SNAPSHOT.jar
	at ArtifactDownloader.downloadDependencies(ArtifactDownloader.java:117)
	at Bootstrapper.downloadDependencies(Bootstrapper.java:92)
	at Bootstrapper.execute(Bootstrapper.java:62)
	at Bootstrapper.main(Bootstrapper.java:42)
Caused by: java.lang.Exception: Failed to download maven/jars/maven-project-2.0-SNAPSHOT.jar
	at ArtifactDownloader.downloadDependencies(ArtifactDownloader.java:112)
	... 3 more
Failed running project parser!
cp: cannot stat `../maven-plugins/maven-plugin-plugin/target/maven-plugin-plugin*.jar': No
such file or directory
-----------------------------------------------------------------------
 Building maven-resources-plugin plugin ... 
-----------------------------------------------------------------------
Generating plugin descriptor for maven-resources-plugin ...
Exception in thread "main" java.lang.NullPointerException
	at com.thoughtworks.xstream.xml.text.PrettyPrintXMLWriter.writeText(PrettyPrintXMLWriter.java:52)
	at org.apache.maven.plugin.generator.PluginDescriptorGenerator.element(PluginDescriptorGenerator.java:216)
	at org.apache.maven.plugin.generator.PluginDescriptorGenerator.processPluginDescriptor(PluginDescriptorGenerator.java:168)
	at org.apache.maven.plugin.generator.PluginDescriptorGenerator.processPluginDescriptors(PluginDescriptorGenerator.java:42)
	at org.apache.maven.plugin.generator.AbstractGenerator.execute(AbstractGenerator.java:72)
	at org.apache.maven.plugin.generator.Main.main(Main.java:48)
Generating bean adapter for maven-resources-plugin ...
Generating Jelly harness for maven-resources-plugin ...
Exception in thread "main" java.lang.NullPointerException
	at org.apache.maven.plugin.generator.jelly.JellyHarnessGenerator.processPluginDescriptor(JellyHarnessGenerator.java:178)
	at org.apache.maven.plugin.generator.jelly.JellyHarnessGenerator.processPluginDescriptors(JellyHarnessGenerator.java:38)
	at org.apache.maven.plugin.generator.AbstractGenerator.execute(AbstractGenerator.java:72)
	at org.apache.maven.plugin.generator.Main.main(Main.java:48)
Building project in /home/users/jvanzyl/m2/maven-components/maven-plugins/maven-resources-plugin
Using the following for your maven.repo.local: /home/users/jvanzyl/maven-repo-local
Downloading dependency: maven/jars/maven-project-2.0-SNAPSHOT.jar
Exception in thread "main" java.lang.Exception: java.lang.Exception: Failed to download maven/jars/maven-project-2.0-SNAPSHOT.jar
	at ArtifactDownloader.downloadDependencies(ArtifactDownloader.java:117)
	at Bootstrapper.downloadDependencies(Bootstrapper.java:92)
	at Bootstrapper.execute(Bootstrapper.java:62)
	at Bootstrapper.main(Bootstrapper.java:42)
Caused by: java.lang.Exception: Failed to download maven/jars/maven-project-2.0-SNAPSHOT.jar
	at ArtifactDownloader.downloadDependencies(ArtifactDownloader.java:112)
	... 3 more
Failed running project parser!
cp: cannot stat `../maven-plugins/maven-resources-plugin/target/maven-resources-plugin*.jar':
No such file or directory
-----------------------------------------------------------------------
 Building maven-surefire-plugin plugin ... 
-----------------------------------------------------------------------
Generating plugin descriptor for maven-surefire-plugin ...
Exception in thread "main" java.lang.NullPointerException
	at com.thoughtworks.xstream.xml.text.PrettyPrintXMLWriter.writeText(PrettyPrintXMLWriter.java:52)
	at org.apache.maven.plugin.generator.PluginDescriptorGenerator.element(PluginDescriptorGenerator.java:216)
	at org.apache.maven.plugin.generator.PluginDescriptorGenerator.processPluginDescriptor(PluginDescriptorGenerator.java:121)
	at org.apache.maven.plugin.generator.PluginDescriptorGenerator.processPluginDescriptors(PluginDescriptorGenerator.java:42)
	at org.apache.maven.plugin.generator.AbstractGenerator.execute(AbstractGenerator.java:72)
	at org.apache.maven.plugin.generator.Main.main(Main.java:48)
Generating bean adapter for maven-surefire-plugin ...
Generating Jelly harness for maven-surefire-plugin ...
Building project in /home/users/jvanzyl/m2/maven-components/maven-plugins/maven-surefire-plugin
Using the following for your maven.repo.local: /home/users/jvanzyl/maven-repo-local
Downloading dependency: maven/jars/maven-project-2.0-SNAPSHOT.jar
Exception in thread "main" java.lang.Exception: java.lang.Exception: Failed to download maven/jars/maven-project-2.0-SNAPSHOT.jar
	at ArtifactDownloader.downloadDependencies(ArtifactDownloader.java:117)
	at Bootstrapper.downloadDependencies(Bootstrapper.java:92)
	at Bootstrapper.execute(Bootstrapper.java:62)
	at Bootstrapper.main(Bootstrapper.java:42)
Caused by: java.lang.Exception: Failed to download maven/jars/maven-project-2.0-SNAPSHOT.jar
	at ArtifactDownloader.downloadDependencies(ArtifactDownloader.java:112)
	... 3 more
Failed running project parser!
cp: cannot stat `../maven-plugins/maven-surefire-plugin/target/maven-surefire-plugin*.jar':
No such file or directory
M2_HOME = /home/users/jvanzyl/maven

Creating m2 distribution for public consumption: http://www.codehaus.org/~jvanzyl/m2/m2-20040714.090700.tar.gz


Mime
View raw message