maven-m2-dev mailing list archives

Site index · List index
Message view « Date » · « Thread »
Top « Date » · « Thread »
From jvan...@maven.org
Subject [maven2 build] Thu Jun 3 16:04:46 EDT 2004
Date Thu, 03 Jun 2004 20:05:48 GMT

Performing a clean check out of maven-components ...

Updates occured, build required ...


-----------------------------------------------------------------------
 Building mboot ... 
-----------------------------------------------------------------------
-----------------------------------------------------------------------
Maven MBoot
-----------------------------------------------------------------------
Installing mboot in /home/users/jvanzyl/mboot ...
-----------------------------------------------------------------------
Installing MBoot dependencies ... 
-----------------------------------------------------------------------
-----------------------------------------------------------------------
 Install the parent pom for all maven-component artifacts ... 
-----------------------------------------------------------------------
Installing POM in /home/users/jvanzyl/maven-repo-local/maven/poms/maven-component-2.0-SNAPSHOT.pom
-----------------------------------------------------------------------
 Building maven-model ... 
-----------------------------------------------------------------------
Generating java in target/generated-sources from maven.mdo
Generating xpp3 unmarshaller in target/generated-sources from maven.mdo
Generating xpp3 marshaller in target/generated-sources from maven.mdo
Generating xml schema in . from maven.mdo
Generating xdoc in target/generated-xdocs from maven.mdo
Building project in /home/users/jvanzyl/m2/maven-components/maven-model
Using the following for your maven.repo.local: /home/users/jvanzyl/maven-repo-local
Building tests in /home/users/jvanzyl/m2/maven-components/maven-model
Running tests in /home/users/jvanzyl/m2/maven-components/maven-model

-------------------------------------------------------
T E S T S
-------------------------------------------------------
[surefire] Running org.codehaus.surefire.battery.DirectoryBattery
[surefire] Tests run: 0, Failures: 0, Errors: 0, Time elapsed: 0 sec
Building jars (maven-model-2.0-SNAPSHOT.jar) in /home/users/jvanzyl/m2/maven-components/maven-model/target
Installing maven-model-2.0-SNAPSHOT.jar in /home/users/jvanzyl/maven-repo-local/maven/jars
Installing POM in /home/users/jvanzyl/maven-repo-local/maven/poms/maven-model-2.0-SNAPSHOT.pom
-----------------------------------------------------------------------
 Building maven-project ... 
-----------------------------------------------------------------------
Building project in /home/users/jvanzyl/m2/maven-components/maven-project
Using the following for your maven.repo.local: /home/users/jvanzyl/maven-repo-local
Downloading dependency: plexus/jars/plexus-0.14-SNAPSHOT.jar
.................................................................................................................................
.
Downloading dependency: plexus/jars/plexus-i18n-1.0-beta-2-SNAPSHOT.jar
......
.
Downloading dependency: maven/jars/wagon-api-0.9-SNAPSHOT.jar
.............................
.
Downloading dependency: classworlds/jars/classworlds-1.1-SNAPSHOT.jar
.........................
.
Building tests in /home/users/jvanzyl/m2/maven-components/maven-project
Running tests in /home/users/jvanzyl/m2/maven-components/maven-project

-------------------------------------------------------
T E S T S
-------------------------------------------------------
[surefire] Running org.codehaus.surefire.battery.DirectoryBattery
[surefire] Tests run: 0, Failures: 0, Errors: 0, Time elapsed: 0 sec
[surefire] Running org.apache.maven.artifact.collector.DefaultArtifactCollectorTest
[surefire] Tests run: 1, Failures: 0, Errors: 0, Time elapsed: 0.649 sec
Created temporary local repository: ./target/temp-repo-local
[INFO] Trying to download: /maven-test/jars/maven-test-b-1.0.jar  from file://./target/test-classes/remote-repo-1
[INFO] Actual md5  : a5c3b5cd0605bb7331d1846cdc14b13b
[INFO] Expected md5: a5c3b5cd0605bb7331d1846cdc14b13b
[INFO] md5 is valid: true
[INFO] Trying to download: /maven-test/jars/maven-test-z-1.0.jar  from file://./target/test-classes/remote-repo-1
[INFO] IO error occred while transfering /maven-test/jars/maven-test-z-1.0.jar from file://./target/test-classes/remote-repo-1
[INFO] Trying to download: /maven-test/jars/maven-test-z-1.0.jar  from file://./target/test-classes/remote-repo-2
org.apache.maven.wagon.TransferFailedException: Could not read from file: /home/users/jvanzyl/m2/maven-components/maven-project/./target/test-classes/remote-repo-2/maven-test/jars/maven-test-z-1.0.jar.md5
	at org.apache.maven.wagon.providers.file.FileWagon.getInputStream(FileWagon.java:53)
	at org.apache.maven.wagon.StreamWagon.get(StreamWagon.java:108)
	at org.apache.maven.wagon.observers.ChecksumObserver.transferCompleted(ChecksumObserver.java:164)
	at org.apache.maven.wagon.events.TransferEventSupport.fireTransferCompleted(TransferEventSupport.java:136)
	at org.apache.maven.wagon.AbstractWagon.fireGetCompleted(AbstractWagon.java:262)
	at org.apache.maven.wagon.AbstractWagon.getTransfer(AbstractWagon.java:133)
	at org.apache.maven.wagon.StreamWagon.get(StreamWagon.java:116)
	at org.apache.maven.artifact.downloader.DefaultArtifactDownloader.getRemoteArtifact(DefaultArtifactDownloader.java:140)
	at org.apache.maven.artifact.downloader.DefaultArtifactDownloader.getRemoteArtifact(DefaultArtifactDownloader.java:81)
	at org.apache.maven.artifact.downloader.DefaultArtifactDownloader.getRemoteArtifact(DefaultArtifactDownloader.java:50)
	at org.apache.maven.artifact.downloader.DefaultArtifactDownloaderTest.testArtifactDownloading(DefaultArtifactDownloaderTest.java:108)
	at sun.reflect.NativeMethodAccessorImpl.invoke0(Native Method)
	at sun.reflect.NativeMethodAccessorImpl.invoke(NativeMethodAccessorImpl.java:39)
	at sun.reflect.DelegatingMethodAccessorImpl.invoke(DelegatingMethodAccessorImpl.java:25)
	at java.lang.reflect.Method.invoke(Method.java:324)
	at junit.framework.TestCase.runTest(TestCase.java:154)
	at junit.framework.TestCase.runBare(TestCase.java:127)
	at junit.framework.TestResult$1.protect(TestResult.java:106)
	at junit.framework.TestResult.runProtected(TestResult.java:124)
	at junit.framework.TestResult.run(TestResult.java:109)
	at junit.framework.TestCase.run(TestCase.java:118)
	at junit.framework.TestSuite.runTest(TestSuite.java:208)
	at junit.framework.TestSuite.run(TestSuite.java:203)
	at sun.reflect.NativeMethodAccessorImpl.invoke0(Native Method)
	at sun.reflect.NativeMethodAccessorImpl.invoke(NativeMethodAccessorImpl.java:39)
	at sun.reflect.DelegatingMethodAccessorImpl.invoke(DelegatingMethodAccessorImpl.java:25)
	at java.lang.reflect.Method.invoke(Method.java:324)
	at org.codehaus.surefire.battery.JUnitBattery.execute(JUnitBattery.java:161)
	at org.codehaus.surefire.Surefire.executeBattery(Surefire.java:120)
	at org.codehaus.surefire.Surefire.run(Surefire.java:92)
	at org.codehaus.surefire.Surefire.run(Surefire.java:55)
	at sun.reflect.NativeMethodAccessorImpl.invoke0(Native Method)
	at sun.reflect.NativeMethodAccessorImpl.invoke(NativeMethodAccessorImpl.java:39)
	at sun.reflect.DelegatingMethodAccessorImpl.invoke(DelegatingMethodAccessorImpl.java:25)
	at java.lang.reflect.Method.invoke(Method.java:324)
	at org.codehaus.surefire.SurefireBooter.run(SurefireBooter.java:69)
	at org.codehaus.surefire.SurefireBooter.main(SurefireBooter.java:167)
Caused by: java.io.FileNotFoundException: ./target/test-classes/remote-repo-2/maven-test/jars/maven-test-z-1.0.jar.md5
(No such file or directory)
	at java.io.FileInputStream.open(Native Method)
	at java.io.FileInputStream.<init>(FileInputStream.java:106)
	at org.apache.maven.wagon.providers.file.FileWagon.getInputStream(FileWagon.java:49)
	... 36 more
[INFO] Actual md5  : d3b07384d113edec49eaa6238ad5ff00
[INFO] Expected md5: null
[INFO] md5 is valid: false
[INFO] Trying to download: /bizzare/jars/maven-test-b-1.0.jar  from file://./target/test-classes/remote-repo-1
[INFO] IO error occred while transfering /bizzare/jars/maven-test-b-1.0.jar from file://./target/test-classes/remote-repo-1
[INFO] Trying to download: /bizzare/jars/maven-test-b-1.0.jar  from file://./target/test-classes/remote-repo-2
[INFO] IO error occred while transfering /bizzare/jars/maven-test-b-1.0.jar from file://./target/test-classes/remote-repo-2
[surefire] Running org.apache.maven.artifact.downloader.DefaultArtifactDownloaderTest
[surefire] Tests run: 1, Failures: 0, Errors: 0, Time elapsed: 0.114 sec
[surefire] Running org.apache.maven.artifact.resolver.DefaultArtifactResolverTest
[surefire] Tests run: 1, Failures: 0, Errors: 0, Time elapsed: 0.064 sec
[INFO] Trying to download: /snapshot-test/jars/maven-snapshot-a-1.0-SNAPSHOT.jar  from file://./target/test-classes/remote-repo-1
org.apache.maven.wagon.TransferFailedException: Could not read from file: /home/users/jvanzyl/m2/maven-components/maven-project/./target/test-classes/remote-repo-1/snapshot-test/jars/maven-snapshot-a-1.0-SNAPSHOT.jar.md5
	at org.apache.maven.wagon.providers.file.FileWagon.getInputStream(FileWagon.java:53)
	at org.apache.maven.wagon.StreamWagon.get(StreamWagon.java:108)
	at org.apache.maven.wagon.observers.ChecksumObserver.transferCompleted(ChecksumObserver.java:164)
	at org.apache.maven.wagon.events.TransferEventSupport.fireTransferCompleted(TransferEventSupport.java:136)
	at org.apache.maven.wagon.AbstractWagon.fireGetCompleted(AbstractWagon.java:262)
	at org.apache.maven.wagon.AbstractWagon.getTransfer(AbstractWagon.java:133)
	at org.apache.maven.wagon.StreamWagon.get(StreamWagon.java:116)
	at org.apache.maven.artifact.downloader.DefaultArtifactDownloader.getRemoteArtifact(DefaultArtifactDownloader.java:140)
	at org.apache.maven.artifact.snapshot.DefaultSnapshotResolver.resolveSnapshotArtifact(DefaultSnapshotResolver.java:83)
	at org.apache.maven.artifact.snapshot.DefaultSnapshotResolverTest.testSnapshotResolving(DefaultSnapshotResolverTest.java:75)
	at sun.reflect.NativeMethodAccessorImpl.invoke0(Native Method)
	at sun.reflect.NativeMethodAccessorImpl.invoke(NativeMethodAccessorImpl.java:39)
	at sun.reflect.DelegatingMethodAccessorImpl.invoke(DelegatingMethodAccessorImpl.java:25)
	at java.lang.reflect.Method.invoke(Method.java:324)
	at junit.framework.TestCase.runTest(TestCase.java:154)
	at junit.framework.TestCase.runBare(TestCase.java:127)
	at junit.framework.TestResult$1.protect(TestResult.java:106)
	at junit.framework.TestResult.runProtected(TestResult.java:124)
	at junit.framework.TestResult.run(TestResult.java:109)
	at junit.framework.TestCase.run(TestCase.java:118)
	at junit.framework.TestSuite.runTest(TestSuite.java:208)
	at junit.framework.TestSuite.run(TestSuite.java:203)
	at sun.reflect.NativeMethodAccessorImpl.invoke0(Native Method)
	at sun.reflect.NativeMethodAccessorImpl.invoke(NativeMethodAccessorImpl.java:39)
	at sun.reflect.DelegatingMethodAccessorImpl.invoke(DelegatingMethodAccessorImpl.java:25)
	at java.lang.reflect.Method.invoke(Method.java:324)
	at org.codehaus.surefire.battery.JUnitBattery.execute(JUnitBattery.java:161)
	at org.codehaus.surefire.Surefire.executeBattery(Surefire.java:120)
	at org.codehaus.surefire.Surefire.run(Surefire.java:92)
	at org.codehaus.surefire.Surefire.run(Surefire.java:55)
	at sun.reflect.NativeMethodAccessorImpl.invoke0(Native Method)
	at sun.reflect.NativeMethodAccessorImpl.invoke(NativeMethodAccessorImpl.java:39)
	at sun.reflect.DelegatingMethodAccessorImpl.invoke(DelegatingMethodAccessorImpl.java:25)
	at java.lang.reflect.Method.invoke(Method.java:324)
	at org.codehaus.surefire.SurefireBooter.run(SurefireBooter.java:69)
	at org.codehaus.surefire.SurefireBooter.main(SurefireBooter.java:167)
Caused by: java.io.FileNotFoundException: ./target/test-classes/remote-repo-1/snapshot-test/jars/maven-snapshot-a-1.0-SNAPSHOT.jar.md5
(No such file or directory)
	at java.io.FileInputStream.open(Native Method)
	at java.io.FileInputStream.<init>(FileInputStream.java:106)
	at org.apache.maven.wagon.providers.file.FileWagon.getInputStream(FileWagon.java:49)
	... 35 more
[INFO] Actual md5  : 2c18e486683a3db1e645ad8523223b72
[INFO] Expected md5: null
[INFO] md5 is valid: false
[INFO] Trying to download: /snapshot-test/jars/maven-snapshot-c-1.0-SNAPSHOT.jar  from file://./target/test-classes/remote-repo-1
org.apache.maven.wagon.TransferFailedException: Could not read from file: /home/users/jvanzyl/m2/maven-components/maven-project/./target/test-classes/remote-repo-1/snapshot-test/jars/maven-snapshot-c-1.0-SNAPSHOT.jar.md5
	at org.apache.maven.wagon.providers.file.FileWagon.getInputStream(FileWagon.java:53)
	at org.apache.maven.wagon.StreamWagon.get(StreamWagon.java:108)
	at org.apache.maven.wagon.observers.ChecksumObserver.transferCompleted(ChecksumObserver.java:164)
	at org.apache.maven.wagon.events.TransferEventSupport.fireTransferCompleted(TransferEventSupport.java:136)
	at org.apache.maven.wagon.AbstractWagon.fireGetCompleted(AbstractWagon.java:262)
	at org.apache.maven.wagon.AbstractWagon.getTransfer(AbstractWagon.java:133)
	at org.apache.maven.wagon.StreamWagon.get(StreamWagon.java:116)
	at org.apache.maven.artifact.downloader.DefaultArtifactDownloader.getRemoteArtifact(DefaultArtifactDownloader.java:140)
	at org.apache.maven.artifact.snapshot.DefaultSnapshotResolver.resolveSnapshotArtifact(DefaultSnapshotResolver.java:83)
	at org.apache.maven.artifact.snapshot.DefaultSnapshotResolverTest.testSnapshotResolving(DefaultSnapshotResolverTest.java:95)
	at sun.reflect.NativeMethodAccessorImpl.invoke0(Native Method)
	at sun.reflect.NativeMethodAccessorImpl.invoke(NativeMethodAccessorImpl.java:39)
	at sun.reflect.DelegatingMethodAccessorImpl.invoke(DelegatingMethodAccessorImpl.java:25)
	at java.lang.reflect.Method.invoke(Method.java:324)
	at junit.framework.TestCase.runTest(TestCase.java:154)
	at junit.framework.TestCase.runBare(TestCase.java:127)
	at junit.framework.TestResult$1.protect(TestResult.java:106)
	at junit.framework.TestResult.runProtected(TestResult.java:124)
	at junit.framework.TestResult.run(TestResult.java:109)
	at junit.framework.TestCase.run(TestCase.java:118)
	at junit.framework.TestSuite.runTest(TestSuite.java:208)
	at junit.framework.TestSuite.run(TestSuite.java:203)
	at sun.reflect.NativeMethodAccessorImpl.invoke0(Native Method)
	at sun.reflect.NativeMethodAccessorImpl.invoke(NativeMethodAccessorImpl.java:39)
	at sun.reflect.DelegatingMethodAccessorImpl.invoke(DelegatingMethodAccessorImpl.java:25)
	at java.lang.reflect.Method.invoke(Method.java:324)
	at org.codehaus.surefire.battery.JUnitBattery.execute(JUnitBattery.java:161)
	at org.codehaus.surefire.Surefire.executeBattery(Surefire.java:120)
	at org.codehaus.surefire.Surefire.run(Surefire.java:92)
	at org.codehaus.surefire.Surefire.run(Surefire.java:55)
	at sun.reflect.NativeMethodAccessorImpl.invoke0(Native Method)
	at sun.reflect.NativeMethodAccessorImpl.invoke(NativeMethodAccessorImpl.java:39)
	at sun.reflect.DelegatingMethodAccessorImpl.invoke(DelegatingMethodAccessorImpl.java:25)
	at java.lang.reflect.Method.invoke(Method.java:324)
	at org.codehaus.surefire.SurefireBooter.run(SurefireBooter.java:69)
	at org.codehaus.surefire.SurefireBooter.main(SurefireBooter.java:167)
Caused by: java.io.FileNotFoundException: ./target/test-classes/remote-repo-1/snapshot-test/jars/maven-snapshot-c-1.0-SNAPSHOT.jar.md5
(No such file or directory)
	at java.io.FileInputStream.open(Native Method)
	at java.io.FileInputStream.<init>(FileInputStream.java:106)
	at org.apache.maven.wagon.providers.file.FileWagon.getInputStream(FileWagon.java:49)
	... 35 more
[INFO] Actual md5  : 2c18e486683a3db1e645ad8523223b72
[INFO] Expected md5: null
[INFO] md5 is valid: false
[surefire] Running org.apache.maven.artifact.snapshot.DefaultSnapshotResolverTest
[surefire] Tests run: 1, Failures: 0, Errors: 0, Time elapsed: 0.084 sec
[surefire] Running org.apache.maven.project.DefaultProjectBuilderTest
[surefire] Tests run: 7, Failures: 0, Errors: 0, Time elapsed: 0.051 sec
[surefire] Running org.apache.maven.project.ProjectBaseDirectoryAlignmentTest
[surefire] Tests run: 3, Failures: 0, Errors: 0, Time elapsed: 0.07 sec
[surefire] Running org.apache.maven.project.ProjectReactorTest
[surefire] Tests run: 1, Failures: 0, Errors: 0, Time elapsed: 0.849 sec
[surefire] Running org.apache.maven.project.RecursiveProjectInheritanceTest
[surefire] Tests run: 4, Failures: 0, Errors: 0, Time elapsed: 0.13 sec
Building jars (maven-project-2.0-SNAPSHOT.jar) in /home/users/jvanzyl/m2/maven-components/maven-project/target
Installing maven-project-2.0-SNAPSHOT.jar in /home/users/jvanzyl/maven-repo-local/maven/jars
Installing POM in /home/users/jvanzyl/maven-repo-local/maven/poms/maven-project-2.0-SNAPSHOT.pom
-----------------------------------------------------------------------
 Building maven-plugin ... 
-----------------------------------------------------------------------
Building project in /home/users/jvanzyl/m2/maven-components/maven-plugin
Using the following for your maven.repo.local: /home/users/jvanzyl/maven-repo-local
Building tests in /home/users/jvanzyl/m2/maven-components/maven-plugin
Running tests in /home/users/jvanzyl/m2/maven-components/maven-plugin

-------------------------------------------------------
T E S T S
-------------------------------------------------------
[surefire] Running org.codehaus.surefire.battery.DirectoryBattery
[surefire] Tests run: 0, Failures: 0, Errors: 0, Time elapsed: 0 sec
[surefire] Running org.apache.maven.plugin.generator.jelly.JellyHarnessGeneratorTest
[surefire] Tests run: 1, Failures: 0, Errors: 0, Time elapsed: 0.135 sec
[surefire] Running org.apache.maven.plugin.generator.BeanGeneratorTest
[surefire] Tests run: 1, Failures: 0, Errors: 0, Time elapsed: 0.044 sec
[surefire] Running org.apache.maven.plugin.generator.PluginDescriptorGeneratorTest
[surefire] Tests run: 1, Failures: 0, Errors: 0, Time elapsed: 0.012 sec
[surefire] Running org.apache.maven.plugin.generator.PluginXdocGeneratorTest
[surefire] Tests run: 1, Failures: 0, Errors: 0, Time elapsed: 0.043 sec
[surefire] Running org.apache.maven.plugin.BeanTest
[surefire] Tests run: 1, Failures: 0, Errors: 0, Time elapsed: 0.004 sec
[surefire] Running org.apache.maven.plugin.TestPluginTest
[surefire] Tests run: 1, Failures: 0, Errors: 0, Time elapsed: 0 sec
Building jars (maven-plugin-2.0-SNAPSHOT.jar) in /home/users/jvanzyl/m2/maven-components/maven-plugin/target
Installing maven-plugin-2.0-SNAPSHOT.jar in /home/users/jvanzyl/maven-repo-local/maven/jars
Installing POM in /home/users/jvanzyl/maven-repo-local/maven/poms/maven-plugin-2.0-SNAPSHOT.pom
-----------------------------------------------------------------------
 Building maven-core ... 
-----------------------------------------------------------------------
Building project in /home/users/jvanzyl/m2/maven-components/maven-core
Using the following for your maven.repo.local: /home/users/jvanzyl/maven-repo-local
Downloading dependency: commons-cli/jars/commons-cli-1.0-beta-2.jar
....................
.
Downloading dependency: ognl/jars/ognl-2.5.1.jar
......................................................................................................
.
Downloading dependency: marmalade/jars/marmalade-core-0.1.jar
...................................
.
Downloading dependency: marmalade/jars/marmalade-el-ognl-0.1.jar
..
.
Downloading dependency: tagalog/jars/tagalog-0.1.jar
.....................
.
Downloading dependency: plexus/jars/plexus-compiler-1.0-SNAPSHOT.jar
...............
.
Downloading dependency: maven/jars/wagon-http-0.9-SNAPSHOT.jar
.
.
Building tests in /home/users/jvanzyl/m2/maven-components/maven-core
Running tests in /home/users/jvanzyl/m2/maven-components/maven-core

-------------------------------------------------------
T E S T S
-------------------------------------------------------
[surefire] Running org.codehaus.surefire.battery.DirectoryBattery
[surefire] Tests run: 0, Failures: 0, Errors: 0, Time elapsed: 0 sec
error configuring resource: ./target/maven.home/plugins
[surefire] Running org.apache.maven.lifecycle.phase.GoalDecorationPhaseTest
[surefire] Tests run: 1, Failures: 0, Errors: 0, Time elapsed: 0.358 sec
error configuring resource: ./target/maven.home/plugins
[surefire] Running org.apache.maven.lifecycle.MavenLifecycleManagerTest
[surefire] Tests run: 1, Failures: 0, Errors: 0, Time elapsed: 0.057 sec
error configuring resource: ./target/maven.home/plugins
[surefire] Running org.apache.maven.MavenTest
[surefire] Tests run: 1, Failures: 0, Errors: 0, Time elapsed: 0.095 sec
[surefire] Running org.apache.maven.plugin.OgnlProjectValueExtractorTest
[surefire] Tests run: 2, Failures: 0, Errors: 0, Time elapsed: 0 sec
error configuring resource: ./target/maven.home/plugins
[integrated-execute]
[surefire] Running org.apache.maven.plugin.PluginTest
[surefire] Tests run: 1, Failures: 0, Errors: 0, Time elapsed: 0.289 sec
Building jars (maven-core-2.0-SNAPSHOT.jar) in /home/users/jvanzyl/m2/maven-components/maven-core/target
Installing maven-core-2.0-SNAPSHOT.jar in /home/users/jvanzyl/maven-repo-local/maven/jars
Installing POM in /home/users/jvanzyl/maven-repo-local/maven/poms/maven-core-2.0-SNAPSHOT.pom
Installing POM in /home/users/jvanzyl/maven-repo-local/maven/poms/maven-plugin-parent-2.0-SNAPSHOT.pom
-----------------------------------------------------------------------
 Building maven-clean-plugin plugin ... 
-----------------------------------------------------------------------
Generating plugin descriptor for maven-clean-plugin ...
Generating bean adapter for maven-clean-plugin ...
Generating Jelly harness for maven-clean-plugin ...
Building project in /home/users/jvanzyl/m2/maven-components/maven-plugins/maven-clean-plugin
Using the following for your maven.repo.local: /home/users/jvanzyl/maven-repo-local
Building tests in /home/users/jvanzyl/m2/maven-components/maven-plugins/maven-clean-plugin
Running tests in /home/users/jvanzyl/m2/maven-components/maven-plugins/maven-clean-plugin

-------------------------------------------------------
T E S T S
-------------------------------------------------------
[surefire] Running org.codehaus.surefire.battery.DirectoryBattery
[surefire] Tests run: 0, Failures: 0, Errors: 0, Time elapsed: 0 sec
Building jars (maven-clean-plugin-2.0-SNAPSHOT.jar) in /home/users/jvanzyl/m2/maven-components/maven-plugins/maven-clean-plugin/target
-----------------------------------------------------------------------
 Building maven-compiler-plugin plugin ... 
-----------------------------------------------------------------------
Generating plugin descriptor for maven-compiler-plugin ...
Generating bean adapter for maven-compiler-plugin ...
Generating Jelly harness for maven-compiler-plugin ...
Building project in /home/users/jvanzyl/m2/maven-components/maven-plugins/maven-compiler-plugin
Using the following for your maven.repo.local: /home/users/jvanzyl/maven-repo-local
Building tests in /home/users/jvanzyl/m2/maven-components/maven-plugins/maven-compiler-plugin
Running tests in /home/users/jvanzyl/m2/maven-components/maven-plugins/maven-compiler-plugin

-------------------------------------------------------
T E S T S
-------------------------------------------------------
[surefire] Running org.codehaus.surefire.battery.DirectoryBattery
[surefire] Tests run: 0, Failures: 0, Errors: 0, Time elapsed: 0 sec
Building jars (maven-compiler-plugin-2.0-SNAPSHOT.jar) in /home/users/jvanzyl/m2/maven-components/maven-plugins/maven-compiler-plugin/target
-----------------------------------------------------------------------
 Building maven-jar-plugin plugin ... 
-----------------------------------------------------------------------
Generating plugin descriptor for maven-jar-plugin ...
Generating bean adapter for maven-jar-plugin ...
Generating Jelly harness for maven-jar-plugin ...
Building project in /home/users/jvanzyl/m2/maven-components/maven-plugins/maven-jar-plugin
Using the following for your maven.repo.local: /home/users/jvanzyl/maven-repo-local
Building tests in /home/users/jvanzyl/m2/maven-components/maven-plugins/maven-jar-plugin
Running tests in /home/users/jvanzyl/m2/maven-components/maven-plugins/maven-jar-plugin

-------------------------------------------------------
T E S T S
-------------------------------------------------------
[surefire] Running org.codehaus.surefire.battery.DirectoryBattery
[surefire] Tests run: 0, Failures: 0, Errors: 0, Time elapsed: 0 sec
Building jars (maven-jar-plugin-1.0-SNAPSHOT.jar) in /home/users/jvanzyl/m2/maven-components/maven-plugins/maven-jar-plugin/target
-----------------------------------------------------------------------
 Building maven-plugin-plugin plugin ... 
-----------------------------------------------------------------------
Generating plugin descriptor for maven-plugin-plugin ...
Generating bean adapter for maven-plugin-plugin ...
Generating Jelly harness for maven-plugin-plugin ...
Building project in /home/users/jvanzyl/m2/maven-components/maven-plugins/maven-plugin-plugin
Using the following for your maven.repo.local: /home/users/jvanzyl/maven-repo-local
Building tests in /home/users/jvanzyl/m2/maven-components/maven-plugins/maven-plugin-plugin
Running tests in /home/users/jvanzyl/m2/maven-components/maven-plugins/maven-plugin-plugin

-------------------------------------------------------
T E S T S
-------------------------------------------------------
[surefire] Running org.codehaus.surefire.battery.DirectoryBattery
[surefire] Tests run: 0, Failures: 0, Errors: 0, Time elapsed: 0 sec
Building jars (maven-plugin-plugin-1.0-SNAPSHOT.jar) in /home/users/jvanzyl/m2/maven-components/maven-plugins/maven-plugin-plugin/target
-----------------------------------------------------------------------
 Building maven-resources-plugin plugin ... 
-----------------------------------------------------------------------
Generating plugin descriptor for maven-resources-plugin ...
Generating bean adapter for maven-resources-plugin ...
Generating Jelly harness for maven-resources-plugin ...
Building project in /home/users/jvanzyl/m2/maven-components/maven-plugins/maven-resources-plugin
Using the following for your maven.repo.local: /home/users/jvanzyl/maven-repo-local
Building tests in /home/users/jvanzyl/m2/maven-components/maven-plugins/maven-resources-plugin
Running tests in /home/users/jvanzyl/m2/maven-components/maven-plugins/maven-resources-plugin

-------------------------------------------------------
T E S T S
-------------------------------------------------------
[surefire] Running org.codehaus.surefire.battery.DirectoryBattery
[surefire] Tests run: 0, Failures: 0, Errors: 0, Time elapsed: 0 sec
Building jars (maven-resources-plugin-1.0-SNAPSHOT.jar) in /home/users/jvanzyl/m2/maven-components/maven-plugins/maven-resources-plugin/target
-----------------------------------------------------------------------
 Building maven-surefire-plugin plugin ... 
-----------------------------------------------------------------------
Generating plugin descriptor for maven-surefire-plugin ...
Generating bean adapter for maven-surefire-plugin ...
Generating Jelly harness for maven-surefire-plugin ...
Building project in /home/users/jvanzyl/m2/maven-components/maven-plugins/maven-surefire-plugin
Using the following for your maven.repo.local: /home/users/jvanzyl/maven-repo-local
Building tests in /home/users/jvanzyl/m2/maven-components/maven-plugins/maven-surefire-plugin
Running tests in /home/users/jvanzyl/m2/maven-components/maven-plugins/maven-surefire-plugin

-------------------------------------------------------
T E S T S
-------------------------------------------------------
[surefire] Running org.codehaus.surefire.battery.DirectoryBattery
[surefire] Tests run: 0, Failures: 0, Errors: 0, Time elapsed: 0 sec
Building jars (maven-surefire-plugin-1.0-SNAPSHOT.jar) in /home/users/jvanzyl/m2/maven-components/maven-plugins/maven-surefire-plugin/target
M2_HOME = /home/users/jvanzyl/maven

Creating m2 distribution for public consumption: http://www.codehaus.org/~jvanzyl/m2/m2-20040403.160446.tar.gz


Mime
View raw message