maven-issues mailing list archives

Site index · List index
Message view « Date » · « Thread »
Top « Date » · « Thread »
From "Hudson (Jira)" <j...@apache.org>
Subject [jira] [Commented] (MNG-6974) IT for MNG-5175 (Wagon HTTP) fails with JDK 14
Date Thu, 06 Aug 2020 10:59:00 GMT

    [ https://issues.apache.org/jira/browse/MNG-6974?page=com.atlassian.jira.plugin.system.issuetabpanels:comment-tabpanel&focusedCommentId=17172252#comment-17172252
] 

Hudson commented on MNG-6974:
-----------------------------

Build unstable in Jenkins: Maven » Maven TLP » maven » MNG-6169/MNG-6551 #5

See https://ci-builds.apache.org/job/Maven/job/maven-box/job/maven/job/MNG-6169%252FMNG-6551/5/

> IT for MNG-5175 (Wagon HTTP) fails with JDK 14
> ----------------------------------------------
>
>                 Key: MNG-6974
>                 URL: https://issues.apache.org/jira/browse/MNG-6974
>             Project: Maven
>          Issue Type: Bug
>          Components: Integration Tests
>            Reporter: Michael Kroll
>            Assignee: Michael Osipov
>            Priority: Major
>              Labels: pull-request-available, test
>
> [ERROR] Tests run: 846, Failures: 0, Errors: 1, Skipped: 0, Time elapsed: 210.078 s <<<
FAILURE! - in org.apache.maven.it.IntegrationTestSuite
> [ERROR] testmng5175_ReadTimeOutFromSettings(org.apache.maven.it.MavenITmng5175WagonHttpTest)
 Time elapsed: 0.166 s  <<< ERROR!
> org.apache.maven.it.VerificationException: Text not found in log: Could not transfer
artifact org.apache.maven.its.mng5175:fake-dependency:pom:1.0-SNAPSHOT
> 	at org.apache.maven.it.MavenITmng5175WagonHttpTest.testmng5175_ReadTimeOutFromSettings(MavenITmng5175WagonHttpTest.java:128)
> https://github.com/apache/maven/pull/368/checks?check_run_id=941247515



--
This message was sent by Atlassian Jira
(v8.3.4#803005)

Mime
View raw message