maven-issues mailing list archives

Site index · List index
Message view « Date » · « Thread »
Top « Date » · « Thread »
From "Tibor Digana (Jira)" <j...@apache.org>
Subject [jira] [Commented] (SUREFIRE-1757) maven-surefire-plugin versions starting from 2.22.0 do not run JUnit5 Test Suites junit-platform-runner
Date Mon, 02 Mar 2020 18:20:00 GMT

    [ https://issues.apache.org/jira/browse/SUREFIRE-1757?page=com.atlassian.jira.plugin.system.issuetabpanels:comment-tabpanel&focusedCommentId=17049523#comment-17049523
] 

Tibor Digana commented on SUREFIRE-1757:
----------------------------------------

Sorry i did not mention the repository.
We do not deploy snapshots to the Maven Central.
We have it in Apache Repo. This means add this section in your POM and it will work:

{noformat}
<pluginRepositories>
	<pluginRepository>
		<id>apache.snapshots</id>
		<name>Apache Development Snapshot Repository</name>
		<url>https://repository.apache.org/content/repositories/snapshots/</url>
		<releases>
			<enabled>false</enabled>
		</releases>
		<snapshots>
			<enabled>true</enabled>
		</snapshots>
	</pluginRepository>
</pluginRepositories>
{noformat}


> maven-surefire-plugin versions starting from 2.22.0 do not run JUnit5 Test Suites junit-platform-runner
> -------------------------------------------------------------------------------------------------------
>
>                 Key: SUREFIRE-1757
>                 URL: https://issues.apache.org/jira/browse/SUREFIRE-1757
>             Project: Maven Surefire
>          Issue Type: Bug
>          Components: JUnit 5.x support, Maven Surefire Plugin
>    Affects Versions: 2.22.0, 2.22.1, 2.22.2, 3.0.0-M2, 3.0.0-M1, 3.0.0-M3, 3.0.0-M4
>            Reporter: Denys Galyuk
>            Assignee: Tibor Digana
>            Priority: Major
>         Attachments: Build_Failure.png, Build_Success.png, tag.7z
>
>
> h1. {color:#00875A}plugin works with version 2.19.1 (or 2.20, or 2.21.0){color}
> I've attached the project archive to the bug report.
> h2. *Preconditions:*
> h3. pom.xml
> # *{color:#00875A}maven-surefire-plugin 2.19.1{color}* (or 2.20, or 2.21.0)
> # maven-compiler-plugin 3.8.1
> # junit-platform-runner 1.6.0
> # junit-jupiter-engine 5.6.0
> {code:xml}<?xml version="1.0" encoding="UTF-8"?>
> <project xmlns="http://maven.apache.org/POM/4.0.0"
>         xmlns:xsi="http://www.w3.org/2001/XMLSchema-instance"
>         xsi:schemaLocation="http://maven.apache.org/POM/4.0.0 http://maven.apache.org/xsd/maven-4.0.0.xsd">
>    <modelVersion>4.0.0</modelVersion>
>    <groupId>tag</groupId>
>    <artifactId>tag</artifactId>
>    <version>1.0-SNAPSHOT</version>
>    <dependencies>
>        <!-- https://mvnrepository.com/artifact/org.junit.jupiter/junit-jupiter-engine
-->
>        <dependency>
>            <groupId>org.junit.jupiter</groupId>
>            <artifactId>junit-jupiter-engine</artifactId>
>            <version>5.6.0</version>
>            <scope>test</scope>
>        </dependency>
>        <!-- https://mvnrepository.com/artifact/org.junit.platform/junit-platform-runner
-->
>        <dependency>
>            <groupId>org.junit.platform</groupId>
>            <artifactId>junit-platform-runner</artifactId>
>            <version>1.6.0</version>
>            <scope>test</scope>
>        </dependency>
>    </dependencies>
>    <build>
>        <plugins>
>            <!-- https://mvnrepository.com/artifact/org.apache.maven.plugins/maven-compiler-plugin
-->
>            <plugin>
>                <groupId>org.apache.maven.plugins</groupId>
>                <artifactId>maven-compiler-plugin</artifactId>
>                <version>3.8.1</version>
>                <configuration>
>                    <source>1.8</source>
>                    <target>1.8</target>
>                    <encoding>UTF-8</encoding>
>                </configuration>
>            </plugin>
>            <!-- https://mvnrepository.com/artifact/org.apache.maven.plugins/maven-surefire-plugin
-->
>            <plugin>
>                <groupId>org.apache.maven.plugins</groupId>
>                <artifactId>maven-surefire-plugin</artifactId>
> <!-- ALL PLUGIN VERSIONS BELOW DO NOT SEE THE JUNIT TEST SUITE AND AS A RESULT MAVEN
FAILS THE BUILD WITH THE ERROR:
>     No tests were executed! -->
> <!--                <version>2.22.2</version>-->
> <!--                <version>2.22.1</version>-->
> <!--                <version>2.22.0</version>-->
> <!--                <version>2.20.1</version>-->
> <!--                <version>3.0.0-M4</version>-->
> <!--                <version>3.0.0-M3</version>-->
> <!--                <version>3.0.0-M2</version>-->
> <!--                <version>3.0.0-M1</version>-->
> <!--                WORKING VERSIONS OF THE PLUGIN: JUnit5 Suites (based on tags)
+ Maven -->
>                <version>2.21.0</version>
> <!--                <version>2.20</version>-->
> <!--                <version>2.19.1</version>-->
>            </plugin>
>        </plugins>
>    </build>
> </project>
> {code}
> h3. Test class base on JUnit5: @Test,@Tag,@Tags
> {code:java}package tests.testsuites.suite1;
> import org.junit.jupiter.api.Tag;
> import org.junit.jupiter.api.Tags;
> import org.junit.jupiter.api.Test;
> import static org.junit.jupiter.api.Assertions.assertTrue;
> public class Suite2TestNameTagsTests {
>    @Test
>    @Tag("UAT")
>    void suite2_1Test() {
>        System.out.println("Suite2TestNameTagsTests:suite2_1Test(UAT tag)");
>        assertTrue(true);
>    }
>    @Test
>    @Tag("SMOKE")
>    void suite2_2Test() {
>        System.out.println("Suite2TestNameTagsTests:suite2_2Test(SMOKE tag)");
>        assertTrue(true);
>    }
>    @Test
>    @Tags({@Tag("SMOKE"), @Tag("UAT")})
>    void suite2_3Test() {
>        System.out.println("Suite2TestNameTagsTests:suite2_3Test(SMOKE and UAT tags)");
>        assertTrue(true);
>    }
> }{code}
> h3. JUnit5 Test Suite based on: @RunWith, @SelectPackages, @IncludeTags
> {code:java}package tests.suites;
> import org.junit.platform.runner.JUnitPlatform;
> import org.junit.platform.suite.api.IncludeTags;
> import org.junit.platform.suite.api.SelectPackages;
> import org.junit.runner.RunWith;
> @RunWith(JUnitPlatform.class)
> @SelectPackages("tests")
> @IncludeTags({"SMOKE","UAT"})
> public class SmokeAndUatSuiteTest {
> }{code}
> h3. Steps to reproduce: (Run the created test suite with maven)
> # Open terminal or GitBASH in the project folder
> # Run the command mvn clean test -Dtest=TestSuite
> h4. Actual Result: (something like this)
> {color:#00875A}*BUILD SUCCESS*
> *Tests run: 6, Failures: 0, Errors: 0, Skipped: 0*{color}
> {code}$ mvn clean test -Dtest=SmokeAndUatSuiteTest
> [INFO] Scanning for projects...
> [INFO]
> [INFO] ------------------------------< tag:tag >-------------------------------
> [INFO] Building tag 1.0-SNAPSHOT
> [INFO] --------------------------------[ jar ]---------------------------------
> [INFO]
> [INFO] --- maven-clean-plugin:2.5:clean (default-clean) @ tag ---
> [INFO] Deleting C:\Users\galyuk\IdeaProjects\tag\target
> [INFO]
> [INFO] --- maven-resources-plugin:2.6:resources (default-resources) @ tag ---
> [WARNING] Using platform encoding (Cp1252 actually) to copy filtered resources, i.e.
build is platform dependent!
> [INFO] Copying 0 resource
> [INFO]
> [INFO] --- maven-compiler-plugin:3.8.1:compile (default-compile) @ tag ---
> [INFO] Nothing to compile - all classes are up to date
> [INFO]
> [INFO] --- maven-resources-plugin:2.6:testResources (default-testResources) @ tag ---
> [WARNING] Using platform encoding (Cp1252 actually) to copy filtered resources, i.e.
build is platform dependent!
> [INFO] skip non existing resourceDirectory C:\Users\galyuk\IdeaProjects\tag\src\test\resources
> [INFO]
> [INFO] --- maven-compiler-plugin:3.8.1:testCompile (default-testCompile) @ tag ---
> [INFO] Changes detected - recompiling the module!
> [INFO] Compiling 11 source files to C:\Users\galyuk\IdeaProjects\tag\target\test-classes
> [INFO]
> [INFO] --- maven-surefire-plugin:2.21.0:test (default-test) @ tag ---
> [INFO]
> [INFO] -------------------------------------------------------
> [INFO]  T E S T S
> [INFO] -------------------------------------------------------
> [INFO] Running tests.suites.SmokeAndUatSuiteTest
> Suite2TestNameTagsTests:suite2_1Test(UAT tag)
> Suite2TestNameTagsTests:suite2_2Test(SMOKE tag)
> Suite2TestNameTagsTests:suite2_3Test(SMOKE and UAT tags)
> Suite3ClassNameTagsTests(SMOKE and UAT tags):suite3_1Test
> Suite4TestNameTagsTests(SMOKE tag):suite4_1Test
> Suite1ClassNameTagsTests(UAT tag):suite1_1Test
> [INFO] Tests run: 6, Failures: 0, Errors: 0, Skipped: 0, Time elapsed: 0.595 s - in tests.suites.SmokeAndUatSuiteTest
> [INFO]
> [INFO] Results:
> [INFO]
> [INFO] Tests run: 6, Failures: 0, Errors: 0, Skipped: 0
> [INFO]
> [INFO] ------------------------------------------------------------------------
> [INFO] BUILD SUCCESS
> [INFO] ------------------------------------------------------------------------
> [INFO] Total time:  5.915 s
> [INFO] Finished at: 2020-02-28T16:17:00+02:00
> [INFO] ------------------------------------------------------------------------{code}
> !Build_Success.png!
> h1. {color:#DE350B}*plugin does not work with versions 2.22.0 and higher*{color}
> h2. *Preconditions:*
> # Change the version of the maven-surefire-plugin in the pom.xml to any from the list
below:
> {code}2.20.1
> 2.22.0
> 2.22.1
> 2.22.2
> 3.0.0-M1
> 3.0.0-M2
> 3.0.0-M3
> 3.0.0-M4{code}
> h3. Steps to reproduce: (Run the created test suite with maven)
> # Open terminal or GitBASH in the project folder
> # Run the command mvn clean test -Dtest=TestSuite
> h4. Actual Result: (something like this)
> {color:#DE350B}*BUILD FAILURE: No tests were executed!*{color}
> {code}$ mvn clean test -Dtest=SmokeAndUatSuiteTest
> [INFO] Scanning for projects...
> [INFO]
> [INFO] ------------------------------< tag:tag >-------------------------------
> [INFO] Building tag 1.0-SNAPSHOT
> [INFO] --------------------------------[ jar ]---------------------------------
> [INFO]
> [INFO] --- maven-clean-plugin:2.5:clean (default-clean) @ tag ---
> [INFO] Deleting C:\Users\galyuk\IdeaProjects\tag\target
> [INFO]
> [INFO] --- maven-resources-plugin:2.6:resources (default-resources) @ tag ---
> [WARNING] Using platform encoding (Cp1252 actually) to copy filtered resources, i.e.
build is platform dependent!
> [INFO] Copying 0 resource
> [INFO]
> [INFO] --- maven-compiler-plugin:3.8.1:compile (default-compile) @ tag ---
> [INFO] Nothing to compile - all classes are up to date
> [INFO]
> [INFO] --- maven-resources-plugin:2.6:testResources (default-testResources) @ tag ---
> [WARNING] Using platform encoding (Cp1252 actually) to copy filtered resources, i.e.
build is platform dependent!
> [INFO] skip non existing resourceDirectory C:\Users\galyuk\IdeaProjects\tag\src\test\resources
> [INFO]
> [INFO] --- maven-compiler-plugin:3.8.1:testCompile (default-testCompile) @ tag ---
> [INFO] Changes detected - recompiling the module!
> [INFO] Compiling 11 source files to C:\Users\galyuk\IdeaProjects\tag\target\test-classes
> [INFO]
> [INFO] --- maven-surefire-plugin:2.22.1:test (default-test) @ tag ---
> [INFO]
> [INFO] -------------------------------------------------------
> [INFO]  T E S T S
> [INFO] -------------------------------------------------------
> [INFO]
> [INFO] Results:
> [INFO]
> [INFO] Tests run: 0, Failures: 0, Errors: 0, Skipped: 0
> [INFO]
> [INFO] ------------------------------------------------------------------------
> [INFO] BUILD FAILURE
> [INFO] ------------------------------------------------------------------------
> [INFO] Total time:  5.611 s
> [INFO] Finished at: 2020-02-28T16:16:42+02:00
> [INFO] ------------------------------------------------------------------------
> [ERROR] Failed to execute goal org.apache.maven.plugins:maven-surefire-plugin:2.22.1:test
(default-test) on project tag: No tests were executed!  (Set -DfailIfNoTests=false to ignore
this error.) -> [Help 1]
> [ERROR]
> [ERROR] To see the full stack trace of the errors, re-run Maven with the -e switch.
> [ERROR] Re-run Maven using the -X switch to enable full debug logging.
> [ERROR]
> [ERROR] For more information about the errors and possible solutions, please read the
following articles:
> [ERROR] [Help 1] http://cwiki.apache.org/confluence/display/MAVEN/MojoFailureException{code}
> !Build_Failure.png! 
> ----
> Please fix :)



--
This message was sent by Atlassian Jira
(v8.3.4#803005)

Mime
View raw message