maven-issues mailing list archives

Site index · List index
Message view « Date » · « Thread »
Top « Date » · « Thread »
From "Karl Heinz Marbaise (Jira)" <j...@apache.org>
Subject [jira] [Closed] (MCOMPILER-403) Spring Lombok -Werror [ERROR] An unknown compilation problem occurred
Date Sun, 29 Mar 2020 08:35:00 GMT

     [ https://issues.apache.org/jira/browse/MCOMPILER-403?page=com.atlassian.jira.plugin.system.issuetabpanels:all-tabpanel
]

Karl Heinz Marbaise closed MCOMPILER-403.
-----------------------------------------
    Resolution: Not A Problem

> Spring Lombok -Werror [ERROR] An unknown compilation problem occurred
> ---------------------------------------------------------------------
>
>                 Key: MCOMPILER-403
>                 URL: https://issues.apache.org/jira/browse/MCOMPILER-403
>             Project: Maven Compiler Plugin
>          Issue Type: Bug
>    Affects Versions: 3.8.1
>         Environment: Windows 10 Apache Maven 3.6.1, Java 1.8.0_231 or 11.0.4
>            Reporter: Igor Rybak
>            Priority: Major
>         Attachments: spring-lombok-werror-bug-demo.zip
>
>
> Compilation fails with -Werror and Lombok in Spring Boot project with the message "An
unknown compilation problem occurred"
> Steps to reproduce:
> 1. Open the sample project spring-lombok-werror-bug-demo.zip
> 2. run {{mvn clean package}} in the root of the project (Apache Maven 3.6.1, Java
1.8.0_231 or 11.0.4)
> Here is the same issue on Lombok GitHub repository:
> [https://github.com/rzwitserloot/lombok/issues/2285]
> {code:java}
> [INFO] ------------------------------------------------------------------------
> [INFO] BUILD FAILURE
> [INFO] ------------------------------------------------------------------------
> [INFO] Total time: 5.698 s
> [INFO] Finished at: 2019-11-07T14:48:32+02:00
> [INFO] ------------------------------------------------------------------------
> [ERROR] Failed to execute goal org.apache.maven.plugins:maven-compiler-plugin:3.8.1:compile
(default-compile) on project spring-lombok-demo: Compilation failure -> [Help 1]
> org.apache.maven.lifecycle.LifecycleExecutionException: Failed to execute goal org.apache.maven.plugins:maven-compiler-plugin:3.8.1:compile
(default-compile) on project spring-lombok-demo: Compilation failure
>  at org.apache.maven.lifecycle.internal.MojoExecutor.execute (MojoExecutor.java:215)
>  at org.apache.maven.lifecycle.internal.MojoExecutor.execute (MojoExecutor.java:156)
>  at org.apache.maven.lifecycle.internal.MojoExecutor.execute (MojoExecutor.java:148)
>  at org.apache.maven.lifecycle.internal.LifecycleModuleBuilder.buildProject (LifecycleModuleBuilder.java:117)
>  at org.apache.maven.lifecycle.internal.LifecycleModuleBuilder.buildProject (LifecycleModuleBuilder.java:81)
>  at org.apache.maven.lifecycle.internal.builder.singlethreaded.SingleThreadedBuilder.build
(SingleThreadedBuilder.java:56)
>  at org.apache.maven.lifecycle.internal.LifecycleStarter.execute (LifecycleStarter.java:128)
>  at org.apache.maven.DefaultMaven.doExecute (DefaultMaven.java:305)
>  at org.apache.maven.DefaultMaven.doExecute (DefaultMaven.java:192)
>  at org.apache.maven.DefaultMaven.execute (DefaultMaven.java:105)
>  at org.apache.maven.cli.MavenCli.execute (MavenCli.java:956)
>  at org.apache.maven.cli.MavenCli.doMain (MavenCli.java:288)
>  at org.apache.maven.cli.MavenCli.main (MavenCli.java:192)
>  at sun.reflect.NativeMethodAccessorImpl.invoke0 (Native Method)
>  at sun.reflect.NativeMethodAccessorImpl.invoke (NativeMethodAccessorImpl.java:62)
>  at sun.reflect.DelegatingMethodAccessorImpl.invoke (DelegatingMethodAccessorImpl.java:43)
>  at java.lang.reflect.Method.invoke (Method.java:498)
>  at org.codehaus.plexus.classworlds.launcher.Launcher.launchEnhanced (Launcher.java:282)
>  at org.codehaus.plexus.classworlds.launcher.Launcher.launch (Launcher.java:225)
>  at org.codehaus.plexus.classworlds.launcher.Launcher.mainWithExitCode (Launcher.java:406)
>  at org.codehaus.plexus.classworlds.launcher.Launcher.main (Launcher.java:347)
> Caused by: org.apache.maven.plugin.compiler.CompilationFailureException: Compilation
failure
>  at org.apache.maven.plugin.compiler.AbstractCompilerMojo.execute (AbstractCompilerMojo.java:1224)
>  at org.apache.maven.plugin.compiler.CompilerMojo.execute (CompilerMojo.java:187)
>  at org.apache.maven.plugin.DefaultBuildPluginManager.executeMojo (DefaultBuildPluginManager.java:137)
>  at org.apache.maven.lifecycle.internal.MojoExecutor.execute (MojoExecutor.java:210)
>  at org.apache.maven.lifecycle.internal.MojoExecutor.execute (MojoExecutor.java:156)
>  at org.apache.maven.lifecycle.internal.MojoExecutor.execute (MojoExecutor.java:148)
>  at org.apache.maven.lifecycle.internal.LifecycleModuleBuilder.buildProject (LifecycleModuleBuilder.java:117)
>  at org.apache.maven.lifecycle.internal.LifecycleModuleBuilder.buildProject (LifecycleModuleBuilder.java:81)
>  at org.apache.maven.lifecycle.internal.builder.singlethreaded.SingleThreadedBuilder.build
(SingleThreadedBuilder.java:56)
>  at org.apache.maven.lifecycle.internal.LifecycleStarter.execute (LifecycleStarter.java:128)
>  at org.apache.maven.DefaultMaven.doExecute (DefaultMaven.java:305)
>  at org.apache.maven.DefaultMaven.doExecute (DefaultMaven.java:192)
>  at org.apache.maven.DefaultMaven.execute (DefaultMaven.java:105)
>  at org.apache.maven.cli.MavenCli.execute (MavenCli.java:956)
>  at org.apache.maven.cli.MavenCli.doMain (MavenCli.java:288)
>  at org.apache.maven.cli.MavenCli.main (MavenCli.java:192)
>  at sun.reflect.NativeMethodAccessorImpl.invoke0 (Native Method)
>  at sun.reflect.NativeMethodAccessorImpl.invoke (NativeMethodAccessorImpl.java:62)
>  at sun.reflect.DelegatingMethodAccessorImpl.invoke (DelegatingMethodAccessorImpl.java:43)
>  at java.lang.reflect.Method.invoke (Method.java:498)
>  at org.codehaus.plexus.classworlds.launcher.Launcher.launchEnhanced (Launcher.java:282)
>  at org.codehaus.plexus.classworlds.launcher.Launcher.launch (Launcher.java:225)
>  at org.codehaus.plexus.classworlds.launcher.Launcher.mainWithExitCode (Launcher.java:406)
>  at org.codehaus.plexus.classworlds.launcher.Launcher.main (Launcher.java:347)
> [ERROR]
> [ERROR]
> [ERROR] For more information about the errors and possible solutions, please read the
following articles:
> [ERROR] [Help 1] http://cwiki.apache.org/confluence/display/MAVEN/MojoFailureException{code}



--
This message was sent by Atlassian Jira
(v8.3.4#803005)

Mime
View raw message