maven-issues mailing list archives

Site index · List index
Message view « Date » · « Thread »
Top « Date » · « Thread »
From "Rafal Gorzkowski (JIRA)" <j...@apache.org>
Subject [jira] [Comment Edited] (SUREFIRE-1499) VM crash with Alpine linux and openjdk
Date Tue, 30 Oct 2018 18:59:00 GMT

    [ https://issues.apache.org/jira/browse/SUREFIRE-1499?page=com.atlassian.jira.plugin.system.issuetabpanels:comment-tabpanel&focusedCommentId=16669194#comment-16669194
] 

Rafal Gorzkowski edited comment on SUREFIRE-1499 at 10/30/18 6:58 PM:
----------------------------------------------------------------------

Today I've found the exact same problem with maven:latest (3.5.4) on my gitlab ci:
{code:java}
[ERROR] Failed to execute goal org.apache.maven.plugins:maven-surefire-plugin:2.20.1:test
(default-test) on project my_project: There are test failures.
[ERROR] 
[ERROR] Please refer to /builds/my_project/target/surefire-reports for the individual test
results.
[ERROR] Please refer to dump files (if any exist) [date]-jvmRun[N].dump, [date].dumpstream
and [date]-jvmRun[N].dumpstream.
[ERROR] The forked VM terminated without properly saying goodbye. VM crash or System.exit
called?
[ERROR] Command was /bin/sh -c cd /builds/my_project && /usr/lib/jvm/java-8-openjdk-amd64/jre/bin/java
-jar /builds/my_project/target/surefire/surefirebooter3651114352101108488.jar /builds/my_project/target/surefire
2018-10-30T11-00-04_537-jvmRun1 surefire5609317469396221035tmp surefire_01511940011423658046tmp
[ERROR] Error occurred in starting fork, check output in log
[ERROR] Process Exit Code: 1
[ERROR] org.apache.maven.surefire.booter.SurefireBooterForkException: The forked VM terminated
without properly saying goodbye. VM crash or System.exit called?
[ERROR] Command was /bin/sh -c cd /builds/my_project&& /usr/lib/jvm/java-8-openjdk-amd64/jre/bin/java
-jar /builds/my_project/target/surefire/surefirebooter3651114352101108488.jar /builds/my_project/target/surefire
2018-10-30T11-00-04_537-jvmRun1 surefire5609317469396221035tmp surefire_01511940011423658046tmp
[ERROR] Error occurred in starting fork, check output in log
[ERROR] Process Exit Code: 1
[ERROR] at org.apache.maven.plugin.surefire.booterclient.ForkStarter.fork(ForkStarter.java:686)
[ERROR] at org.apache.maven.plugin.surefire.booterclient.ForkStarter.fork(ForkStarter.java:535)
[ERROR] at org.apache.maven.plugin.surefire.booterclient.ForkStarter.run(ForkStarter.java:280)
[ERROR] at org.apache.maven.plugin.surefire.booterclient.ForkStarter.run(ForkStarter.java:245)
[ERROR] at org.apache.maven.plugin.surefire.AbstractSurefireMojo.executeProvider(AbstractSurefireMojo.java:1124)
[ERROR] at org.apache.maven.plugin.surefire.AbstractSurefireMojo.executeAfterPreconditionsChecked(AbstractSurefireMojo.java:954)
[ERROR] at org.apache.maven.plugin.surefire.AbstractSurefireMojo.execute(AbstractSurefireMojo.java:832)
[ERROR] at org.apache.maven.plugin.DefaultBuildPluginManager.executeMojo(DefaultBuildPluginManager.java:137)
[ERROR] at org.apache.maven.lifecycle.internal.MojoExecutor.execute(MojoExecutor.java:208)
[ERROR] at org.apache.maven.lifecycle.internal.MojoExecutor.execute(MojoExecutor.java:154)
[ERROR] at org.apache.maven.lifecycle.internal.MojoExecutor.execute(MojoExecutor.java:146)
[ERROR] at org.apache.maven.lifecycle.internal.LifecycleModuleBuilder.buildProject(LifecycleModuleBuilder.java:117)
[ERROR] at org.apache.maven.lifecycle.internal.LifecycleModuleBuilder.buildProject(LifecycleModuleBuilder.java:81)
[ERROR] at org.apache.maven.lifecycle.internal.builder.singlethreaded.SingleThreadedBuilder.build(SingleThreadedBuilder.java:56)
[ERROR] at org.apache.maven.lifecycle.internal.LifecycleStarter.execute(LifecycleStarter.java:128)
[ERROR] at org.apache.maven.DefaultMaven.doExecute(DefaultMaven.java:305)
[ERROR] at org.apache.maven.DefaultMaven.doExecute(DefaultMaven.java:192)
[ERROR] at org.apache.maven.DefaultMaven.execute(DefaultMaven.java:105)
[ERROR] at org.apache.maven.cli.MavenCli.execute(MavenCli.java:954)
[ERROR] at org.apache.maven.cli.MavenCli.doMain(MavenCli.java:288)
[ERROR] at org.apache.maven.cli.MavenCli.main(MavenCli.java:192)
[ERROR] at sun.reflect.NativeMethodAccessorImpl.invoke0(Native Method)
[ERROR] at sun.reflect.NativeMethodAccessorImpl.invoke(NativeMethodAccessorImpl.java:62)
[ERROR] at sun.reflect.DelegatingMethodAccessorImpl.invoke(DelegatingMethodAccessorImpl.java:43)
[ERROR] at java.lang.reflect.Method.invoke(Method.java:498)
[ERROR] at org.codehaus.plexus.classworlds.launcher.Launcher.launchEnhanced(Launcher.java:289)
[ERROR] at org.codehaus.plexus.classworlds.launcher.Launcher.launch(Launcher.java:229)
[ERROR] at org.codehaus.plexus.classworlds.launcher.Launcher.mainWithExitCode(Launcher.java:415)
[ERROR] at org.codehaus.plexus.classworlds.launcher.Launcher.main(Launcher.java:356)
[ERROR] -> [Help 1]
[ERROR] 
[ERROR] To see the full stack trace of the errors, re-run Maven with the -e switch.
[ERROR] Re-run Maven using the -X switch to enable full debug logging.
[ERROR] 
[ERROR] For more information about the errors and possible solutions, please read the following
articles:
[ERROR] [Help 1] http://cwiki.apache.org/confluence/display/MAVEN/MojoExecutionException
ERROR: Job failed: exit code 1

{code}
And here is maven and java version from maven:latest (3.5.4)
{code:java}
root@f670f6b4caa6:/# java -version
openjdk version "1.8.0_181"
OpenJDK Runtime Environment (build 1.8.0_181-8u181-b13-2~deb9u1-b13)
OpenJDK 64-Bit Server VM (build 25.181-b13, mixed mode){code}
 
{code:java}
root@f670f6b4caa6:/# mvn -version
Apache Maven 3.5.4 (1edded0938998edf8bf061f1ceb3cfdeccf443fe; 2018-06-17T18:33:14Z)
Maven home: /usr/share/maven
Java version: 1.8.0_181, vendor: Oracle Corporation, runtime: /usr/lib/jvm/java-8-openjdk-amd64/jre
Default locale: en, platform encoding: UTF-8
OS name: "linux", version: "4.15.0-38-generic", arch: "amd64", family: "unix"{code}
 

Docker image sha:
{code:java}
$ docker images --digests
maven latest sha256:27cae095c9974249ab0647b6a3ac72c0ba7083426f5e4086db3dfbe5f989bb4c 985f3637ded4
16 hours ago 635MB{code}


was (Author: rafalgorzkowski):
Today I've found the exact same problem with maven:latest (3.5.4) on my gitlab ci:
{code:java}
[ERROR] Failed to execute goal org.apache.maven.plugins:maven-surefire-plugin:2.20.1:test
(default-test) on project my_project: There are test failures.
[ERROR] 
[ERROR] Please refer to /builds/my_project/target/surefire-reports for the individual test
results.
[ERROR] Please refer to dump files (if any exist) [date]-jvmRun[N].dump, [date].dumpstream
and [date]-jvmRun[N].dumpstream.
[ERROR] The forked VM terminated without properly saying goodbye. VM crash or System.exit
called?
[ERROR] Command was /bin/sh -c cd /builds/my_project && /usr/lib/jvm/java-8-openjdk-amd64/jre/bin/java
-jar /builds/my_project/target/surefire/surefirebooter3651114352101108488.jar /builds/my_project/target/surefire
2018-10-30T11-00-04_537-jvmRun1 surefire5609317469396221035tmp surefire_01511940011423658046tmp
[ERROR] Error occurred in starting fork, check output in log
[ERROR] Process Exit Code: 1
[ERROR] org.apache.maven.surefire.booter.SurefireBooterForkException: The forked VM terminated
without properly saying goodbye. VM crash or System.exit called?
[ERROR] Command was /bin/sh -c cd /builds/my_project&& /usr/lib/jvm/java-8-openjdk-amd64/jre/bin/java
-jar /builds/my_project/target/surefire/surefirebooter3651114352101108488.jar /builds/my_project/target/surefire
2018-10-30T11-00-04_537-jvmRun1 surefire5609317469396221035tmp surefire_01511940011423658046tmp
[ERROR] Error occurred in starting fork, check output in log
[ERROR] Process Exit Code: 1
[ERROR] at org.apache.maven.plugin.surefire.booterclient.ForkStarter.fork(ForkStarter.java:686)
[ERROR] at org.apache.maven.plugin.surefire.booterclient.ForkStarter.fork(ForkStarter.java:535)
[ERROR] at org.apache.maven.plugin.surefire.booterclient.ForkStarter.run(ForkStarter.java:280)
[ERROR] at org.apache.maven.plugin.surefire.booterclient.ForkStarter.run(ForkStarter.java:245)
[ERROR] at org.apache.maven.plugin.surefire.AbstractSurefireMojo.executeProvider(AbstractSurefireMojo.java:1124)
[ERROR] at org.apache.maven.plugin.surefire.AbstractSurefireMojo.executeAfterPreconditionsChecked(AbstractSurefireMojo.java:954)
[ERROR] at org.apache.maven.plugin.surefire.AbstractSurefireMojo.execute(AbstractSurefireMojo.java:832)
[ERROR] at org.apache.maven.plugin.DefaultBuildPluginManager.executeMojo(DefaultBuildPluginManager.java:137)
[ERROR] at org.apache.maven.lifecycle.internal.MojoExecutor.execute(MojoExecutor.java:208)
[ERROR] at org.apache.maven.lifecycle.internal.MojoExecutor.execute(MojoExecutor.java:154)
[ERROR] at org.apache.maven.lifecycle.internal.MojoExecutor.execute(MojoExecutor.java:146)
[ERROR] at org.apache.maven.lifecycle.internal.LifecycleModuleBuilder.buildProject(LifecycleModuleBuilder.java:117)
[ERROR] at org.apache.maven.lifecycle.internal.LifecycleModuleBuilder.buildProject(LifecycleModuleBuilder.java:81)
[ERROR] at org.apache.maven.lifecycle.internal.builder.singlethreaded.SingleThreadedBuilder.build(SingleThreadedBuilder.java:56)
[ERROR] at org.apache.maven.lifecycle.internal.LifecycleStarter.execute(LifecycleStarter.java:128)
[ERROR] at org.apache.maven.DefaultMaven.doExecute(DefaultMaven.java:305)
[ERROR] at org.apache.maven.DefaultMaven.doExecute(DefaultMaven.java:192)
[ERROR] at org.apache.maven.DefaultMaven.execute(DefaultMaven.java:105)
[ERROR] at org.apache.maven.cli.MavenCli.execute(MavenCli.java:954)
[ERROR] at org.apache.maven.cli.MavenCli.doMain(MavenCli.java:288)
[ERROR] at org.apache.maven.cli.MavenCli.main(MavenCli.java:192)
[ERROR] at sun.reflect.NativeMethodAccessorImpl.invoke0(Native Method)
[ERROR] at sun.reflect.NativeMethodAccessorImpl.invoke(NativeMethodAccessorImpl.java:62)
[ERROR] at sun.reflect.DelegatingMethodAccessorImpl.invoke(DelegatingMethodAccessorImpl.java:43)
[ERROR] at java.lang.reflect.Method.invoke(Method.java:498)
[ERROR] at org.codehaus.plexus.classworlds.launcher.Launcher.launchEnhanced(Launcher.java:289)
[ERROR] at org.codehaus.plexus.classworlds.launcher.Launcher.launch(Launcher.java:229)
[ERROR] at org.codehaus.plexus.classworlds.launcher.Launcher.mainWithExitCode(Launcher.java:415)
[ERROR] at org.codehaus.plexus.classworlds.launcher.Launcher.main(Launcher.java:356)
[ERROR] -> [Help 1]
[ERROR] 
[ERROR] To see the full stack trace of the errors, re-run Maven with the -e switch.
[ERROR] Re-run Maven using the -X switch to enable full debug logging.
[ERROR] 
[ERROR] For more information about the errors and possible solutions, please read the following
articles:
[ERROR] [Help 1] http://cwiki.apache.org/confluence/display/MAVEN/MojoExecutionException
ERROR: Job failed: exit code 1

{code}
And here is maven and java version from maven:latest (3.5.4)
{code:java}
root@f670f6b4caa6:/# java -version
openjdk version "1.8.0_181"
OpenJDK Runtime Environment (build 1.8.0_181-8u181-b13-2~deb9u1-b13)
OpenJDK 64-Bit Server VM (build 25.181-b13, mixed mode){code}
 
{code:java}
root@f670f6b4caa6:/# mvn -version
Apache Maven 3.5.4 (1edded0938998edf8bf061f1ceb3cfdeccf443fe; 2018-06-17T18:33:14Z)
Maven home: /usr/share/maven
Java version: 1.8.0_181, vendor: Oracle Corporation, runtime: /usr/lib/jvm/java-8-openjdk-amd64/jre
Default locale: en, platform encoding: UTF-8
OS name: "linux", version: "4.15.0-38-generic", arch: "amd64", family: "unix"{code}
 

> VM crash with Alpine linux and openjdk
> --------------------------------------
>
>                 Key: SUREFIRE-1499
>                 URL: https://issues.apache.org/jira/browse/SUREFIRE-1499
>             Project: Maven Surefire
>          Issue Type: Bug
>            Reporter: Dave Syer
>            Priority: Major
>
> I have seen other similar looking issues, but none that are obviously crisply the same
(https://issues.apache.org/jira/browse/SUREFIRE-1303, https://issues.apache.org/jira/browse/SUREFIRE-1408,
https://issues.apache.org/jira/browse/SUREFIRE-1478). This is pretty easy to reproduce with
just docker. Here's a sample that shows the problem [https://github.com/scratches/surefire-crash.] The
README tells you how to fiddle around to work around it (downgrade surefire, or change the
JDK).
>  
> Copied from there:
> {noformat}
> # ./mvnw install
> ...
> [ERROR] Failed to execute goal org.apache.maven.plugins:maven-surefire-plugin:2.20.1:test
(default-test) on project appo: There are test failures.
> [ERROR] 
> [ERROR] Please refer to /source/target/surefire-reports for the individual test results.
> [ERROR] Please refer to dump files (if any exist) [date]-jvmRun[N].dump, [date].dumpstream
and [date]-jvmRun[N].dumpstream.
> [ERROR] The forked VM terminated without properly saying goodbye. VM crash or System.exit
called?
> [ERROR] Command was /bin/sh -c cd /source && /usr/lib/jvm/java-1.8-openjdk/jre/bin/java
-jar /source/target/surefire/surefirebooter3510938747541906908.jar /source/target/surefire
2018-03-12T08-53-57_688-jvmRun1 surefire77870329121965774tmp surefire_03692097491311877891tmp
> [ERROR] Error occurred in starting fork, check output in log
> [ERROR] Process Exit Code: 1
> [ERROR] org.apache.maven.surefire.booter.SurefireBooterForkException: The forked VM terminated
without properly saying goodbye. VM crash or System.exit called?
> [ERROR] Command was /bin/sh -c cd /source && /usr/lib/jvm/java-1.8-openjdk/jre/bin/java
-jar /source/target/surefire/surefirebooter3510938747541906908.jar /source/target/surefire
2018-03-12T08-53-57_688-jvmRun1 surefire77870329121965774tmp surefire_03692097491311877891tmp
> [ERROR] Error occurred in starting fork, check output in log
> [ERROR] Process Exit Code: 1
> [ERROR] 	at org.apache.maven.plugin.surefire.booterclient.ForkStarter.fork(ForkStarter.java:686)
> [ERROR] 	at org.apache.maven.plugin.surefire.booterclient.ForkStarter.fork(ForkStarter.java:535)
> [ERROR] 	at org.apache.maven.plugin.surefire.booterclient.ForkStarter.run(ForkStarter.java:280)
> [ERROR] 	at org.apache.maven.plugin.surefire.booterclient.ForkStarter.run(ForkStarter.java:245)
> [ERROR] 	at org.apache.maven.plugin.surefire.AbstractSurefireMojo.executeProvider(AbstractSurefireMojo.java:1124)
> [ERROR] 	at org.apache.maven.plugin.surefire.AbstractSurefireMojo.executeAfterPreconditionsChecked(AbstractSurefireMojo.java:954)
> [ERROR] 	at org.apache.maven.plugin.surefire.AbstractSurefireMojo.execute(AbstractSurefireMojo.java:832)
> [ERROR] 	at org.apache.maven.plugin.DefaultBuildPluginManager.executeMojo(DefaultBuildPluginManager.java:134)
> [ERROR] 	at org.apache.maven.lifecycle.internal.MojoExecutor.execute(MojoExecutor.java:208)
> [ERROR] 	at org.apache.maven.lifecycle.internal.MojoExecutor.execute(MojoExecutor.java:154)
> [ERROR] 	at org.apache.maven.lifecycle.internal.MojoExecutor.execute(MojoExecutor.java:146)
> [ERROR] 	at org.apache.maven.lifecycle.internal.LifecycleModuleBuilder.buildProject(LifecycleModuleBuilder.java:117)
> [ERROR] 	at org.apache.maven.lifecycle.internal.LifecycleModuleBuilder.buildProject(LifecycleModuleBuilder.java:81)
> [ERROR] 	at org.apache.maven.lifecycle.internal.builder.singlethreaded.SingleThreadedBuilder.build(SingleThreadedBuilder.java:51)
> [ERROR] 	at org.apache.maven.lifecycle.internal.LifecycleStarter.execute(LifecycleStarter.java:128)
> [ERROR] 	at org.apache.maven.DefaultMaven.doExecute(DefaultMaven.java:309)
> [ERROR] 	at org.apache.maven.DefaultMaven.doExecute(DefaultMaven.java:194)
> [ERROR] 	at org.apache.maven.DefaultMaven.execute(DefaultMaven.java:107)
> [ERROR] 	at org.apache.maven.cli.MavenCli.execute(MavenCli.java:955)
> [ERROR] 	at org.apache.maven.cli.MavenCli.doMain(MavenCli.java:290)
> [ERROR] 	at org.apache.maven.cli.MavenCli.main(MavenCli.java:194)
> [ERROR] 	at sun.reflect.NativeMethodAccessorImpl.invoke0(Native Method)
> [ERROR] 	at sun.reflect.NativeMethodAccessorImpl.invoke(NativeMethodAccessorImpl.java:62)
> [ERROR] 	at sun.reflect.DelegatingMethodAccessorImpl.invoke(DelegatingMethodAccessorImpl.java:43)
> ...{noformat}



--
This message was sent by Atlassian JIRA
(v7.6.3#76005)

Mime
View raw message