maven-issues mailing list archives

Site index · List index
Message view « Date » · « Thread »
Top « Date » · « Thread »
From "Robert Scholte (JIRA)" <j...@apache.org>
Subject [jira] [Commented] (MNG-6429) Integration Test site publishing requires Java 7 (or javadoc errors ignored)
Date Sat, 23 Jun 2018 17:59:00 GMT

    [ https://issues.apache.org/jira/browse/MNG-6429?page=com.atlassian.jira.plugin.system.issuetabpanels:comment-tabpanel&focusedCommentId=16521224#comment-16521224
] 

Robert Scholte commented on MNG-6429:
-------------------------------------

Now seeing this is on the integration tests only. Do we really want to publish this? What's
the real benefit of it? Why not drop it?

> Integration Test site publishing requires Java 7 (or javadoc errors ignored)
> ----------------------------------------------------------------------------
>
>                 Key: MNG-6429
>                 URL: https://issues.apache.org/jira/browse/MNG-6429
>             Project: Maven
>          Issue Type: Bug
>    Affects Versions: 3.5.4
>            Reporter: Stephen Connolly
>            Priority: Critical
>             Fix For: 3.6.0-candidate
>
>
> {code:java}
> [INFO] 
> 7 errors
> [INFO] ------------------------------------------------------------------------
> [INFO] Reactor Summary:
> [INFO] 
> [INFO] Maven Core ITs 2.1-SNAPSHOT ........................ SUCCESS [ 38.586 s]
> [INFO] Maven IT Support ................................... SUCCESS [ 2.726 s]
> [INFO] Maven IT :: Plugins ................................ SUCCESS [ 2.693 s]
> [INFO] Maven IT Plugin :: Active Collection ............... FAILURE [ 15.162 s]
> [INFO] Maven IT Plugin :: Ant-Based ....................... SKIPPED
> [INFO] Maven IT Plugin :: Artifact ........................ SKIPPED
> [INFO] Maven IT Plugin :: Class Loader :: Dependency A .... SKIPPED
> [INFO] Maven IT Plugin :: Class Loader :: Dependency B .... SKIPPED
> [INFO] Maven IT Plugin :: Class Loader :: Dependency C .... SKIPPED
> [INFO] Maven IT Plugin :: Class Loader .................... SKIPPED
> [INFO] Maven IT Plugin :: Class Loader :: Aggregator ...... SKIPPED
> [INFO] Maven IT Plugin :: Configuration ................... SKIPPED
> [INFO] Maven IT Plugin :: Context Passing ................. SKIPPED
> [INFO] Maven ITs :: Core Plugin Stubs ..................... SKIPPED
> [INFO] Maven IT Clean Plugin Stub 0.1-stub-SNAPSHOT ....... SKIPPED
> [INFO] Maven IT Compiler Plugin Stub 0.1-stub-SNAPSHOT .... SKIPPED
> [INFO] Maven IT Deploy Plugin Stub 0.1-stub-SNAPSHOT ...... SKIPPED
> [INFO] Maven IT EAR Plugin Stub 0.1-stub-SNAPSHOT ......... SKIPPED
> [INFO] Maven IT EJB Plugin Stub 0.1-stub-SNAPSHOT ......... SKIPPED
> [INFO] Maven IT Install Plugin Stub 0.1-stub-SNAPSHOT ..... SKIPPED
> [INFO] Maven IT JAR Plugin Stub 0.1-stub-SNAPSHOT ......... SKIPPED
> [INFO] Maven IT Javadoc Plugin Stub 0.1-stub-SNAPSHOT ..... SKIPPED
> [INFO] Maven IT Plugin Plugin Stub 0.1-stub-SNAPSHOT ...... SKIPPED
> [INFO] Maven IT RAR Plugin Stub 0.1-stub-SNAPSHOT ......... SKIPPED
> [INFO] Maven IT Resources Plugin Stub 0.1-stub-SNAPSHOT ... SKIPPED
> [INFO] Maven IT Site Plugin Stub 0.1-stub-SNAPSHOT ........ SKIPPED
> [INFO] Maven IT Source Plugin Stub 0.1-stub-SNAPSHOT ...... SKIPPED
> [INFO] Maven IT Surefire Plugin Stub 0.1-stub-SNAPSHOT .... SKIPPED
> [INFO] Maven IT WAR Plugin Stub 0.1-stub-SNAPSHOT ......... SKIPPED
> [INFO] Maven IT Plugin :: Dependency Collection ........... SKIPPED
> [INFO] Maven IT Plugin :: Dependency Resolution ........... SKIPPED
> [INFO] Maven IT Plugin :: Expression ...................... SKIPPED
> [INFO] Maven IT Plugin :: Error Mojos ..................... SKIPPED
> [INFO] Maven IT Component ................................. SKIPPED
> [INFO] Maven IT Plugin :: Extension Consumer .............. SKIPPED
> [INFO] Maven IT Plugin :: Extension Provider .............. SKIPPED
> [INFO] Maven IT Plugin :: Fork ............................ SKIPPED
> [INFO] Maven IT Plugin :: Invalid Descriptor .............. SKIPPED
> [INFO] Maven IT Plugin :: Log File ........................ SKIPPED
> [INFO] Maven IT Helper Library ............................ SKIPPED
> [INFO] Maven IT Plugin :: Model Interpolation ............. SKIPPED
> [INFO] Maven IT Plugin :: No Default Component ............ SKIPPED
> [INFO] Maven IT Plugin :: No Project ...................... SKIPPED
> [INFO] Maven IT Plugin :: Online .......................... SKIPPED
> [INFO] Maven IT Plugin :: Optional Mojos .................. SKIPPED
> [INFO] Maven IT Plugin :: Packaging ....................... SKIPPED
> [INFO] Maven IT Plugin :: Parameter Implementation ........ SKIPPED
> [INFO] Maven IT Plugin :: Plugin Dependency ............... SKIPPED
> [INFO] Maven IT Plugin :: Project ......................... SKIPPED
> [INFO] Maven IT Plugin :: Project Interpolation ........... SKIPPED
> [INFO] Maven IT Plugin :: Setter .......................... SKIPPED
> [INFO] Maven IT Plugin :: Singleton Component ............. SKIPPED
> [INFO] Maven IT Plugin :: Site ............................ SKIPPED
> [INFO] Maven IT Plugin :: Toolchain ....................... SKIPPED
> [INFO] Maven IT Plugin :: Touch ........................... SKIPPED
> [INFO] Maven IT Plugin :: Uses Properties Plugin .......... SKIPPED
> [INFO] Maven IT Plugin :: Uses Wagon Plugin ............... SKIPPED
> [INFO] Maven IT Plugin :: This plugin should contain the mojos needed by all tests. SKIPPED
> [INFO] Maven IT Plugin :: Plexus Utils 1.1 ................ SKIPPED
> [INFO] Maven IT Plugin :: Plexus Utils New ................ SKIPPED
> [INFO] Maven IT Plugin :: Plexus Component API ............ SKIPPED
> [INFO] Maven IT Plugin :: Log4J Client .................... SKIPPED
> [INFO] Maven IT Plugin :: Extension 1 ..................... SKIPPED
> [INFO] Maven IT Plugin :: Extension 2 ..................... SKIPPED
> [INFO] Maven IT Plugin :: Plexus Lifecycle ................ SKIPPED
> [INFO] Maven IT Plugin :: Settings ........................ SKIPPED
> [INFO] Maven IT Plugin :: mng-5805 extension .............. SKIPPED
> [INFO] Maven IT Plugin :: mng-5805 extension mk2 .......... SKIPPED
> [INFO] Maven IT Plugin :: mng-5805 plugin ................. SKIPPED
> [INFO] Maven IT Plugin :: mng-5805 plugin-dep ............. SKIPPED
> [INFO] Maven IT Plugin :: mng-5958 extension .............. SKIPPED
> [INFO] Maven IT Toolchain ................................. SKIPPED
> [INFO] Maven IT Wagon ..................................... SKIPPED
> [INFO] Maven IT Support Artifacts ......................... SKIPPED
> [INFO] Maven IT Extension ................................. SKIPPED
> [INFO] Maven ITs 2.1-SNAPSHOT ............................. SKIPPED
> [INFO] ------------------------------------------------------------------------
> [INFO] BUILD FAILURE
> [INFO] ------------------------------------------------------------------------
> [INFO] Total time: 01:00 min
> [INFO] Finished at: 2018-06-18T00:15:10+01:00
> [INFO] ------------------------------------------------------------------------
> [ERROR] Failed to execute goal org.apache.maven.plugins:maven-site-plugin:3.7:site (default-site)
on project maven-it-plugin-active-collection: Error generating maven-javadoc-plugin:3.0.0:javadoc
report: 
> [ERROR] Exit code: 1 - /Users/stephenc/apache/maven-integration-testing/core-it-support/core-it-plugins/maven-it-plugin-active-collection/src/main/java/org/apache/maven/plugin/coreit/CheckMojo.java:38:
error: unknown tag: goal
> [ERROR] * @goal check
> [ERROR] ^
> [ERROR] /Users/stephenc/apache/maven-integration-testing/core-it-support/core-it-plugins/maven-it-plugin-active-collection/src/main/java/org/apache/maven/plugin/coreit/CheckMojo.java:39:
error: unknown tag: phase
> [ERROR] * @phase validate
> [ERROR] ^
> [ERROR] /Users/stephenc/apache/maven-integration-testing/core-it-support/core-it-plugins/maven-it-plugin-active-collection/src/main/java/org/apache/maven/plugin/coreit/CheckThreadSafetyMojo.java:77:
error: reference not found
> [ERROR] * @throws MojoFailureException If the output file could not be created.
> [ERROR] ^
> [ERROR] /Users/stephenc/apache/maven-integration-testing/core-it-support/core-it-plugins/maven-it-plugin-active-collection/src/main/java/org/apache/maven/plugin/coreit/CheckThreadSafetyMojo.java:38:
error: unknown tag: goal
> [ERROR] * @goal check-thread-safety
> [ERROR] ^
> [ERROR] /Users/stephenc/apache/maven-integration-testing/core-it-support/core-it-plugins/maven-it-plugin-active-collection/src/main/java/org/apache/maven/plugin/coreit/CheckThreadSafetyMojo.java:39:
error: unknown tag: phase
> [ERROR] * @phase validate
> [ERROR] ^
> [ERROR] /Users/stephenc/apache/maven-integration-testing/core-it-support/core-it-plugins/maven-it-plugin-active-collection/src/main/java/org/apache/maven/plugin/coreit/DumpRepoLayoutsMojo.java:38:
error: unknown tag: goal
> [ERROR] * @goal dump-repo-layouts
> [ERROR] ^
> [ERROR] /Users/stephenc/apache/maven-integration-testing/core-it-support/core-it-plugins/maven-it-plugin-active-collection/src/main/java/org/apache/maven/plugin/coreit/DumpRepoLayoutsMojo.java:39:
error: unknown tag: phase
> [ERROR] * @phase validate
> [ERROR] ^
> [ERROR] 
> [ERROR] Command line was: /Library/Java/JavaVirtualMachines/jdk1.8.0_152.jdk/Contents/Home/jre/../bin/javadoc
@options @packages
> [ERROR] 
> [ERROR] Refer to the generated Javadoc files in '/Users/stephenc/apache/maven-integration-testing/core-it-support/core-it-plugins/maven-it-plugin-active-collection/target/site/apidocs'
dir.
> [ERROR] -> [Help 1]
> [ERROR] 
> [ERROR] To see the full stack trace of the errors, re-run Maven with the -e switch.
> [ERROR] Re-run Maven using the -X switch to enable full debug logging.
> [ERROR] 
> [ERROR] For more information about the errors and possible solutions, please read the
following articles:
> [ERROR] [Help 1] http://cwiki.apache.org/confluence/display/MAVEN/MojoExecutionException
> [ERROR] 
> [ERROR] After correcting the problems, you can resume the build with the command
> [ERROR] mvn <goals> -rf :maven-it-plugin-active-collection
> {code}



--
This message was sent by Atlassian JIRA
(v7.6.3#76005)

Mime
View raw message