maven-issues mailing list archives

Site index · List index
Message view « Date » · « Thread »
Top « Date » · « Thread »
From "Karl Heinz Marbaise (JIRA)" <j...@apache.org>
Subject [jira] [Created] (MVERIFIER-26) JavaDoc issues
Date Fri, 30 Mar 2018 13:57:00 GMT
Karl Heinz Marbaise created MVERIFIER-26:
--------------------------------------------

             Summary: JavaDoc issues 
                 Key: MVERIFIER-26
                 URL: https://issues.apache.org/jira/browse/MVERIFIER-26
             Project: Maven Verifier Plugin
          Issue Type: Bug
    Affects Versions: 3.0.0
            Reporter: Karl Heinz Marbaise
            Assignee: Karl Heinz Marbaise
             Fix For: 3.0.0


{code}
[WARNING] Error fetching link: http://junit.org/apidocs/package-list. Ignored it.
[INFO]
2 errors
31 warnings
[INFO] ------------------------------------------------------------------------
[INFO] BUILD FAILURE
[INFO] ------------------------------------------------------------------------
[INFO] Total time: 24.265 s
[INFO] Finished at: 2018-03-30T15:55:25+02:00
[INFO] ------------------------------------------------------------------------
[ERROR] Failed to execute goal org.apache.maven.plugins:maven-site-plugin:3.7:site (default-site)
on project maven-verifier-plugin: Error generating maven-javadoc-plugin:3.0.0:javadoc report:
[ERROR] Exit code: 1 - /Users/kama/ws-git-maven/plugins/maven-verifier-plugin/src/main/java/org/apache/maven/plugins/verifier/VerificationResult.java:49:
error: unknown tag: linke
[ERROR]      * @param file {@linke File}
[ERROR]                    ^
[ERROR] /Users/kama/ws-git-maven/plugins/maven-verifier-plugin/src/main/java/org/apache/maven/plugins/verifier/VerifierMojo.java:237:
error: unexpected content
[ERROR]      * @see {@link VerificationResultPrinter}
[ERROR]        ^
[ERROR] /Users/kama/ws-git-maven/plugins/maven-verifier-plugin/src/main/java/org/apache/maven/plugins/verifier/VerifierMojo.java:239:
warning - Tag @see:illegal character: "123" in "{@link VerificationResultPrinter}"
[ERROR] /Users/kama/ws-git-maven/plugins/maven-verifier-plugin/src/main/java/org/apache/maven/plugins/verifier/VerifierMojo.java:239:
warning - Tag @see:illegal character: "64" in "{@link VerificationResultPrinter}"
[ERROR] /Users/kama/ws-git-maven/plugins/maven-verifier-plugin/target/generated-sources/modello/org/apache/maven/plugin/verifier/model/File.java:87:
warning: no description for @param
[ERROR]      * @param contains
[ERROR]        ^
[ERROR] /Users/kama/ws-git-maven/plugins/maven-verifier-plugin/target/generated-sources/modello/org/apache/maven/plugin/verifier/model/File.java:102:
warning: no description for @param
[ERROR]      * @param exists
[ERROR]        ^
[ERROR] /Users/kama/ws-git-maven/plugins/maven-verifier-plugin/target/generated-sources/modello/org/apache/maven/plugin/verifier/model/File.java:112:
warning: no description for @param
[ERROR]      * @param location
[ERROR]        ^
[ERROR] /Users/kama/ws-git-maven/plugins/maven-verifier-plugin/target/generated-sources/modello/org/apache/maven/plugin/verifier/model/Verifications.java:40:
warning: no description for @param
[ERROR]      * @param file
[ERROR]        ^
[ERROR] /Users/kama/ws-git-maven/plugins/maven-verifier-plugin/target/generated-sources/modello/org/apache/maven/plugin/verifier/model/Verifications.java:75:
warning: no description for @param
[ERROR]      * @param file
[ERROR]        ^
[ERROR] /Users/kama/ws-git-maven/plugins/maven-verifier-plugin/target/generated-sources/modello/org/apache/maven/plugin/verifier/model/Verifications.java:85:
warning: no description for @param
[ERROR]      * @param files
[ERROR]        ^
[ERROR] /Users/kama/ws-git-maven/plugins/maven-verifier-plugin/target/generated-sources/modello/org/apache/maven/plugin/verifier/model/Verifications.java:95:
warning: no description for @param
[ERROR]      * @param modelEncoding
[ERROR]        ^
[ERROR] /Users/kama/ws-git-maven/plugins/maven-verifier-plugin/target/generated-sources/modello/org/apache/maven/plugin/verifier/model/io/xpp3/VerificationsXpp3Reader.java:540:
warning: no description for @param
[ERROR]      * @param reader
[ERROR]        ^
[ERROR] /Users/kama/ws-git-maven/plugins/maven-verifier-plugin/target/generated-sources/modello/org/apache/maven/plugin/verifier/model/io/xpp3/VerificationsXpp3Reader.java:541:
warning: no description for @param
[ERROR]      * @param strict
[ERROR]        ^
[ERROR] /Users/kama/ws-git-maven/plugins/maven-verifier-plugin/target/generated-sources/modello/org/apache/maven/plugin/verifier/model/io/xpp3/VerificationsXpp3Reader.java:542:
warning: no description for @throws
[ERROR]      * @throws IOException
[ERROR]        ^
[ERROR] /Users/kama/ws-git-maven/plugins/maven-verifier-plugin/target/generated-sources/modello/org/apache/maven/plugin/verifier/model/io/xpp3/VerificationsXpp3Reader.java:543:
warning: no description for @throws
[ERROR]      * @throws XmlPullParserException
[ERROR]        ^
[ERROR] /Users/kama/ws-git-maven/plugins/maven-verifier-plugin/target/generated-sources/modello/org/apache/maven/plugin/verifier/model/io/xpp3/VerificationsXpp3Reader.java:560:
warning: no description for @param
[ERROR]      * @param reader
[ERROR]        ^
[ERROR] /Users/kama/ws-git-maven/plugins/maven-verifier-plugin/target/generated-sources/modello/org/apache/maven/plugin/verifier/model/io/xpp3/VerificationsXpp3Reader.java:561:
warning: no description for @throws
[ERROR]      * @throws IOException
[ERROR]        ^
[ERROR] /Users/kama/ws-git-maven/plugins/maven-verifier-plugin/target/generated-sources/modello/org/apache/maven/plugin/verifier/model/io/xpp3/VerificationsXpp3Reader.java:562:
warning: no description for @throws
[ERROR]      * @throws XmlPullParserException
[ERROR]        ^
[ERROR] /Users/kama/ws-git-maven/plugins/maven-verifier-plugin/target/generated-sources/modello/org/apache/maven/plugin/verifier/model/io/xpp3/VerificationsXpp3Reader.java:574:
warning: no description for @param
[ERROR]      * @param in
[ERROR]        ^
[ERROR] /Users/kama/ws-git-maven/plugins/maven-verifier-plugin/target/generated-sources/modello/org/apache/maven/plugin/verifier/model/io/xpp3/VerificationsXpp3Reader.java:575:
warning: no description for @param
[ERROR]      * @param strict
[ERROR]        ^
[ERROR] /Users/kama/ws-git-maven/plugins/maven-verifier-plugin/target/generated-sources/modello/org/apache/maven/plugin/verifier/model/io/xpp3/VerificationsXpp3Reader.java:576:
warning: no description for @throws
[ERROR]      * @throws IOException
[ERROR]        ^
[ERROR] /Users/kama/ws-git-maven/plugins/maven-verifier-plugin/target/generated-sources/modello/org/apache/maven/plugin/verifier/model/io/xpp3/VerificationsXpp3Reader.java:577:
warning: no description for @throws
[ERROR]      * @throws XmlPullParserException
[ERROR]        ^
[ERROR] /Users/kama/ws-git-maven/plugins/maven-verifier-plugin/target/generated-sources/modello/org/apache/maven/plugin/verifier/model/io/xpp3/VerificationsXpp3Reader.java:589:
warning: no description for @param
[ERROR]      * @param in
[ERROR]        ^
[ERROR] /Users/kama/ws-git-maven/plugins/maven-verifier-plugin/target/generated-sources/modello/org/apache/maven/plugin/verifier/model/io/xpp3/VerificationsXpp3Reader.java:590:
warning: no description for @throws
[ERROR]      * @throws IOException
[ERROR]        ^
[ERROR] /Users/kama/ws-git-maven/plugins/maven-verifier-plugin/target/generated-sources/modello/org/apache/maven/plugin/verifier/model/io/xpp3/VerificationsXpp3Reader.java:591:
warning: no description for @throws
[ERROR]      * @throws XmlPullParserException
[ERROR]        ^
[ERROR] /Users/kama/ws-git-maven/plugins/maven-verifier-plugin/target/generated-sources/modello/org/apache/maven/plugin/verifier/model/io/xpp3/VerificationsXpp3Reader.java:754:
warning: no description for @param
[ERROR]      * @param addDefaultEntities
[ERROR]        ^
[ERROR] /Users/kama/ws-git-maven/plugins/maven-verifier-plugin/target/generated-sources/modello/org/apache/maven/plugin/verifier/model/io/xpp3/VerificationsXpp3Writer.java:51:
warning: no description for @param
[ERROR]      * @param fileComment
[ERROR]        ^
[ERROR] /Users/kama/ws-git-maven/plugins/maven-verifier-plugin/target/generated-sources/modello/org/apache/maven/plugin/verifier/model/io/xpp3/VerificationsXpp3Writer.java:61:
warning: no description for @param
[ERROR]      * @param writer
[ERROR]        ^
[ERROR] /Users/kama/ws-git-maven/plugins/maven-verifier-plugin/target/generated-sources/modello/org/apache/maven/plugin/verifier/model/io/xpp3/VerificationsXpp3Writer.java:62:
warning: no description for @param
[ERROR]      * @param verifications
[ERROR]        ^
[ERROR] /Users/kama/ws-git-maven/plugins/maven-verifier-plugin/target/generated-sources/modello/org/apache/maven/plugin/verifier/model/io/xpp3/VerificationsXpp3Writer.java:63:
warning: no description for @throws
[ERROR]      * @throws java.io.IOException
[ERROR]        ^
[ERROR] /Users/kama/ws-git-maven/plugins/maven-verifier-plugin/target/generated-sources/modello/org/apache/maven/plugin/verifier/model/io/xpp3/VerificationsXpp3Writer.java:80:
warning: no description for @param
[ERROR]      * @param stream
[ERROR]        ^
[ERROR] /Users/kama/ws-git-maven/plugins/maven-verifier-plugin/target/generated-sources/modello/org/apache/maven/plugin/verifier/model/io/xpp3/VerificationsXpp3Writer.java:81:
warning: no description for @param
[ERROR]      * @param verifications
[ERROR]        ^
[ERROR] /Users/kama/ws-git-maven/plugins/maven-verifier-plugin/target/generated-sources/modello/org/apache/maven/plugin/verifier/model/io/xpp3/VerificationsXpp3Writer.java:82:
warning: no description for @throws
[ERROR]      * @throws java.io.IOException
[ERROR]        ^
[ERROR]
[ERROR] Command line was: /Library/Java/JavaVirtualMachines/jdk1.8.0_144.jdk/Contents/Home/jre/../bin/javadoc
@options @packages
[ERROR]
[ERROR] Refer to the generated Javadoc files in '/Users/kama/ws-git-maven/plugins/maven-verifier-plugin/target/site/apidocs'
dir.
[ERROR] -> [Help 1]
[ERROR]
[ERROR] To see the full stack trace of the errors, re-run Maven with the -e switch.
[ERROR] Re-run Maven using the -X switch to enable full debug logging.
[ERROR]
[ERROR] For more information about the errors and possible solutions, please read the following
articles:
[ERROR] [Help 1] http://cwiki.apache.org/confluence/display/MAVEN/MojoExecutionException
{code}



--
This message was sent by Atlassian JIRA
(v7.6.3#76005)

Mime
View raw message