maven-issues mailing list archives

Site index · List index
Message view « Date » · « Thread »
Top « Date » · « Thread »
From "Brett Porter (JIRA)" <j...@codehaus.org>
Subject [jira] Closed: (MNG-3434) [regression] Integration test it0103 is broken
Date Fri, 13 Jun 2008 03:57:12 GMT

     [ http://jira.codehaus.org/browse/MNG-3434?page=com.atlassian.jira.plugin.system.issuetabpanels:all-tabpanel
]

Brett Porter closed MNG-3434.
-----------------------------

      Assignee: Brett Porter
    Resolution: Fixed

working now

> [regression] Integration test it0103 is broken
> ----------------------------------------------
>
>                 Key: MNG-3434
>                 URL: http://jira.codehaus.org/browse/MNG-3434
>             Project: Maven 2
>          Issue Type: Bug
>          Components: integration tests
>    Affects Versions: 2.1-alpha-1
>            Reporter: Brett Porter
>            Assignee: Brett Porter
>             Fix For: 2.1-alpha-1
>
>
> This is currently being demonstrated locally and in Continuum.
> The error starts with: 
>                       org.apache.maven.it.VerificationException: Exit code was non-zero:
1; log = 
> + Error stacktraces are turned on.
> WAGON_VERSION: 1.0-beta-2
> url = http://repo1.maven.org/maven2
> Downloading: http://repo1.maven.org/maven2/org/apache/maven/its/it0103/level1/1/level1-1.pom
> [ERROR]
> Failed to resolve parent-POM from repository.
> Parent POM Information: 
> Group-Id: org.apache.maven.its.it0103
> Artifact-Id: level1
> Version: 1
> Local Repository: /export/home/build/.m2/repository
> Remote Repositories: 
> central -& http://repo1.maven.org/maven2
> Reason: Unable to download the artifact from any repository
>   org.apache.maven.its.it0103:level1:pom:1
> from the specified remote repositories:
>   central (http://repo1.maven.org/maven2)
> Project Id: [inherited]:level3:jar:1
> From file: /var/tmp/it0103/level1/level2/level3/pom.xml
> Error stacktrace:
> org.apache.maven.reactor.MavenExecutionException: Error scanning for extensions: Error
building model lineage in order to pre-scan for extensions: Cannot find artifact for parent
POM: org.apache.maven.its.it0103:level1::1 for project [inherited]:level3:jar:1 at /var/tmp/it0103/level1/level2/level3/pom.xml
> 	at org.apache.maven.DefaultMaven.getProjects(DefaultMaven.java:281)
> 	at org.apache.maven.DefaultMaven.createReactorManager(DefaultMaven.java:105)
> 	at org.apache.maven.DefaultMaven.execute_aroundBody0(DefaultMaven.java:162)
> 	at org.apache.maven.DefaultMaven.execute_aroundBody1$advice(DefaultMaven.java:304)
> 	at org.apache.maven.DefaultMaven.execute(DefaultMaven.java:1)
> 	at org.apache.maven.embedder.MavenEmbedder.execute_aroundBody2(MavenEmbedder.java:895)
> 	at org.apache.maven.embedder.MavenEmbedder.execute_aroundBody3$advice(MavenEmbedder.java:304)
> 	at org.apache.maven.embedder.MavenEmbedder.execute(MavenEmbedder.java:1)
> 	at org.apache.maven.cli.MavenCli.doMain(MavenCli.java:176)
> 	at org.apache.maven.cli.MavenCli.main(MavenCli.java:63)
> 	at sun.reflect.NativeMethodAccessorImpl.invoke0(Native Method)
> 	at sun.reflect.NativeMethodAccessorImpl.invoke(NativeMethodAccessorImpl.java:39)
> 	at sun.reflect.DelegatingMethodAccessorImpl.invoke(DelegatingMethodAccessorImpl.java:25)
> 	at java.lang.reflect.Method.invoke(Method.java:585)
> 	at org.codehaus.plexus.classworlds.launcher.Launcher.launchEnhanced(Launcher.java:289)
> 	at org.codehaus.plexus.classworlds.launcher.Launcher.launch(Launcher.java:229)
> 	at org.codehaus.plexus.classworlds.launcher.Launcher.mainWithExitCode(Launcher.java:408)
> 	at org.codehaus.plexus.classworlds.launcher.Launcher.main(Launcher.java:351)
> Caused by: org.apache.maven.extension.ExtensionScanningException: Error building model
lineage in order to pre-scan for extensions: Cannot find artifact for parent POM: org.apache.maven.its.it0103:level1::1
for project [inherited]:level3:jar:1 at /var/tmp/it0103/level1/level2/level3/pom.xml
> 	at org.apache.maven.extension.DefaultBuildExtensionScanner.buildModelLineage(DefaultBuildExtensionScanner.java:428)
> 	at org.apache.maven.extension.DefaultBuildExtensionScanner.scanInternal(DefaultBuildExtensionScanner.java:136)
> 	at org.apache.maven.extension.DefaultBuildExtensionScanner.checkModulesForExtensions(DefaultBuildExtensionScanner.java:330)
> 	at org.apache.maven.extension.DefaultBuildExtensionScanner.scanInternal(DefaultBuildExtensionScanner.java:196)
> 	at org.apache.maven.extension.DefaultBuildExtensionScanner.checkModulesForExtensions(DefaultBuildExtensionScanner.java:330)
> 	at org.apache.maven.extension.DefaultBuildExtensionScanner.scanInternal(DefaultBuildExtensionScanner.java:196)
> 	at org.apache.maven.extension.DefaultBuildExtensionScanner.checkModulesForExtensions(DefaultBuildExtensionScanner.java:330)
> 	at org.apache.maven.extension.DefaultBuildExtensionScanner.scanInternal(DefaultBuildExtensionScanner.java:196)
> 	at org.apache.maven.extension.DefaultBuildExtensionScanner.scanForBuildExtensions(DefaultBuildExtensionScanner.java:106)
> 	at org.apache.maven.DefaultMaven.getProjects(DefaultMaven.java:277)
> 	... 17 more
> Caused by: org.apache.maven.project.ProjectBuildingException: Cannot find artifact for
parent POM: org.apache.maven.its.it0103:level1::1 for project [inherited]:level3:jar:1 at
/var/tmp/it0103/level1/level2/level3/pom.xml
> 	at org.apache.maven.project.build.model.DefaultModelLineageBuilder.resolveParentFromRepositories(DefaultModelLineageBuilder.java:463)
> 	at org.apache.maven.project.build.model.DefaultModelLineageBuilder.resolveParentPom_aroundBody4(DefaultModelLineageBuilder.java:355)
> 	at org.apache.maven.project.build.model.DefaultModelLineageBuilder.resolveParentPom_aroundBody5$advice(DefaultModelLineageBuilder.java:260)
> 	at org.apache.maven.project.build.model.DefaultModelLineageBuilder.resolveParentPom(DefaultModelLineageBuilder.java:1)
> 	at org.apache.maven.project.build.model.DefaultModelLineageBuilder.buildModelLineage(DefaultModelLineageBuilder.java:128)
> 	at org.apache.maven.extension.DefaultBuildExtensionScanner.buildModelLineage(DefaultBuildExtensionScanner.java:423)
> 	... 26 more
> Caused by: org.apache.maven.artifact.resolver.ArtifactNotFoundException: Unable to download
the artifact from any repository
>   org.apache.maven.its.it0103:level1:pom:1
> from the specified remote repositories:
>   central (http://repo1.maven.org/maven2)
> 	at org.apache.maven.artifact.resolver.DefaultArtifactResolver.resolve(DefaultArtifactResolver.java:200)
> 	at org.apache.maven.artifact.resolver.DefaultArtifactResolver.resolve(DefaultArtifactResolver.java:81)
> 	at org.apache.maven.project.build.model.DefaultModelLineageBuilder.resolveParentFromRepositories(DefaultModelLineageBuilder.java:454)
> 	... 31 more
> Caused by: org.apache.maven.wagon.ResourceDoesNotExistException: Unable to download the
artifact from any repository
> 	at org.apache.maven.artifact.manager.DefaultWagonManager.getArtifact(DefaultWagonManager.java:374)
> 	at org.apache.maven.artifact.resolver.DefaultArtifactResolver.resolve(DefaultArtifactResolver.java:184)
> 	... 33 more
> [INFO] ------------------------------------------------------------------------
> [INFO]  + Ignoring build failures
> [INFO] ------------------------------------------------------------------------
> [INFO] BUILD SUCCESSFUL
> [INFO] ------------------------------------------------------------------------
> [INFO] Total time: & 1 second
> [INFO] Finished at: Tue Mar 04 00:42:01 GMT+00:00 2008
> [INFO] Final Memory: 2M/254M
> [INFO] ------------------------------------------------------------------------
> 	at org.apache.maven.it.Verifier.executeGoals(Verifier.java:994)
> 	at org.apache.maven.it.Verifier.executeGoal(Verifier.java:850)
> 	at org.apache.maven.it.Verifier.executeGoal(Verifier.java:844)
> 	at org.apache.maven.integrationtests.MavenIT0103Test.testit0103(MavenIT0103Test.java:22)
> 	at org.apache.maven.integrationtests.MavenIT0103Test.testit0103(MavenIT0103Test.java:22)
> 	at sun.reflect.NativeMethodAccessorImpl.invoke0(Native Method)
> 	at sun.reflect.NativeMethodAccessorImpl.invoke(NativeMethodAccessorImpl.java:39)
> 	at sun.reflect.DelegatingMethodAccessorImpl.invoke(DelegatingMethodAccessorImpl.java:25)
> 	at java.lang.reflect.Method.invoke(Method.java:585)
> 	at junit.framework.TestCase.runTest(TestCase.java:154)
> 	at org.apache.maven.integrationtests.AbstractMavenIntegrationTestCase.runTest(AbstractMavenIntegrationTestCase.java:75)
> 	at junit.framework.TestCase.runBare(TestCase.java:127)
> 	at junit.framework.TestResult$1.protect(TestResult.java:106)
> 	at junit.framework.TestResult.runProtected(TestResult.java:124)
> 	at junit.framework.TestResult.run(TestResult.java:109)
> 	at junit.framework.TestCase.run(TestCase.java:118)
> 	at junit.framework.TestSuite.runTest(TestSuite.java:208)
> 	at junit.framework.TestSuite.run(TestSuite.java:203)
> 	at junit.framework.TestSuite.runTest(TestSuite.java:208)
> 	at junit.framework.TestSuite.run(TestSuite.java:203)
> 	at sun.reflect.NativeMethodAccessorImpl.invoke0(Native Method)
> 	at sun.reflect.NativeMethodAccessorImpl.invoke(NativeMethodAccessorImpl.java:39)
> 	at sun.reflect.DelegatingMethodAccessorImpl.invoke(DelegatingMethodAccessorImpl.java:25)
> 	at java.lang.reflect.Method.invoke(Method.java:585)
> 	at org.apache.maven.surefire.junit.JUnitTestSet.execute(JUnitTestSet.java:213)
> 	at org.apache.maven.surefire.suite.AbstractDirectoryTestSuite.executeTestSet(AbstractDirectoryTestSuite.java:138)
> 	at org.apache.maven.surefire.suite.AbstractDirectoryTestSuite.execute(AbstractDirectoryTestSuite.java:125)
> 	at org.apache.maven.surefire.Surefire.run(Surefire.java:132)
> 	at sun.reflect.NativeMethodAccessorImpl.invoke0(Native Method)
> 	at sun.reflect.NativeMethodAccessorImpl.invoke(NativeMethodAccessorImpl.java:39)
> 	at sun.reflect.DelegatingMethodAccessorImpl.invoke(DelegatingMethodAccessorImpl.java:25)
> 	at java.lang.reflect.Method.invoke(Method.java:585)
> 	at org.apache.maven.surefire.booter.SurefireBooter.runSuitesInProcess(SurefireBooter.java:290)
> 	at org.apache.maven.surefire.booter.SurefireBooter.main(SurefireBooter.java:818)

-- 
This message is automatically generated by JIRA.
-
If you think it was sent incorrectly contact one of the administrators: http://jira.codehaus.org/secure/Administrators.jspa
-
For more information on JIRA, see: http://www.atlassian.com/software/jira

        

Mime
View raw message