maven-issues mailing list archives

Site index · List index
Message view « Date » · « Thread »
Top « Date » · « Thread »
From "Wendy Smoak (JIRA)" <j...@codehaus.org>
Subject [jira] Updated: (CONTINUUM-1166) Integration test failures: AccountSecurityTest
Date Wed, 14 Feb 2007 07:21:21 GMT

     [ http://jira.codehaus.org/browse/CONTINUUM-1166?page=com.atlassian.jira.plugin.system.issuetabpanels:all-tabpanel
]

Wendy Smoak updated CONTINUUM-1166:
-----------------------------------

    Attachment: AccountSecurityTest-r507420.txt

Partial fix in r507420.  Two problems remain:

-------------------------------------------------------------------------------
Test set: org.apache.continuum.web.test.AccountSecurityTest
-------------------------------------------------------------------------------
Tests run: 5, Failures: 1, Errors: 1, Skipped: 0, Time elapsed: 120.344 sec <<< FAILURE!

testPasswordCreationValidation(org.apache.continuum.web.test.AccountSecurityTest)  Time elapsed:
17.406 sec  <<< FAILURE!
junit.framework.AssertionFailedError: 'link=Users' isn't present.

testDefaultRolesOfNewSystemAdministrator(org.apache.continuum.web.test.AccountSecurityTest)
 Time elapsed: 13.656 sec  <<< ERROR!
com.thoughtworks.selenium.SeleniumException: ERROR: Element removeRolesFromUser_removeSelectedRolesSystem
Administrator not found

Full Surefire report attached.

> Integration test failures: AccountSecurityTest
> ----------------------------------------------
>
>                 Key: CONTINUUM-1166
>                 URL: http://jira.codehaus.org/browse/CONTINUUM-1166
>             Project: Continuum
>          Issue Type: Task
>          Components: Testing
>    Affects Versions: 1.1
>         Environment: WinXP Continuum 1.1-SNAPSHOT r507397
>            Reporter: Wendy Smoak
>         Attachments: AccountSecurityTest-r507420.txt, org.apache.continuum.web.test.AccountSecurityTest.txt
>
>
> -------------------------------------------------------------------------------
> Test set: org.apache.continuum.web.test.AccountSecurityTest
> -------------------------------------------------------------------------------
> Tests run: 5, Failures: 4, Errors: 1, Skipped: 0, Time elapsed: 107.797 sec <<<
FAILURE!
> When editing a user, effective roles are displayed on the first page, but it is necessary
to click the 'Edit Roles' in order to add or delete roles.
> Full Surefire report attached.

-- 
This message is automatically generated by JIRA.
-
If you think it was sent incorrectly contact one of the administrators: http://jira.codehaus.org/secure/Administrators.jspa
-
For more information on JIRA, see: http://www.atlassian.com/software/jira

        

Mime
View raw message