maven-doxia-dev mailing list archives

Site index · List index
Message view « Date » · « Thread »
Top « Date » · « Thread »
From Apache Hudson Server <hud...@hudson.apache.org>
Subject Build failed in Jenkins: Maven-Doxia » JDK 1.5 (latest),osx #30
Date Tue, 05 Apr 2011 12:39:16 GMT
See <https://hudson.apache.org/hudson/job/Maven-Doxia/./jdk=JDK%201.5%20(latest),label=osx/30/changes>

Changes:

[ltheussl] javadocs and minor code cleaning

[ltheussl] [DOXIA-423] duplicate registration of module docbook

[ltheussl] improve javadoc for unknown method

[ltheussl] checkstyle fixes

[hboutemy] o improved javadoc
o added generics types as comments

[ltheussl] ad DOXIA-397: add a test to demonstrate how the parser handles special characters
in anchors and links

[hboutemy] updated parent pom to latest maven-parent

[ltheussl] [DOXIA-420] add test to demonstrate there is no bug

[hboutemy] improved documentation about formats

[hboutemy] improved javadoc

[hboutemy] improved documentation

[ltheussl] add ciManagement to point to the Apache Hudson server

[ltheussl] disable pointless tests. to be clarified but for now: they lead to sporadic test
failures when there are network issues

[ltheussl] use local resources for testing

------------------------------------------
[...truncated 1958 lines...]
[INFO] skip non existing resourceDirectory <https://hudson.apache.org/hudson/job/Maven-Doxia/./jdk=JDK%201.5%20(latest),label=osx/ws/doxia-modules/doxia-module-xdoc/target/generated-site/xsd>
[INFO] Copying 1 resource
[INFO] Copying 3 resources
[INFO] [plexus:merge-descriptors {execution: default}]
[INFO] [compiler:compile {execution: default-compile}]
[INFO] Compiling 6 source files to <https://hudson.apache.org/hudson/job/Maven-Doxia/./jdk=JDK%201.5%20(latest),label=osx/ws/doxia-modules/doxia-module-xdoc/target/classes>
[INFO] [resources:testResources {execution: default-testResources}]
[INFO] Using 'UTF-8' encoding to copy filtered resources.
[INFO] Copying 5 resources
[INFO] Copying 3 resources
[INFO] [compiler:testCompile {execution: default-testCompile}]
[INFO] Compiling 6 source files to <https://hudson.apache.org/hudson/job/Maven-Doxia/./jdk=JDK%201.5%20(latest),label=osx/ws/doxia-modules/doxia-module-xdoc/target/test-classes>
[INFO] [surefire:test {execution: default-test}]
[INFO] Surefire report directory: <https://hudson.apache.org/hudson/job/Maven-Doxia/./jdk=JDK%201.5%20(latest),label=osx/ws/doxia-modules/doxia-module-xdoc/target/surefire-reports>

-------------------------------------------------------
 T E S T S
-------------------------------------------------------
Running org.apache.maven.doxia.module.xdoc.XdocIdentityTest
Tests run: 1, Failures: 0, Errors: 0, Skipped: 0, Time elapsed: 0.251 sec
Running org.apache.maven.doxia.module.xdoc.XdocParserTest
[warn] <title> was already defined in <properties>, ignored <title> in <head>.
Tests run: 16, Failures: 0, Errors: 0, Skipped: 0, Time elapsed: 0.38 sec
Running org.apache.maven.doxia.module.xdoc.XdocSinkTest
[WARNING] [Xhtml Sink] Modified invalid comment: 'Simple comment with ----' to 'Simple comment
with - - - -'
Tests run: 33, Failures: 0, Errors: 0, Skipped: 0, Time elapsed: 0.197 sec
Running org.apache.maven.doxia.module.xdoc.XdocSinkWithLanguageIdTest
[WARNING] [Xhtml Sink] Modified invalid comment: 'Simple comment with ----' to 'Simple comment
with - - - -'
Tests run: 33, Failures: 0, Errors: 0, Skipped: 0, Time elapsed: 0.173 sec
Running org.apache.maven.doxia.module.xdoc.XdocValidatorTest
Tests run: 1, Failures: 0, Errors: 0, Skipped: 0, Time elapsed: 0.006 sec

Results :

Tests run: 84, Failures: 0, Errors: 0, Skipped: 0

[INFO] [jar:jar {execution: default-jar}]
[INFO] Building jar: <https://hudson.apache.org/hudson/job/Maven-Doxia/./jdk=JDK%201.5%20(latest),label=osx/ws/doxia-modules/doxia-module-xdoc/target/doxia-module-xdoc-1.1.5-SNAPSHOT.jar>
[INFO] Preparing clirr:check
[WARNING] Removing: check from forked lifecycle, to prevent recursive invocation.
[INFO] [plexus:descriptor {execution: default}]
[INFO] [remote-resources:process {execution: default}]
[INFO] [resources:resources {execution: default-resources}]
[INFO] Using 'UTF-8' encoding to copy filtered resources.
[INFO] Copying 1 resource
[INFO] skip non existing resourceDirectory <https://hudson.apache.org/hudson/job/Maven-Doxia/./jdk=JDK%201.5%20(latest),label=osx/ws/doxia-modules/doxia-module-xdoc/target/generated-site/xsd>
[INFO] Copying 1 resource
[INFO] Copying 3 resources
[INFO] Copying 1 resource
[INFO] Copying 3 resources
[INFO] [plexus:merge-descriptors {execution: default}]
[INFO] [compiler:compile {execution: default-compile}]
[INFO] Nothing to compile - all classes are up to date
[INFO] [clirr:check {execution: default}]
[INFO] Comparing to version: 1.1
[INFO] Succeeded with 0 errors; 0 warnings; and 0 other changes.
[INFO] [install:install {execution: default-install}]
[INFO] Installing <https://hudson.apache.org/hudson/job/Maven-Doxia/./jdk=JDK%201.5%20(latest),label=osx/ws/doxia-modules/doxia-module-xdoc/target/doxia-module-xdoc-1.1.5-SNAPSHOT.jar>
to /Users/hudson/.m2/repository/org/apache/maven/doxia/doxia-module-xdoc/1.1.5-SNAPSHOT/doxia-module-xdoc-1.1.5-SNAPSHOT.jar
[INFO] ------------------------------------------------------------------------
[INFO] Building Doxia :: XHTML Module
[INFO]    task-segment: [clean, install]
[INFO] ------------------------------------------------------------------------
[INFO] [clean:clean {execution: default-clean}]
[INFO] [plexus:descriptor {execution: default}]
[INFO] [remote-resources:process {execution: default}]
[INFO] [resources:resources {execution: default-resources}]
[INFO] Using 'UTF-8' encoding to copy filtered resources.
[INFO] skip non existing resourceDirectory <https://hudson.apache.org/hudson/job/Maven-Doxia/./jdk=JDK%201.5%20(latest),label=osx/ws/doxia-modules/doxia-module-xhtml/src/main/resources>
[INFO] skip non existing resourceDirectory <https://hudson.apache.org/hudson/job/Maven-Doxia/./jdk=JDK%201.5%20(latest),label=osx/ws/doxia-modules/doxia-module-xhtml/target/generated-site/xsd>
[INFO] Copying 1 resource
[INFO] Copying 3 resources
[INFO] [compiler:compile {execution: default-compile}]
[INFO] Compiling 6 source files to <https://hudson.apache.org/hudson/job/Maven-Doxia/./jdk=JDK%201.5%20(latest),label=osx/ws/doxia-modules/doxia-module-xhtml/target/classes>
[INFO] [resources:testResources {execution: default-testResources}]
[INFO] Using 'UTF-8' encoding to copy filtered resources.
[INFO] Copying 5 resources
[INFO] Copying 3 resources
[INFO] [compiler:testCompile {execution: default-testCompile}]
[INFO] Compiling 4 source files to <https://hudson.apache.org/hudson/job/Maven-Doxia/./jdk=JDK%201.5%20(latest),label=osx/ws/doxia-modules/doxia-module-xhtml/target/test-classes>
[INFO] [surefire:test {execution: default-test}]
[INFO] Surefire report directory: <https://hudson.apache.org/hudson/job/Maven-Doxia/./jdk=JDK%201.5%20(latest),label=osx/ws/doxia-modules/doxia-module-xhtml/target/surefire-reports>

-------------------------------------------------------
 T E S T S
-------------------------------------------------------
Running org.apache.maven.doxia.module.xhtml.XhtmlIdentityTest
Tests run: 1, Failures: 0, Errors: 0, Skipped: 0, Time elapsed: 0.247 sec
Running org.apache.maven.doxia.module.xhtml.XhtmlParserTest
Tests run: 6, Failures: 0, Errors: 0, Skipped: 0, Time elapsed: 0.201 sec
Running org.apache.maven.doxia.module.xhtml.XhtmlSinkTest
[WARNING] [Xhtml Sink] Modified invalid comment: 'Simple comment with ----' to 'Simple comment
with - - - -'
Tests run: 33, Failures: 0, Errors: 0, Skipped: 0, Time elapsed: 0.267 sec
Running org.apache.maven.doxia.module.xhtml.XhtmlSinkWithLanguageIdTest
[WARNING] [Xhtml Sink] Modified invalid comment: 'Simple comment with ----' to 'Simple comment
with - - - -'
Tests run: 33, Failures: 0, Errors: 0, Skipped: 0, Time elapsed: 0.174 sec

Results :

Tests run: 73, Failures: 0, Errors: 0, Skipped: 0

[INFO] [jar:jar {execution: default-jar}]
[INFO] Building jar: <https://hudson.apache.org/hudson/job/Maven-Doxia/./jdk=JDK%201.5%20(latest),label=osx/ws/doxia-modules/doxia-module-xhtml/target/doxia-module-xhtml-1.1.5-SNAPSHOT.jar>
[INFO] Preparing clirr:check
[WARNING] Removing: check from forked lifecycle, to prevent recursive invocation.
[INFO] [plexus:descriptor {execution: default}]
[INFO] [remote-resources:process {execution: default}]
[INFO] [resources:resources {execution: default-resources}]
[INFO] Using 'UTF-8' encoding to copy filtered resources.
[INFO] skip non existing resourceDirectory <https://hudson.apache.org/hudson/job/Maven-Doxia/./jdk=JDK%201.5%20(latest),label=osx/ws/doxia-modules/doxia-module-xhtml/src/main/resources>
[INFO] skip non existing resourceDirectory <https://hudson.apache.org/hudson/job/Maven-Doxia/./jdk=JDK%201.5%20(latest),label=osx/ws/doxia-modules/doxia-module-xhtml/target/generated-site/xsd>
[INFO] Copying 1 resource
[INFO] Copying 3 resources
[INFO] Copying 1 resource
[INFO] Copying 3 resources
[INFO] [compiler:compile {execution: default-compile}]
[INFO] Nothing to compile - all classes are up to date
[INFO] [clirr:check {execution: default}]
[INFO] Comparing to version: 1.1
[INFO] Succeeded with 0 errors; 0 warnings; and 0 other changes.
[INFO] [install:install {execution: default-install}]
[INFO] Installing <https://hudson.apache.org/hudson/job/Maven-Doxia/./jdk=JDK%201.5%20(latest),label=osx/ws/doxia-modules/doxia-module-xhtml/target/doxia-module-xhtml-1.1.5-SNAPSHOT.jar>
to /Users/hudson/.m2/repository/org/apache/maven/doxia/doxia-module-xhtml/1.1.5-SNAPSHOT/doxia-module-xhtml-1.1.5-SNAPSHOT.jar
[INFO] ------------------------------------------------------------------------
[INFO] Building Doxia :: Book Component
[INFO]    task-segment: [clean, install]
[INFO] ------------------------------------------------------------------------
[INFO] [clean:clean {execution: default-clean}]
[INFO] [modello:java {execution: descriptor}]
[INFO] outputDirectory: <https://hudson.apache.org/hudson/job/Maven-Doxia/./jdk=JDK%201.5%20(latest),label=osx/ws/doxia-book/target/generated-sources/modello>
[INFO] Working on model: src/main/modello/book.mdo
[INFO] Generating current version: 1.0.0
[INFO] [modello:xpp3-reader {execution: descriptor}]
[INFO] outputDirectory: <https://hudson.apache.org/hudson/job/Maven-Doxia/./jdk=JDK%201.5%20(latest),label=osx/ws/doxia-book/target/generated-sources/modello>
[INFO] Working on model: src/main/modello/book.mdo
[INFO] Generating current version: 1.0.0
[INFO] [modello:xsd {execution: descriptor}]
[INFO] outputDirectory: <https://hudson.apache.org/hudson/job/Maven-Doxia/./jdk=JDK%201.5%20(latest),label=osx/ws/doxia-book/target/generated-site/xsd>
[INFO] Working on model: src/main/modello/book.mdo
[INFO] Generating current version: 1.0.0
[INFO] [plexus:descriptor {execution: default}]
[INFO] [remote-resources:process {execution: default}]
[INFO] [resources:resources {execution: default-resources}]
[INFO] Using 'UTF-8' encoding to copy filtered resources.
[INFO] Copying 3 resources
[INFO] Copying 1 resource
[INFO] Copying 1 resource
[INFO] Copying 3 resources
[INFO] [compiler:compile {execution: default-compile}]
[INFO] Compiling 32 source files to <https://hudson.apache.org/hudson/job/Maven-Doxia/./jdk=JDK%201.5%20(latest),label=osx/ws/doxia-book/target/classes>
[INFO] [resources:testResources {execution: default-testResources}]
[INFO] Using 'UTF-8' encoding to copy filtered resources.
[INFO] Copying 6 resources
[INFO] Copying 3 resources
[INFO] [compiler:testCompile {execution: default-testCompile}]
[INFO] Compiling 3 source files to <https://hudson.apache.org/hudson/job/Maven-Doxia/./jdk=JDK%201.5%20(latest),label=osx/ws/doxia-book/target/test-classes>
[INFO] [surefire:test {execution: default-test}]
[INFO] Surefire report directory: <https://hudson.apache.org/hudson/job/Maven-Doxia/./jdk=JDK%201.5%20(latest),label=osx/ws/doxia-book/target/surefire-reports>

-------------------------------------------------------
 T E S T S
-------------------------------------------------------
Running org.apache.maven.doxia.book.BookRendererTest
Tue Apr  5 05:39:15 eve.local java[39582] <Error>: kCGErrorFailure: Set a breakpoint
@ CGErrorBreakpoint() to catch errors as they are logged.
Tests run: 1, Failures: 0, Errors: 1, Skipped: 0, Time elapsed: 0.41 sec <<< FAILURE!
Running org.apache.maven.doxia.book.services.indexer.BookIndexerTest
Tests run: 1, Failures: 0, Errors: 0, Skipped: 0, Time elapsed: 0.032 sec
Running org.apache.maven.doxia.book.services.renderer.docbook.DocBookBookSinkTest
[WARNING] [Docbook Sink] Modified invalid comment: 'Simple comment with ----' to 'Simple comment
with - - - -'
Tests run: 38, Failures: 0, Errors: 0, Skipped: 0, Time elapsed: 0.499 sec

Results :

Tests in error: 
  testBasic(org.apache.maven.doxia.book.BookRendererTest): Can't connect to window server
- not enough permissions.

Tests run: 40, Failures: 0, Errors: 1, Skipped: 0

[INFO] ------------------------------------------------------------------------
[INFO] SKIPPING Doxia :: Maven Plugin
[INFO]    task-segment: [clean, install]
[INFO] This project has been banned from further executions due to previous failures.
[INFO] ------------------------------------------------------------------------
[INFO] 
[INFO] 
[INFO] ------------------------------------------------------------------------
[INFO] Reactor Summary:
[INFO] ------------------------------------------------------------------------
[INFO] Doxia ................................................. SUCCESS [6.082s]
[INFO] Doxia :: Logging API .................................. SUCCESS [2.632s]
[INFO] Doxia :: Sink API ..................................... SUCCESS [0.960s]
[INFO] Doxia :: Test Documents ............................... SUCCESS [1.006s]
[INFO] Doxia :: Core ......................................... SUCCESS [26.374s]
[INFO] Doxia :: Modules ...................................... SUCCESS [0.247s]
[INFO] Doxia :: APT Module ................................... SUCCESS [2.059s]
[INFO] Doxia :: Confluence Module ............................ SUCCESS [1.887s]
[INFO] Doxia :: Simplified DocBook Module .................... SUCCESS [2.081s]
[INFO] Doxia :: FML Module ................................... SUCCESS [1.553s]
[INFO] Doxia :: FO Module .................................... SUCCESS [6.146s]
[INFO] Doxia :: iText Module ................................. SUCCESS [2.384s]
[INFO] Doxia :: Latex Module ................................. SUCCESS [1.349s]
[INFO] Doxia :: RTF Module ................................... SUCCESS [1.291s]
[INFO] Doxia :: TWiki Module ................................. SUCCESS [1.730s]
[INFO] Doxia :: XDoc Module .................................. SUCCESS [1.901s]
[INFO] Doxia :: XHTML Module ................................. SUCCESS [1.675s]
[INFO] Doxia :: Book Component ............................... FAILED [1.635s]
[INFO] Doxia :: Maven Plugin ................................. SKIPPED (dependency build failed
or was skipped)
[INFO] ------------------------------------------------------------------------
[INFO] Error for project: Doxia :: Book Component (during install)
[INFO] ------------------------------------------------------------------------
[INFO] There are test failures.

Please refer to <https://hudson.apache.org/hudson/job/Maven-Doxia/./jdk=JDK%201.5%20(latest),label=osx/ws/doxia-book/target/surefire-reports>
for the individual test results.
[INFO] ------------------------------------------------------------------------
[INFO] Trace
org.apache.maven.BuildFailureException: There are test failures.

Please refer to <https://hudson.apache.org/hudson/job/Maven-Doxia/./jdk=JDK%201.5%20(latest),label=osx/ws/doxia-book/target/surefire-reports>
for the individual test results.
	at org.apache.maven.lifecycle.DefaultLifecycleExecutor.executeGoals(DefaultLifecycleExecutor.java:715)
	at org.apache.maven.lifecycle.DefaultLifecycleExecutor.executeGoalWithLifecycle(DefaultLifecycleExecutor.java:556)
	at org.apache.maven.lifecycle.DefaultLifecycleExecutor.executeGoal(DefaultLifecycleExecutor.java:535)
	at org.apache.maven.lifecycle.DefaultLifecycleExecutor.executeGoalAndHandleFailures(DefaultLifecycleExecutor.java:387)
	at org.apache.maven.lifecycle.DefaultLifecycleExecutor.executeTaskSegments(DefaultLifecycleExecutor.java:348)
	at org.apache.maven.lifecycle.DefaultLifecycleExecutor.execute(DefaultLifecycleExecutor.java:180)
	at org.apache.maven.DefaultMaven.doExecute(DefaultMaven.java:328)
	at org.apache.maven.DefaultMaven.execute(DefaultMaven.java:138)
	at org.apache.maven.cli.MavenCli.main(MavenCli.java:362)
	at org.apache.maven.cli.compat.CompatibleMain.main(CompatibleMain.java:60)
	at sun.reflect.NativeMethodAccessorImpl.invoke0(Native Method)
	at sun.reflect.NativeMethodAccessorImpl.invoke(NativeMethodAccessorImpl.java:39)
	at sun.reflect.DelegatingMethodAccessorImpl.invoke(DelegatingMethodAccessorImpl.java:25)
	at java.lang.reflect.Method.invoke(Method.java:597)
	at org.codehaus.classworlds.Launcher.launchEnhanced(Launcher.java:315)
	at org.codehaus.classworlds.Launcher.launch(Launcher.java:255)
	at org.codehaus.classworlds.Launcher.mainWithExitCode(Launcher.java:430)
	at org.codehaus.classworlds.Launcher.main(Launcher.java:375)
Caused by: org.apache.maven.plugin.MojoFailureException: There are test failures.

Please refer to <https://hudson.apache.org/hudson/job/Maven-Doxia/./jdk=JDK%201.5%20(latest),label=osx/ws/doxia-book/target/surefire-reports>
for the individual test results.
	at org.apache.maven.plugin.surefire.SurefireHelper.reportExecution(SurefireHelper.java:74)
	at org.apache.maven.plugin.surefire.SurefirePlugin.execute(SurefirePlugin.java:642)
	at org.apache.maven.plugin.DefaultPluginManager.executeMojo(DefaultPluginManager.java:490)
	at org.apache.maven.lifecycle.DefaultLifecycleExecutor.executeGoals(DefaultLifecycleExecutor.java:694)
	... 17 more
[INFO] ------------------------------------------------------------------------
[INFO] BUILD ERRORS
[INFO] ------------------------------------------------------------------------
[INFO] Total time: 1 minute 4 seconds
[INFO] Finished at: Tue Apr 05 05:39:15 PDT 2011
[INFO] Final Memory: 51M/265M
[INFO] ------------------------------------------------------------------------


Mime
View raw message