maven-doxia-dev mailing list archives

Site index · List index
Message view « Date » · « Thread »
Top « Date » · « Thread »
From Apache Hudson Server <hud...@hudson.apache.org>
Subject Build failed in Jenkins: Maven-Doxia-Sitetools » JDK 1.5 (latest),osx #53
Date Tue, 05 Apr 2011 19:50:33 GMT
See <https://hudson.apache.org/hudson/job/Maven-Doxia-Sitetools/./jdk=JDK%201.5%20(latest),label=osx/53/>

------------------------------------------
[...truncated 340 lines...]
[INFO] [plexus:descriptor {execution: default}]
[INFO] Discovered 1 component descriptors(s)
[INFO] [resources:testResources {execution: default-testResources}]
[INFO] Using 'UTF-8' encoding to copy filtered resources.
[INFO] Copying 14 resources
[INFO] Copying 3 resources
[INFO] [compiler:testCompile {execution: default-testCompile}]
[INFO] Compiling 5 source files to <https://hudson.apache.org/hudson/job/Maven-Doxia-Sitetools/./jdk=JDK%201.5%20(latest),label=osx/ws/doxia-decoration-model/target/test-classes>
[INFO] [surefire:test {execution: default-test}]
[INFO] Surefire report directory: <https://hudson.apache.org/hudson/job/Maven-Doxia-Sitetools/./jdk=JDK%201.5%20(latest),label=osx/ws/doxia-decoration-model/target/surefire-reports>

-------------------------------------------------------
 T E S T S
-------------------------------------------------------
Running org.apache.maven.doxia.site.decoration.inheritance.DecorationModelInheritenceAssemblerTest
Tests run: 23, Failures: 0, Errors: 0, Skipped: 0, Time elapsed: 0.139 sec
Running org.apache.maven.doxia.site.decoration.inheritance.Doxia91Test
Tests run: 3, Failures: 0, Errors: 0, Skipped: 0, Time elapsed: 0.003 sec
Running org.apache.maven.doxia.site.decoration.inheritance.PathDescriptorTest
Tests run: 26, Failures: 0, Errors: 0, Skipped: 0, Time elapsed: 0.009 sec
Running org.apache.maven.doxia.site.decoration.inheritance.PathUtilsTest
Tests run: 3, Failures: 0, Errors: 0, Skipped: 0, Time elapsed: 0.003 sec
Running org.apache.maven.doxia.site.decoration.inheritance.URIPathDescriptorTest
Tests run: 5, Failures: 0, Errors: 0, Skipped: 0, Time elapsed: 0.005 sec

Results :

Tests run: 60, Failures: 0, Errors: 0, Skipped: 0

[INFO] [jar:jar {execution: default-jar}]
[INFO] Building jar: <https://hudson.apache.org/hudson/job/Maven-Doxia-Sitetools/./jdk=JDK%201.5%20(latest),label=osx/ws/doxia-decoration-model/target/doxia-decoration-model-1.2-SNAPSHOT.jar>
[INFO] Preparing clirr:check
[WARNING] Removing: check from forked lifecycle, to prevent recursive invocation.
[INFO] [modello:xpp3-writer {execution: descriptor}]
[INFO] outputDirectory: <https://hudson.apache.org/hudson/job/Maven-Doxia-Sitetools/./jdk=JDK%201.5%20(latest),label=osx/ws/doxia-decoration-model/target/generated-sources/modello>
[INFO] Working on model: src/main/mdo/decoration.mdo
[INFO] Generating current version: 1.1.0
[INFO] [modello:java {execution: descriptor}]
[INFO] outputDirectory: <https://hudson.apache.org/hudson/job/Maven-Doxia-Sitetools/./jdk=JDK%201.5%20(latest),label=osx/ws/doxia-decoration-model/target/generated-sources/modello>
[INFO] Working on model: src/main/mdo/decoration.mdo
[INFO] Generating current version: 1.1.0
[INFO] [modello:xpp3-reader {execution: descriptor}]
[INFO] outputDirectory: <https://hudson.apache.org/hudson/job/Maven-Doxia-Sitetools/./jdk=JDK%201.5%20(latest),label=osx/ws/doxia-decoration-model/target/generated-sources/modello>
[INFO] Working on model: src/main/mdo/decoration.mdo
[INFO] Generating current version: 1.1.0
[INFO] [modello:xsd {execution: descriptor}]
[INFO] outputDirectory: <https://hudson.apache.org/hudson/job/Maven-Doxia-Sitetools/./jdk=JDK%201.5%20(latest),label=osx/ws/doxia-decoration-model/target/generated-site/xsd>
[INFO] Working on model: src/main/mdo/decoration.mdo
[INFO] Generating current version: 1.1.0
[INFO] [remote-resources:process {execution: default}]
[INFO] [resources:resources {execution: default-resources}]
[INFO] Using 'UTF-8' encoding to copy filtered resources.
[INFO] skip non existing resourceDirectory <https://hudson.apache.org/hudson/job/Maven-Doxia-Sitetools/./jdk=JDK%201.5%20(latest),label=osx/ws/doxia-decoration-model/src/main/resources>
[INFO] Copying 1 resource
[INFO] Copying 3 resources
[INFO] Copying 3 resources
[INFO] [compiler:compile {execution: default-compile}]
[INFO] Compiling 12 source files to <https://hudson.apache.org/hudson/job/Maven-Doxia-Sitetools/./jdk=JDK%201.5%20(latest),label=osx/ws/doxia-decoration-model/target/classes>
[INFO] [clirr:check {execution: default}]
[INFO] Comparing to version: 1.1
[INFO] Succeeded with 0 errors; 0 warnings; and 0 other changes.
[INFO] [install:install {execution: default-install}]
[INFO] Installing <https://hudson.apache.org/hudson/job/Maven-Doxia-Sitetools/./jdk=JDK%201.5%20(latest),label=osx/ws/doxia-decoration-model/target/doxia-decoration-model-1.2-SNAPSHOT.jar>
to /Users/hudson/.m2/repository/org/apache/maven/doxia/doxia-decoration-model/1.2-SNAPSHOT/doxia-decoration-model-1.2-SNAPSHOT.jar
[INFO] ------------------------------------------------------------------------
[INFO] Building Doxia Sitetools :: Document Renderer Component
[INFO]    task-segment: [clean, install]
[INFO] ------------------------------------------------------------------------
[INFO] [clean:clean {execution: default-clean}]
[INFO] [remote-resources:process {execution: default}]
[INFO] snapshot org.apache.maven.doxia:doxia-core:1.1.5-SNAPSHOT: checking for updates from
apache.snapshots
[INFO] snapshot org.apache.maven.doxia:doxia:1.1.5-SNAPSHOT: checking for updates from apache.snapshots
[INFO] snapshot org.apache.maven.doxia:doxia-sink-api:1.1.5-SNAPSHOT: checking for updates
from apache.snapshots
[INFO] snapshot org.apache.maven.doxia:doxia-logging-api:1.1.5-SNAPSHOT: checking for updates
from apache.snapshots
[INFO] snapshot org.apache.maven.doxia:doxia-module-itext:1.1.5-SNAPSHOT: checking for updates
from apache.snapshots
[INFO] snapshot org.apache.maven.doxia:doxia-modules:1.1.5-SNAPSHOT: checking for updates
from apache.snapshots
[INFO] snapshot org.apache.maven.doxia:doxia-module-fo:1.1.5-SNAPSHOT: checking for updates
from apache.snapshots
[INFO] snapshot org.apache.maven.doxia:doxia-module-apt:1.1.5-SNAPSHOT: checking for updates
from apache.snapshots
[INFO] snapshot org.apache.maven.doxia:doxia-module-fml:1.1.5-SNAPSHOT: checking for updates
from apache.snapshots
[INFO] snapshot org.apache.maven.doxia:doxia-module-xdoc:1.1.5-SNAPSHOT: checking for updates
from apache.snapshots
[INFO] snapshot org.apache.maven.doxia:doxia-module-xhtml:1.1.5-SNAPSHOT: checking for updates
from apache.snapshots
[INFO] [resources:resources {execution: default-resources}]
[INFO] Using 'UTF-8' encoding to copy filtered resources.
[INFO] Copying 1 resource
[INFO] skip non existing resourceDirectory <https://hudson.apache.org/hudson/job/Maven-Doxia-Sitetools/./jdk=JDK%201.5%20(latest),label=osx/ws/doxia-doc-renderer/target/generated-site/xsd>
[INFO] Copying 3 resources
[INFO] [compiler:compile {execution: default-compile}]
[INFO] Compiling 14 source files to <https://hudson.apache.org/hudson/job/Maven-Doxia-Sitetools/./jdk=JDK%201.5%20(latest),label=osx/ws/doxia-doc-renderer/target/classes>
[INFO] [plexus:descriptor {execution: default}]
[INFO] Discovered 4 component descriptors(s)
[INFO] [resources:testResources {execution: default-testResources}]
[INFO] Using 'UTF-8' encoding to copy filtered resources.
[INFO] Copying 13 resources
[INFO] Copying 3 resources
[INFO] [compiler:testCompile {execution: default-testCompile}]
[INFO] Compiling 1 source file to <https://hudson.apache.org/hudson/job/Maven-Doxia-Sitetools/./jdk=JDK%201.5%20(latest),label=osx/ws/doxia-doc-renderer/target/test-classes>
[INFO] [surefire:test {execution: default-test}]
[INFO] Surefire report directory: <https://hudson.apache.org/hudson/job/Maven-Doxia-Sitetools/./jdk=JDK%201.5%20(latest),label=osx/ws/doxia-doc-renderer/target/surefire-reports>

-------------------------------------------------------
 T E S T S
-------------------------------------------------------
Running org.apache.maven.doxia.docrenderer.DocumentRendererTest
Tue Apr  5 12:49:55 eve.local java[67088] <Error>: kCGErrorFailure: Set a breakpoint
@ CGErrorBreakpoint() to catch errors as they are logged.
Tests run: 4, Failures: 0, Errors: 4, Skipped: 0, Time elapsed: 1.608 sec <<< FAILURE!

Results :

Tests in error: 
  testFo(org.apache.maven.doxia.docrenderer.DocumentRendererTest): Can't connect to window
server - not enough permissions.
  testFoAggregate(org.apache.maven.doxia.docrenderer.DocumentRendererTest): Could not initialize
class org.apache.fop.util.ColorUtil
  testIText(org.apache.maven.doxia.docrenderer.DocumentRendererTest): Could not initialize
class java.awt.Color
  testITextAggregate(org.apache.maven.doxia.docrenderer.DocumentRendererTest): Could not initialize
class org.apache.maven.doxia.module.itext.ITextFont

Tests run: 4, Failures: 0, Errors: 4, Skipped: 0

[INFO] ------------------------------------------------------------------------
[INFO] Building Doxia Sitetools :: Site Renderer Component
[INFO]    task-segment: [clean, install]
[INFO] ------------------------------------------------------------------------
[INFO] [clean:clean {execution: default-clean}]
[INFO] [remote-resources:process {execution: default}]
[INFO] snapshot org.apache.maven.doxia:doxia-module-confluence:1.1.5-SNAPSHOT: checking for
updates from apache.snapshots
[INFO] snapshot org.apache.maven.doxia:doxia-module-docbook-simple:1.1.5-SNAPSHOT: checking
for updates from apache.snapshots
Downloading: http://repo1.maven.org/maven2/htmlunit/htmlunit/1.13/htmlunit-1.13.pom

Downloading: http://repo1.maven.org/maven2/rhino/js/1.6R5/js-1.6R5.pom

Downloading: http://repo1.maven.org/maven2/nekohtml/nekohtml/0.9.5/nekohtml-0.9.5.pom

Downloading: http://repo1.maven.org/maven2/xerces/xerces/2.4.0/xerces-2.4.0.pom

Downloading: http://repo1.maven.org/maven2/xerces/xercesImpl/2.4.0/xercesImpl-2.4.0.pom

Downloading: http://repo1.maven.org/maven2/nekohtml/nekohtml/0.9.5/nekohtml-0.9.5.jar
Downloading: http://repo1.maven.org/maven2/rhino/js/1.6R5/js-1.6R5.jar
Downloading: http://repo1.maven.org/maven2/htmlunit/htmlunit/1.13/htmlunit-1.13.jar



[INFO] [resources:resources {execution: default-resources}]
[INFO] Using 'UTF-8' encoding to copy filtered resources.
[INFO] Copying 22 resources
[INFO] skip non existing resourceDirectory <https://hudson.apache.org/hudson/job/Maven-Doxia-Sitetools/./jdk=JDK%201.5%20(latest),label=osx/ws/doxia-site-renderer/target/generated-site/xsd>
[INFO] Copying 3 resources
[INFO] [compiler:compile {execution: default-compile}]
[INFO] Compiling 8 source files to <https://hudson.apache.org/hudson/job/Maven-Doxia-Sitetools/./jdk=JDK%201.5%20(latest),label=osx/ws/doxia-site-renderer/target/classes>
[INFO] [resources:testResources {execution: default-testResources}]
[INFO] Using 'UTF-8' encoding to copy filtered resources.
[INFO] Copying 44 resources
[INFO] Copying 3 resources
[INFO] [compiler:testCompile {execution: default-testCompile}]
[INFO] Compiling 12 source files to <https://hudson.apache.org/hudson/job/Maven-Doxia-Sitetools/./jdk=JDK%201.5%20(latest),label=osx/ws/doxia-site-renderer/target/test-classes>
[INFO] [surefire:test {execution: default-test}]
[INFO] Surefire report directory: <https://hudson.apache.org/hudson/job/Maven-Doxia-Sitetools/./jdk=JDK%201.5%20(latest),label=osx/ws/doxia-site-renderer/target/surefire-reports>

-------------------------------------------------------
 T E S T S
-------------------------------------------------------
Running org.apache.maven.doxia.siterenderer.DefaultSiteRendererTest
[WARNING] [APT Parser] Ambiguous link: 'cdc.html'. If this is a local link, prepend "./"!
[WARNING] [XHTML Sink] No HTML tag found for unknown event: 'note', ignoring!
[WARNING] [XHTML Sink] No HTML tag found for unknown event: 'sidebar', ignoring!
Tests run: 1, Failures: 0, Errors: 0, Skipped: 0, Time elapsed: 24.651 sec

Results :

Tests run: 1, Failures: 0, Errors: 0, Skipped: 0

[INFO] [jar:jar {execution: default-jar}]
[INFO] Building jar: <https://hudson.apache.org/hudson/job/Maven-Doxia-Sitetools/./jdk=JDK%201.5%20(latest),label=osx/ws/doxia-site-renderer/target/doxia-site-renderer-1.2-SNAPSHOT.jar>
[INFO] Preparing clirr:check
[WARNING] Removing: check from forked lifecycle, to prevent recursive invocation.
[INFO] [remote-resources:process {execution: default}]
[INFO] [resources:resources {execution: default-resources}]
[INFO] Using 'UTF-8' encoding to copy filtered resources.
[INFO] Copying 22 resources
[INFO] skip non existing resourceDirectory <https://hudson.apache.org/hudson/job/Maven-Doxia-Sitetools/./jdk=JDK%201.5%20(latest),label=osx/ws/doxia-site-renderer/target/generated-site/xsd>
[INFO] Copying 3 resources
[INFO] Copying 3 resources
[INFO] [compiler:compile {execution: default-compile}]
[INFO] Nothing to compile - all classes are up to date
[INFO] [clirr:check {execution: default}]
[INFO] Comparing to version: 1.1
Downloading: http://repo1.maven.org/maven2/org/apache/maven/doxia/doxia-site-renderer/1.1/doxia-site-renderer-1.1.jar

Downloading: http://repo1.maven.org/maven2/org/apache/maven/doxia/doxia-site-renderer/1.1/doxia-site-renderer-1.1.pom

Downloading: http://repo1.maven.org/maven2/logkit/logkit/1.0.1/logkit-1.0.1.jar
Downloading: http://repo1.maven.org/maven2/avalon-framework/avalon-framework/4.1.3/avalon-framework-4.1.3.jar
Downloading: http://repo1.maven.org/maven2/javax/servlet/servlet-api/2.3/servlet-api-2.3.jar



[INFO] Succeeded with 0 errors; 0 warnings; and 0 other changes.
[INFO] [install:install {execution: default-install}]
[INFO] Installing <https://hudson.apache.org/hudson/job/Maven-Doxia-Sitetools/./jdk=JDK%201.5%20(latest),label=osx/ws/doxia-site-renderer/target/doxia-site-renderer-1.2-SNAPSHOT.jar>
to /Users/hudson/.m2/repository/org/apache/maven/doxia/doxia-site-renderer/1.2-SNAPSHOT/doxia-site-renderer-1.2-SNAPSHOT.jar
[INFO] 
[INFO] 
[INFO] ------------------------------------------------------------------------
[INFO] Reactor Summary:
[INFO] ------------------------------------------------------------------------
[INFO] Doxia Sitetools ....................................... SUCCESS [2.901s]
[INFO] Doxia Sitetools :: Decoration Model ................... SUCCESS [4.492s]
[INFO] Doxia Sitetools :: Document Renderer Component ........ FAILED [3.681s]
[INFO] Doxia Sitetools :: Site Renderer Component ............ SUCCESS [37.125s]
[INFO] ------------------------------------------------------------------------
[INFO] Error for project: Doxia Sitetools :: Document Renderer Component (during install)
[INFO] ------------------------------------------------------------------------
[INFO] There are test failures.

Please refer to <https://hudson.apache.org/hudson/job/Maven-Doxia-Sitetools/./jdk=JDK%201.5%20(latest),label=osx/ws/doxia-doc-renderer/target/surefire-reports>
for the individual test results.
[INFO] ------------------------------------------------------------------------
[INFO] Trace
org.apache.maven.BuildFailureException: There are test failures.

Please refer to <https://hudson.apache.org/hudson/job/Maven-Doxia-Sitetools/./jdk=JDK%201.5%20(latest),label=osx/ws/doxia-doc-renderer/target/surefire-reports>
for the individual test results.
	at org.apache.maven.lifecycle.DefaultLifecycleExecutor.executeGoals(DefaultLifecycleExecutor.java:715)
	at org.apache.maven.lifecycle.DefaultLifecycleExecutor.executeGoalWithLifecycle(DefaultLifecycleExecutor.java:556)
	at org.apache.maven.lifecycle.DefaultLifecycleExecutor.executeGoal(DefaultLifecycleExecutor.java:535)
	at org.apache.maven.lifecycle.DefaultLifecycleExecutor.executeGoalAndHandleFailures(DefaultLifecycleExecutor.java:387)
	at org.apache.maven.lifecycle.DefaultLifecycleExecutor.executeTaskSegments(DefaultLifecycleExecutor.java:348)
	at org.apache.maven.lifecycle.DefaultLifecycleExecutor.execute(DefaultLifecycleExecutor.java:180)
	at org.apache.maven.DefaultMaven.doExecute(DefaultMaven.java:328)
	at org.apache.maven.DefaultMaven.execute(DefaultMaven.java:138)
	at org.apache.maven.cli.MavenCli.main(MavenCli.java:362)
	at org.apache.maven.cli.compat.CompatibleMain.main(CompatibleMain.java:60)
	at sun.reflect.NativeMethodAccessorImpl.invoke0(Native Method)
	at sun.reflect.NativeMethodAccessorImpl.invoke(NativeMethodAccessorImpl.java:39)
	at sun.reflect.DelegatingMethodAccessorImpl.invoke(DelegatingMethodAccessorImpl.java:25)
	at java.lang.reflect.Method.invoke(Method.java:597)
	at org.codehaus.classworlds.Launcher.launchEnhanced(Launcher.java:315)
	at org.codehaus.classworlds.Launcher.launch(Launcher.java:255)
	at org.codehaus.classworlds.Launcher.mainWithExitCode(Launcher.java:430)
	at org.codehaus.classworlds.Launcher.main(Launcher.java:375)
Caused by: org.apache.maven.plugin.MojoFailureException: There are test failures.

Please refer to <https://hudson.apache.org/hudson/job/Maven-Doxia-Sitetools/./jdk=JDK%201.5%20(latest),label=osx/ws/doxia-doc-renderer/target/surefire-reports>
for the individual test results.
	at org.apache.maven.plugin.surefire.SurefireHelper.reportExecution(SurefireHelper.java:74)
	at org.apache.maven.plugin.surefire.SurefirePlugin.execute(SurefirePlugin.java:642)
	at org.apache.maven.plugin.DefaultPluginManager.executeMojo(DefaultPluginManager.java:490)
	at org.apache.maven.lifecycle.DefaultLifecycleExecutor.executeGoals(DefaultLifecycleExecutor.java:694)
	... 17 more
[INFO] ------------------------------------------------------------------------
[INFO] BUILD ERRORS
[INFO] ------------------------------------------------------------------------
[INFO] Total time: 48 seconds
[INFO] Finished at: Tue Apr 05 12:50:33 PDT 2011
[INFO] Final Memory: 50M/265M
[INFO] ------------------------------------------------------------------------


Mime
View raw message