maven-dev mailing list archives

Site index · List index
Message view « Date » · « Thread »
Top « Date » · « Thread »
From Michael Osipov <micha...@apache.org>
Subject Re: [VOTE] Release Apache Maven Doxia Sitetools version 1.7.2
Date Sun, 23 Oct 2016 14:15:11 GMT
Am 2016-10-23 um 16:08 schrieb Hervé BOUTEMY:
> Hi,
>
> We solved 3 issues:
> https://issues.apache.org/jira/secure/ReleaseNote.jspa?projectId=12317320&version=12335521&styleName=Text
>
> There are still a couple of issues left in JIRA:
> https://issues.apache.org/jira/issues/?jql=project%20%3D%2012317320%20AND%20status%20%3D%20Open%20ORDER%20BY%20key%20DESC%2C%20priority%20DESC
>
> Staging repo:
> https://repository.apache.org/content/repositories/maven-1289/
> https://repository.apache.org/content/repositories/maven-1289/org/apache/maven/doxia/doxia-sitetools/1.7.2/doxia-sitetools-1.7.2-source-release.zip
>
> Source release checksum(s):
> doxia-sitetools-1.7.2-source-release.zip sha1:
> 5d61ca66ee939b24d2128b6ab345e8421c4ed40e
>
> Staging site:
> http://maven.apache.org/doxia/doxia-sitetools-archives/doxia-sitetools-LATEST/
>
> Guide to testing staged releases:
> https://maven.apache.org/guides/development/guide-testing-releases.html

SHA1 is ok, but I do have test failures on Windows 10:

-------------------------------------------------------
  T E S T S
-------------------------------------------------------
Running org.apache.maven.doxia.siterenderer.DefaultSiteRendererTest
[WARNING] [APT Parser] Ambiguous link: 'cdc.html'. If this is a local 
link, prepend "./"!
[WARNING] Could not parse date 'May 2008' from apt.apt (expected 
yyyy-MM-dd format), ignoring!
[WARNING] Could not parse date '25th May 2005' from cdc.apt (expected 
yyyy-MM-dd format), ignoring!
[WARNING] [XHTML Sink] No HTML tag found for unknown event: 'note', 
ignoring!
[WARNING] [XHTML Sink] No HTML tag found for unknown event: 'sidebar', 
ignoring!
[WARNING] Could not parse date '30 Nov 1996' from sdocbook_full.xml 
(expected yyyy-MM-dd format), ignoring!
Oct 23, 2016 4:13:13 PM 
com.gargoylesoftware.htmlunit.javascript.host.Stylesheet loadStylesheet
SEVERE: 
D:\doxia-sitetools-1.7.2\doxia-site-renderer\target\output\css\maven-base.css 
(Das System kann den angegebenen Pfad nicht finden)
Oct 23, 2016 4:13:13 PM 
com.gargoylesoftware.htmlunit.javascript.host.Stylesheet loadStylesheet
SEVERE: 
D:\doxia-sitetools-1.7.2\doxia-site-renderer\target\output\css\maven-theme.css 
(Das System kann den angegebenen Pfad nicht finden)
Oct 23, 2016 4:13:13 PM 
com.gargoylesoftware.htmlunit.javascript.host.Stylesheet loadStylesheet
SEVERE: 
D:\doxia-sitetools-1.7.2\doxia-site-renderer\target\output\css\site.css 
(Das System kann den angegebenen Pfad nicht finden)
Oct 23, 2016 4:13:13 PM 
com.gargoylesoftware.htmlunit.javascript.host.Stylesheet loadStylesheet
SEVERE: 
D:\doxia-sitetools-1.7.2\doxia-site-renderer\target\output\css\print.css 
(Das System kann den angegebenen Pfad nicht finden)
Oct 23, 2016 4:13:13 PM 
com.gargoylesoftware.htmlunit.javascript.host.Stylesheet loadStylesheet
SEVERE: 
D:\doxia-sitetools-1.7.2\doxia-site-renderer\target\output\css\maven-base.css 
(Das System kann den angegebenen Pfad nicht finden)
Oct 23, 2016 4:13:13 PM 
com.gargoylesoftware.htmlunit.javascript.host.Stylesheet loadStylesheet
SEVERE: 
D:\doxia-sitetools-1.7.2\doxia-site-renderer\target\output\css\maven-theme.css 
(Das System kann den angegebenen Pfad nicht finden)
Oct 23, 2016 4:13:13 PM 
com.gargoylesoftware.htmlunit.javascript.host.Stylesheet loadStylesheet
SEVERE: 
D:\doxia-sitetools-1.7.2\doxia-site-renderer\target\output\css\site.css 
(Das System kann den angegebenen Pfad nicht finden)
Oct 23, 2016 4:13:13 PM 
com.gargoylesoftware.htmlunit.javascript.host.Stylesheet loadStylesheet
SEVERE: 
D:\doxia-sitetools-1.7.2\doxia-site-renderer\target\output\css\print.css 
(Das System kann den angegebenen Pfad nicht finden)
Oct 23, 2016 4:13:13 PM 
com.gargoylesoftware.htmlunit.javascript.host.Stylesheet loadStylesheet
SEVERE: 
D:\doxia-sitetools-1.7.2\doxia-site-renderer\target\output\css\maven-base.css 
(Das System kann den angegebenen Pfad nicht finden)
Oct 23, 2016 4:13:13 PM 
com.gargoylesoftware.htmlunit.javascript.host.Stylesheet loadStylesheet
SEVERE: 
D:\doxia-sitetools-1.7.2\doxia-site-renderer\target\output\css\maven-theme.css 
(Das System kann den angegebenen Pfad nicht finden)
Oct 23, 2016 4:13:13 PM 
com.gargoylesoftware.htmlunit.javascript.host.Stylesheet loadStylesheet
SEVERE: 
D:\doxia-sitetools-1.7.2\doxia-site-renderer\target\output\css\site.css 
(Das System kann den angegebenen Pfad nicht finden)
Oct 23, 2016 4:13:13 PM 
com.gargoylesoftware.htmlunit.javascript.host.Stylesheet loadStylesheet
SEVERE: 
D:\doxia-sitetools-1.7.2\doxia-site-renderer\target\output\css\print.css 
(Das System kann den angegebenen Pfad nicht finden)
Oct 23, 2016 4:13:13 PM 
com.gargoylesoftware.htmlunit.javascript.host.Stylesheet loadStylesheet
SEVERE: 
D:\doxia-sitetools-1.7.2\doxia-site-renderer\target\output\css\maven-base.css 
(Das System kann den angegebenen Pfad nicht finden)
Oct 23, 2016 4:13:13 PM 
com.gargoylesoftware.htmlunit.javascript.host.Stylesheet loadStylesheet
SEVERE: 
D:\doxia-sitetools-1.7.2\doxia-site-renderer\target\output\css\maven-theme.css 
(Das System kann den angegebenen Pfad nicht finden)
Oct 23, 2016 4:13:13 PM 
com.gargoylesoftware.htmlunit.javascript.host.Stylesheet loadStylesheet
SEVERE: 
D:\doxia-sitetools-1.7.2\doxia-site-renderer\target\output\css\site.css 
(Das System kann den angegebenen Pfad nicht finden)
Oct 23, 2016 4:13:13 PM 
com.gargoylesoftware.htmlunit.javascript.host.Stylesheet loadStylesheet
SEVERE: 
D:\doxia-sitetools-1.7.2\doxia-site-renderer\target\output\css\print.css 
(Das System kann den angegebenen Pfad nicht finden)
Oct 23, 2016 4:13:13 PM 
com.gargoylesoftware.htmlunit.javascript.host.Stylesheet loadStylesheet
SEVERE: 
D:\doxia-sitetools-1.7.2\doxia-site-renderer\target\output\css\maven-base.css 
(Das System kann den angegebenen Pfad nicht finden)
Oct 23, 2016 4:13:13 PM 
com.gargoylesoftware.htmlunit.javascript.host.Stylesheet loadStylesheet
SEVERE: 
D:\doxia-sitetools-1.7.2\doxia-site-renderer\target\output\css\maven-theme.css 
(Das System kann den angegebenen Pfad nicht finden)
Oct 23, 2016 4:13:13 PM 
com.gargoylesoftware.htmlunit.javascript.host.Stylesheet loadStylesheet
SEVERE: 
D:\doxia-sitetools-1.7.2\doxia-site-renderer\target\output\css\site.css 
(Das System kann den angegebenen Pfad nicht finden)
Oct 23, 2016 4:13:13 PM 
com.gargoylesoftware.htmlunit.javascript.host.Stylesheet loadStylesheet
SEVERE: 
D:\doxia-sitetools-1.7.2\doxia-site-renderer\target\output\css\print.css 
(Das System kann den angegebenen Pfad nicht finden)
Oct 23, 2016 4:13:13 PM 
com.gargoylesoftware.htmlunit.javascript.host.Stylesheet loadStylesheet
SEVERE: 
D:\doxia-sitetools-1.7.2\doxia-site-renderer\target\output\css\maven-base.css 
(Das System kann den angegebenen Pfad nicht finden)
Oct 23, 2016 4:13:13 PM 
com.gargoylesoftware.htmlunit.javascript.host.Stylesheet loadStylesheet
SEVERE: 
D:\doxia-sitetools-1.7.2\doxia-site-renderer\target\output\css\maven-theme.css 
(Das System kann den angegebenen Pfad nicht finden)
Oct 23, 2016 4:13:13 PM 
com.gargoylesoftware.htmlunit.javascript.host.Stylesheet loadStylesheet
SEVERE: 
D:\doxia-sitetools-1.7.2\doxia-site-renderer\target\output\css\site.css 
(Das System kann den angegebenen Pfad nicht finden)
Oct 23, 2016 4:13:13 PM 
com.gargoylesoftware.htmlunit.javascript.host.Stylesheet loadStylesheet
SEVERE: 
D:\doxia-sitetools-1.7.2\doxia-site-renderer\target\output\css\print.css 
(Das System kann den angegebenen Pfad nicht finden)
Oct 23, 2016 4:13:13 PM 
com.gargoylesoftware.htmlunit.javascript.host.Stylesheet loadStylesheet
SEVERE: 
D:\doxia-sitetools-1.7.2\doxia-site-renderer\target\output\css\maven-base.css 
(Das System kann den angegebenen Pfad nicht finden)
Oct 23, 2016 4:13:13 PM 
com.gargoylesoftware.htmlunit.javascript.host.Stylesheet loadStylesheet
SEVERE: 
D:\doxia-sitetools-1.7.2\doxia-site-renderer\target\output\css\maven-theme.css 
(Das System kann den angegebenen Pfad nicht finden)
Oct 23, 2016 4:13:13 PM 
com.gargoylesoftware.htmlunit.javascript.host.Stylesheet loadStylesheet
SEVERE: 
D:\doxia-sitetools-1.7.2\doxia-site-renderer\target\output\css\site.css 
(Das System kann den angegebenen Pfad nicht finden)
Oct 23, 2016 4:13:13 PM 
com.gargoylesoftware.htmlunit.javascript.host.Stylesheet loadStylesheet
SEVERE: 
D:\doxia-sitetools-1.7.2\doxia-site-renderer\target\output\css\print.css 
(Das System kann den angegebenen Pfad nicht finden)
Tests run: 6, Failures: 3, Errors: 0, Skipped: 0, Time elapsed: 2.2 sec 
<<< FAILURE! - in 
org.apache.maven.doxia.siterenderer.DefaultSiteRendererTest
testVelocityToolManagerForSkin(org.apache.maven.doxia.siterenderer.DefaultSiteRendererTest)

  Time elapsed: 0.371 sec  <<< FAILURE!
junit.framework.ComparisonFailure:
expected:<Maven 2 &amp; 3[
This is...
We have the following keys in the context:
    1. FileUtils
    2. PathTool
    3. StringUtils
    4. alignedFileName
    5. alternator
    6. authors
    7. bodyContent
    8. class
    9. context
   10. convert
   11. currentDate
   12. currentFileName
   13. date
   14. dateFormat
   15. dateRevision
   16. decoration
   17. display
   18. doxiaSiteRendererVersion
   19. esc
   20. field
   21. headContent
   22. i18n
   23. link
   24. locale
   25. loop
   26. math
   27. number
   28. plexus
   29. publishDate
   30. relativePath
   31. render
   32. shortTitle
   33. sorter
   34. supportedLocales
   35. text
   36. title
   37. xml]
 > but was:<Maven 2 &amp; 3[
This is...

We have the following keys in the context:
    1. FileUtils
    2. PathTool
    3. StringUtils
    4. alignedFileName
    5. alternator
    6. authors
    7. bodyContent
    8. class
    9. context
   10. convert
   11. currentDate
   12. currentFileName
   13. date
   14. dateFormat
   15. dateRevision
   16. decoration
   17. display
   18. doxiaSiteRendererVersion
   19. esc
   20. field
   21. headContent
   22. i18n
   23. link
   24. locale
   25. loop
   26. math
   27. number
   28. plexus
   29. publishDate
   30. relativePath
   31. render
   32. shortTitle
   33. sorter
   34. supportedLocales
   35. text
   36. title
] 37. xml
 >
         at junit.framework.Assert.assertEquals(Assert.java:81)
         at junit.framework.Assert.assertEquals(Assert.java:87)
         at 
org.apache.maven.doxia.siterenderer.DefaultSiteRendererTest.testVelocityToolManagerForSkin(DefaultSiteRendererTest.java:286)

testVelocityToolManager(org.apache.maven.doxia.siterenderer.DefaultSiteRendererTest) 
  Time elapsed: 0.039 sec  <<< FAILURE!
junit.framework.ComparisonFailure:
expected:<Maven 2 &amp; 3[
This is...
We have the following keys in the context:
    1. FileUtils
    2. PathTool
    3. StringUtils
    4. alignedFileName
    5. alternator
    6. authors
    7. bodyContent
    8. class
    9. context
   10. convert
   11. currentDate
   12. currentFileName
   13. date
   14. dateFormat
   15. dateRevision
   16. decoration
   17. display
   18. doxiaSiteRendererVersion
   19. esc
   20. field
   21. headContent
   22. i18n
   23. link
   24. locale
   25. loop
   26. math
   27. number
   28. plexus
   29. publishDate
   30. relativePath
   31. render
   32. shortTitle
   33. sorter
   34. supportedLocales
   35. text
   36. title
   37. xml]
 > but was:<Maven 2 &amp; 3[
This is...

We have the following keys in the context:
    1. FileUtils
    2. PathTool
    3. StringUtils
    4. alignedFileName
    5. alternator
    6. authors
    7. bodyContent
    8. class
    9. context
   10. convert
   11. currentDate
   12. currentFileName
   13. date
   14. dateFormat
   15. dateRevision
   16. decoration
   17. display
   18. doxiaSiteRendererVersion
   19. esc
   20. field
   21. headContent
   22. i18n
   23. link
   24. locale
   25. loop
   26. math
   27. number
   28. plexus
   29. publishDate
   30. relativePath
   31. render
   32. shortTitle
   33. sorter
   34. supportedLocales
   35. text
   36. title
] 37. xml
 >
         at junit.framework.Assert.assertEquals(Assert.java:81)
         at junit.framework.Assert.assertEquals(Assert.java:87)
         at 
org.apache.maven.doxia.siterenderer.DefaultSiteRendererTest.testVelocityToolManager(DefaultSiteRendererTest.java:233)

testVelocityToolManagerForTemplate(org.apache.maven.doxia.siterenderer.DefaultSiteRendererTest)

  Time elapsed: 0.032 sec  <<< FAILURE!
junit.framework.ComparisonFailure:
expected:<Maven 2 &amp; 3[
This is...
We have the following keys in the context:
    1. FileUtils
    2. PathTool
    3. StringUtils
    4. alignedFileName
    5. alternator
    6. authors
    7. bodyContent
    8. class
    9. context
   10. convert
   11. currentDate
   12. currentFileName
   13. date
   14. dateFormat
   15. dateRevision
   16. decoration
   17. display
   18. doxiaSiteRendererVersion
   19. esc
   20. field
   21. headContent
   22. i18n
   23. link
   24. locale
   25. loop
   26. math
   27. number
   28. plexus
   29. publishDate
   30. relativePath
   31. render
   32. shortTitle
   33. sorter
   34. supportedLocales
   35. text
   36. title
   37. xml]
 > but was:<Maven 2 &amp; 3[
This is...

We have the following keys in the context:
    1. FileUtils
    2. PathTool
    3. StringUtils
    4. alignedFileName
    5. alternator
    6. authors
    7. bodyContent
    8. class
    9. context
   10. convert
   11. currentDate
   12. currentFileName
   13. date
   14. dateFormat
   15. dateRevision
   16. decoration
   17. display
   18. doxiaSiteRendererVersion
   19. esc
   20. field
   21. headContent
   22. i18n
   23. link
   24. locale
   25. loop
   26. math
   27. number
   28. plexus
   29. publishDate
   30. relativePath
   31. render
   32. shortTitle
   33. sorter
   34. supportedLocales
   35. text
   36. title
] 37. xml
 >
         at junit.framework.Assert.assertEquals(Assert.java:81)
         at junit.framework.Assert.assertEquals(Assert.java:87)
         at 
org.apache.maven.doxia.siterenderer.DefaultSiteRendererTest.testVelocityToolManagerForTemplate(DefaultSiteRendererTest.java:260)

Running org.apache.maven.doxia.siterenderer.RenderingContextTest
Tests run: 1, Failures: 0, Errors: 0, Skipped: 0, Time elapsed: 0 sec - 
in org.apache.maven.doxia.siterenderer.RenderingContextTest
Running org.apache.maven.doxia.siterenderer.SkinResourceLoaderTest
Tests run: 1, Failures: 0, Errors: 0, Skipped: 0, Time elapsed: 0.002 
sec - in org.apache.maven.doxia.siterenderer.SkinResourceLoaderTest

Results :

Failed tests:
 
org.apache.maven.doxia.siterenderer.DefaultSiteRendererTest#testVelocityToolManager 
ComparisonFailure
 
org.apache.maven.doxia.siterenderer.DefaultSiteRendererTest#testVelocityToolManagerForSkin

ComparisonFailure
 
org.apache.maven.doxia.siterenderer.DefaultSiteRendererTest#testVelocityToolManagerForTemplate

ComparisonFailure

Tests run: 8, Failures: 3, Errors: 0, Skipped: 0

[INFO] 
------------------------------------------------------------------------
[INFO] Reactor Summary:
[INFO]
[INFO] Doxia :: Sitetools ................................. SUCCESS [ 
2.406 s]
[INFO] Doxia :: Decoration Model .......................... SUCCESS [ 
3.448 s]
[INFO] Doxia :: Skin Model ................................ SUCCESS [ 
0.611 s]
[INFO] Doxia :: Integration Tools ......................... SUCCESS [ 
3.711 s]
[INFO] Doxia :: Site Renderer ............................. FAILURE [ 
4.035 s]
[INFO] Doxia :: Document Renderer ......................... SKIPPED
[INFO] 
------------------------------------------------------------------------
[INFO] BUILD FAILURE
[INFO] 
------------------------------------------------------------------------
[INFO] Total time: 14.374 s
[INFO] Finished at: 2016-10-23T16:13:14+02:00
[INFO] Final Memory: 78M/660M
[INFO] 
------------------------------------------------------------------------
[WARNING] The requested profile "run-its" could not be activated because 
it does not exist.
[ERROR] Failed to execute goal 
org.apache.maven.plugins:maven-surefire-plugin:2.19.1:test 
(default-test) on project doxia-site-renderer: There are test failures.
[ERROR]
[ERROR] Please refer to 
D:\doxia-sitetools-1.7.2\doxia-site-renderer\target\surefire-reports for 
the individual test results.



---------------------------------------------------------------------
To unsubscribe, e-mail: dev-unsubscribe@maven.apache.org
For additional commands, e-mail: dev-help@maven.apache.org


Mime
View raw message