maven-dev mailing list archives

Site index · List index
Message view « Date » · « Thread »
Top « Date » · « Thread »
From "Robert Scholte" <rfscho...@apache.org>
Subject Re: Build failed in Jenkins: maven-plugins-ITs-m3-windows #187
Date Fri, 01 Mar 2013 20:07:03 GMT
Is it possible to add a javadoc label to the Windows-systems which do have  
javadoc installed properly and add a restriction to this job to be sure it  
is executed on the right slave?

Robert

Op Fri, 01 Mar 2013 18:14:03 +0100 schreef Apache Jenkins Server  
<jenkins@builds.apache.org>:

> See  
> <https://builds.apache.org/job/maven-plugins-ITs-m3-windows/187/changes>
>
> Changes:
>
> [andham] Some clean ups
>
> ------------------------------------------
> [...truncated 10167 lines...]
> Tests run: 1, Failures: 0, Errors: 0, Skipped: 0, Time elapsed: 0 sec
> Running org.apache.maven.plugins.shade.mojo.RelativizePathTest
> Tests run: 1, Failures: 0, Errors: 0, Skipped: 0, Time elapsed: 0.043 sec
> Running org.apache.maven.plugins.shade.mojo.ShadeMojoTest
> Tests run: 4, Failures: 0, Errors: 0, Skipped: 0, Time elapsed: 1.525 sec
> Running  
> org.apache.maven.plugins.shade.relocation.SimpleRelocatorParameterTest
> Tests run: 2, Failures: 0, Errors: 0, Skipped: 0, Time elapsed: 0.013 sec
> Running org.apache.maven.plugins.shade.relocation.SimpleRelocatorTest
> Tests run: 7, Failures: 0, Errors: 0, Skipped: 0, Time elapsed: 0 sec
> Running  
> org.apache.maven.plugins.shade.resource.ApacheLicenseResourceTransformerTest
> Tests run: 1, Failures: 0, Errors: 0, Skipped: 0, Time elapsed: 0 sec
> Running  
> org.apache.maven.plugins.shade.resource.ApacheNoticeResourceTransformerTest
> Tests run: 1, Failures: 0, Errors: 0, Skipped: 0, Time elapsed: 0 sec
> Running org.apache.maven.plugins.shade.resource.AppendingTransformerTest
> Tests run: 1, Failures: 0, Errors: 0, Skipped: 0, Time elapsed: 0 sec
> Running  
> org.apache.maven.plugins.shade.resource.ComponentsXmlResourceTransformerTest
> Tests run: 1, Failures: 0, Errors: 0, Skipped: 0, Time elapsed: 0 sec
> Running  
> org.apache.maven.plugins.shade.resource.XmlAppendingTransformerTest
> Tests run: 1, Failures: 0, Errors: 0, Skipped: 0, Time elapsed: 0.013 sec
>
> Results :
>
> Tests run: 27, Failures: 0, Errors: 0, Skipped: 0
>
> [INFO]
> [INFO] --- maven-jar-plugin:2.4:jar (default-jar) @ maven-shade-plugin  
> ---
> [INFO] Building jar:  
> F:\hudson\hudson-slave\workspace\maven-plugins-ITs-m3-windows\maven-shade-plugin\target\maven-shade-plugin-3.0-SNAPSHOT.jar
> [INFO]
> [INFO] --- maven-plugin-plugin:3.2:addPluginArtifactMetadata  
> (default-addPluginArtifactMetadata) @ maven-shade-plugin ---
> [INFO]
> [INFO] --- maven-jar-plugin:2.4:test-jar (default) @ maven-shade-plugin  
> ---
> [INFO] Building jar:  
> F:\hudson\hudson-slave\workspace\maven-plugins-ITs-m3-windows\maven-shade-plugin\target\maven-shade-plugin-3.0-SNAPSHOT-tests.jar
> [INFO]
> [INFO] --- maven-invoker-plugin:1.6:install (integration-test) @  
> maven-shade-plugin ---
> [INFO] Installing  
> F:\hudson\hudson-slave\workspace\maven-plugins-ITs-m3-windows\maven-shade-plugin\pom.xml
 
> to  
> F:\hudson\hudson-slave\workspace\maven-plugins-ITs-m3-windows\maven-shade-plugin\target\local-repo\org\apache\maven\plugins\maven-shade-plugin\3.0-SNAPSHOT\maven-shade-plugin-3.0-SNAPSHOT.pom
> [INFO] Installing  
> F:\hudson\hudson-slave\workspace\maven-plugins-ITs-m3-windows\maven-shade-plugin\target\maven-shade-plugin-3.0-SNAPSHOT.jar
 
> to  
> F:\hudson\hudson-slave\workspace\maven-plugins-ITs-m3-windows\maven-shade-plugin\target\local-repo\org\apache\maven\plugins\maven-shade-plugin\3.0-SNAPSHOT\maven-shade-plugin-3.0-SNAPSHOT.jar
> [INFO] Installing  
> F:\hudson\hudson-slave\workspace\maven-plugins-ITs-m3-windows\maven-shade-plugin\target\maven-shade-plugin-3.0-SNAPSHOT-tests.jar
 
> to  
> F:\hudson\hudson-slave\workspace\maven-plugins-ITs-m3-windows\maven-shade-plugin\target\local-repo\org\apache\maven\plugins\maven-shade-plugin\3.0-SNAPSHOT\maven-shade-plugin-3.0-SNAPSHOT-tests.jar
> [INFO]
> [INFO] --- maven-invoker-plugin:1.6:integration-test (integration-test)  
> @ maven-shade-plugin ---
> [INFO] Building: artifact-includes-excludes\pom.xml
> [INFO] run script  
> F:\hudson\hudson-slave\workspace\maven-plugins-ITs-m3-windows\maven-shade-plugin\target\it\artifact-includes-excludes\verify.bsh
> [INFO] ..SUCCESS (13.9 s)
> [INFO] Building: attach-after-lifecycle-fork\pom.xml
> [INFO] run script  
> F:\hudson\hudson-slave\workspace\maven-plugins-ITs-m3-windows\maven-shade-plugin\target\it\attach-after-lifecycle-fork\setup.bsh
> [INFO] run script  
> F:\hudson\hudson-slave\workspace\maven-plugins-ITs-m3-windows\maven-shade-plugin\target\it\attach-after-lifecycle-fork\verify.bsh
> [INFO] ..SUCCESS (9.9 s)
> [INFO] Building: attached-artifact-type\pom.xml
> [INFO] ..SUCCESS (5.8 s)
> [INFO] Building: component-descriptor-relocation\pom.xml
> [INFO] ..SUCCESS (5.7 s)
> [INFO] Building: dep-reduced-pom\pom.xml
> [INFO] run script  
> F:\hudson\hudson-slave\workspace\maven-plugins-ITs-m3-windows\maven-shade-plugin\target\it\dep-reduced-pom\verify.groovy
> [INFO] ..SUCCESS (4.7 s)
> [INFO] Building: dep-reduced-pom-relocated-result\pom.xml
> [INFO] ..SUCCESS (3.8 s)
> [INFO] Building: dep-reduced-pom-unique\pom.xml
> [INFO] run script  
> F:\hudson\hudson-slave\workspace\maven-plugins-ITs-m3-windows\maven-shade-plugin\target\it\dep-reduced-pom-unique\verify.groovy
> [INFO] ..SUCCESS (6.5 s)
> [INFO] Building: dep-reduced-pom-use-base-version\pom.xml
> [INFO] run script  
> F:\hudson\hudson-slave\workspace\maven-plugins-ITs-m3-windows\maven-shade-plugin\target\it\dep-reduced-pom-use-base-version\verify.groovy
> [INFO] ..SUCCESS (4.8 s)
> [INFO] Building: dep-reduced-pom-with-local-parent\pom.xml
> [INFO] ..SUCCESS (3.5 s)
> [INFO] Building: duplicate-classes-with-reloc\pom.xml
> [INFO] ..SUCCESS (4.4 s)
> [INFO] Building: duplicate-classes-without-reloc\pom.xml
> [INFO] ..SUCCESS (3.9 s)
> [INFO] Building: empty-apache-notice-transform\pom.xml
> [INFO] ..SUCCESS (5.1 s)
> [INFO] Building: empty-relocation-pattern\pom.xml
> [INFO] ..SUCCESS (4.9 s)
> [INFO] Building: empty-relocation-shaded-pattern\pom.xml
> [INFO] ..SUCCESS (4.7 s)
> [INFO] Building: filter-artifact-contents\pom.xml
> [INFO] run script  
> F:\hudson\hudson-slave\workspace\maven-plugins-ITs-m3-windows\maven-shade-plugin\target\it\filter-artifact-contents\verify.bsh
> [INFO] ..SUCCESS (4.8 s)
> [INFO] Building: finalNameBuild\pom.xml
> [INFO] run script  
> F:\hudson\hudson-slave\workspace\maven-plugins-ITs-m3-windows\maven-shade-plugin\target\it\finalNameBuild\setup.bsh
> [INFO] run script  
> F:\hudson\hudson-slave\workspace\maven-plugins-ITs-m3-windows\maven-shade-plugin\target\it\finalNameBuild\verify.bsh
> [INFO] ..SUCCESS (4.3 s)
> [INFO] Building: finalNameBuild-attached\pom.xml
> [INFO] run script  
> F:\hudson\hudson-slave\workspace\maven-plugins-ITs-m3-windows\maven-shade-plugin\target\it\finalNameBuild-attached\setup.bsh
> [INFO] run script  
> F:\hudson\hudson-slave\workspace\maven-plugins-ITs-m3-windows\maven-shade-plugin\target\it\finalNameBuild-attached\verify.bsh
> [INFO] ..SUCCESS (4.7 s)
> [INFO] Building: finalNameShade\pom.xml
> [INFO] run script  
> F:\hudson\hudson-slave\workspace\maven-plugins-ITs-m3-windows\maven-shade-plugin\target\it\finalNameShade\setup.bsh
> [INFO] run script  
> F:\hudson\hudson-slave\workspace\maven-plugins-ITs-m3-windows\maven-shade-plugin\target\it\finalNameShade\verify.bsh
> [INFO] ..SUCCESS (4.5 s)
> [INFO] Building: finalNameShade-attached\pom.xml
> [INFO] run script  
> F:\hudson\hudson-slave\workspace\maven-plugins-ITs-m3-windows\maven-shade-plugin\target\it\finalNameShade-attached\setup.bsh
> [INFO] run script  
> F:\hudson\hudson-slave\workspace\maven-plugins-ITs-m3-windows\maven-shade-plugin\target\it\finalNameShade-attached\verify.bsh
> [INFO] ..SUCCESS (4.4 s)
> [INFO] Building: implicit-inclusion-of-project-artifact\pom.xml
> [INFO] run script  
> F:\hudson\hudson-slave\workspace\maven-plugins-ITs-m3-windows\maven-shade-plugin\target\it\implicit-inclusion-of-project-artifact\verify.bsh
> [INFO] ..SUCCESS (5.0 s)
> [INFO] Building: manifest-retained\pom.xml
> [INFO] run script  
> F:\hudson\hudson-slave\workspace\maven-plugins-ITs-m3-windows\maven-shade-plugin\target\it\manifest-retained\verify.bsh
> [INFO] ..SUCCESS (6.7 s)
> [INFO] Building: manifest-transformed\pom.xml
> [INFO] run script  
> F:\hudson\hudson-slave\workspace\maven-plugins-ITs-m3-windows\maven-shade-plugin\target\it\manifest-transformed\verify.bsh
> [INFO] ..SUCCESS (4.9 s)
> [INFO] Building: mini-jar\pom.xml
> [INFO] run script  
> F:\hudson\hudson-slave\workspace\maven-plugins-ITs-m3-windows\maven-shade-plugin\target\it\mini-jar\verify.bsh
> [INFO] ..SUCCESS (5.2 s)
> [INFO] Building: mini-jar-malformed-dependencies\pom.xml
> [INFO] ..SUCCESS (9.3 s)
> [INFO] Building: mini-jar-package-info\pom.xml
> [INFO] run script  
> F:\hudson\hudson-slave\workspace\maven-plugins-ITs-m3-windows\maven-shade-plugin\target\it\mini-jar-package-info\verify.bsh
> [INFO] ..SUCCESS (7.1 s)
> [INFO] Building: mini-jar-respect-includes\pom.xml
> [INFO] run script  
> F:\hudson\hudson-slave\workspace\maven-plugins-ITs-m3-windows\maven-shade-plugin\target\it\mini-jar-respect-includes\verify.bsh
> [INFO] ..SUCCESS (6.2 s)
> [INFO] Building: MSHADE-105\pom.xml
> [INFO] run script  
> F:\hudson\hudson-slave\workspace\maven-plugins-ITs-m3-windows\maven-shade-plugin\target\it\MSHADE-105\verify.bsh
> [INFO] ..SUCCESS (13.9 s)
> [INFO] Building: mshade-123\pom.xml
> [INFO] ..SUCCESS (9.4 s)
> [INFO] Building: non-runtime-scope-excluded\pom.xml
> [INFO] run script  
> F:\hudson\hudson-slave\workspace\maven-plugins-ITs-m3-windows\maven-shade-plugin\target\it\non-runtime-scope-excluded\verify.bsh
> [INFO] ..SUCCESS (5.5 s)
> [INFO] Building: plugin-descriptor-relocation\pom.xml
> [INFO] run script  
> F:\hudson\hudson-slave\workspace\maven-plugins-ITs-m3-windows\maven-shade-plugin\target\it\plugin-descriptor-relocation\verify.groovy
> [INFO] ..SUCCESS (11.8 s)
> [INFO] Building: pom-packaging\pom.xml
> [INFO] run script  
> F:\hudson\hudson-slave\workspace\maven-plugins-ITs-m3-windows\maven-shade-plugin\target\it\pom-packaging\verify.bsh
> [INFO] ..SUCCESS (3.7 s)
> [INFO] Building: project-with-reactors-included\pom.xml
> [INFO] run script  
> F:\hudson\hudson-slave\workspace\maven-plugins-ITs-m3-windows\maven-shade-plugin\target\it\project-with-reactors-included\verify.bsh
> [INFO] ..SUCCESS (7.5 s)
> [INFO] Building: reloc-abs-resource-path\pom.xml
> [INFO] ..SUCCESS (8.0 s)
> [INFO] Building: reloc-anno\pom.xml
> [INFO] ..SUCCESS (4.4 s)
> [INFO] Building: reloc-class-from-string-pool\pom.xml
> [INFO] ..SUCCESS (4.4 s)
> [INFO] Building: reloc-enum-ref-from-anno\pom.xml
> [INFO] ..SUCCESS (4.4 s)
> [INFO] Building: reloc-includes-excludes\pom.xml
> [INFO] run script  
> F:\hudson\hudson-slave\workspace\maven-plugins-ITs-m3-windows\maven-shade-plugin\target\it\reloc-includes-excludes\verify.bsh
> [INFO] ..SUCCESS (5.4 s)
> [INFO] Building: rerun-with-reloc\pom.xml
> [INFO] ..SUCCESS (5.8 s)
> [INFO] Building: rerun-without-reloc\pom.xml
> [INFO] ..SUCCESS (4.5 s)
> [INFO] Building: services-resource-transformer\pom.xml
> [INFO] run script  
> F:\hudson\hudson-slave\workspace\maven-plugins-ITs-m3-windows\maven-shade-plugin\target\it\services-resource-transformer\verify.bsh
> [INFO] ..SUCCESS (4.4 s)
> [INFO] Building: shadePomDependency\pom.xml
> [INFO] ..SUCCESS (5.8 s)
> [INFO] Building: users-shader-impl\pom.xml
> [INFO] run script  
> F:\hudson\hudson-slave\workspace\maven-plugins-ITs-m3-windows\maven-shade-plugin\target\it\users-shader-impl\verify.groovy
> [INFO] ..SUCCESS (6.1 s)
> [INFO] Building: xml-transformer-ignores-dtd\pom.xml
> [INFO] run script  
> F:\hudson\hudson-slave\workspace\maven-plugins-ITs-m3-windows\maven-shade-plugin\target\it\xml-transformer-ignores-dtd\verify.bsh
> [INFO] ..SUCCESS (6.9 s)
> [INFO]
> [INFO] --- maven-invoker-plugin:1.6:verify (integration-test) @  
> maven-shade-plugin ---
> [INFO] -------------------------------------------------
> [INFO] Build Summary:
> [INFO]   Passed: 43, Failed: 0, Errors: 0, Skipped: 0
> [INFO] -------------------------------------------------
> [INFO]
> [INFO] --- maven-install-plugin:2.3.1:install (default-install) @  
> maven-shade-plugin ---
> [INFO] Installing  
> F:\hudson\hudson-slave\workspace\maven-plugins-ITs-m3-windows\maven-shade-plugin\target\maven-shade-plugin-3.0-SNAPSHOT.jar
 
> to  
> C:\Users\hudson\.m2\repository\org\apache\maven\plugins\maven-shade-plugin\3.0-SNAPSHOT\maven-shade-plugin-3.0-SNAPSHOT.jar
> [INFO] Installing  
> F:\hudson\hudson-slave\workspace\maven-plugins-ITs-m3-windows\maven-shade-plugin\pom.xml
 
> to  
> C:\Users\hudson\.m2\repository\org\apache\maven\plugins\maven-shade-plugin\3.0-SNAPSHOT\maven-shade-plugin-3.0-SNAPSHOT.pom
> [INFO] Installing  
> F:\hudson\hudson-slave\workspace\maven-plugins-ITs-m3-windows\maven-shade-plugin\target\maven-shade-plugin-3.0-SNAPSHOT-tests.jar
 
> to  
> C:\Users\hudson\.m2\repository\org\apache\maven\plugins\maven-shade-plugin\3.0-SNAPSHOT\maven-shade-plugin-3.0-SNAPSHOT-tests.jar
> [INFO]
> [INFO]  
> ------------------------------------------------------------------------
> [INFO] Building Maven Plugins Aggregator 1-SNAPSHOT
> [INFO]  
> ------------------------------------------------------------------------
> [INFO]
> [INFO] --- maven-clean-plugin:2.4.1:clean (default-clean) @  
> maven-plugins-aggregator ---
> [INFO] Deleting  
> <https://builds.apache.org/job/maven-plugins-ITs-m3-windows/ws/target>
> [INFO]
> [INFO] --- maven-remote-resources-plugin:1.1:process (default) @  
> maven-plugins-aggregator ---
> [INFO]
> [INFO] --- maven-install-plugin:2.3.1:install (default-install) @  
> maven-plugins-aggregator ---
> [INFO] Installing  
> <https://builds.apache.org/job/maven-plugins-ITs-m3-windows/ws/pom.xml>  
> to  
> C:\Users\hudson\.m2\repository\org\apache\maven\plugins\maven-plugins-aggregator\1-SNAPSHOT\maven-plugins-aggregator-1-SNAPSHOT.pom
> [INFO]  
> ------------------------------------------------------------------------
> [INFO] Reactor Summary:
> [INFO]
> [INFO] Maven Plugins ..................................... SUCCESS  
> [13.855s]
> [INFO] Maven ACR Plugin .................................. SUCCESS  
> [38.184s]
> [INFO] Maven Ant Plugin .................................. SUCCESS  
> [1:38.404s]
> [INFO] Maven AntRun Plugin ............................... SUCCESS  
> [1:17.538s]
> [INFO] Maven Eclipse Plugin .............................. SUCCESS  
> [11:13.026s]
> [INFO] Maven Assembly Plugin ............................. SUCCESS  
> [14:19.259s]
> [INFO] Maven Changelog Plugin ............................ SUCCESS  
> [1:09.450s]
> [INFO] Maven Changes Report Plugin ....................... SUCCESS  
> [1:37.586s]
> [INFO] Maven Checkstyle Plugin ........................... SUCCESS  
> [2:38.814s]
> [INFO] Maven Clean Plugin ................................ SUCCESS  
> [24.112s]
> [INFO] Maven Compiler Plugin ............................. SUCCESS  
> [2:19.951s]
> [INFO] Maven Dependency Plugin ........................... SUCCESS  
> [3:29.226s]
> [INFO] Maven Deploy Plugin ............................... SUCCESS  
> [1:51.827s]
> [INFO] Maven DOAP Plugin ................................. SUCCESS  
> [26.801s]
> [INFO] Maven Documentation Checker Plugin ................ SUCCESS  
> [7.091s]
> [INFO] Maven EAR Plugin .................................. SUCCESS  
> [5:24.371s]
> [INFO] Maven EJB Plugin .................................. SUCCESS  
> [36.917s]
> [INFO] Maven GPG Plugin .................................. SUCCESS  
> [2.321s]
> [INFO] Maven Help Plugin ................................. SUCCESS  
> [1:12.316s]
> [INFO] Maven IDEA Plugin ................................. SUCCESS  
> [9.881s]
> [INFO] Maven Install Plugin .............................. SUCCESS  
> [1:11.098s]
> [INFO] Maven JAR Plugin .................................. SUCCESS  
> [1:45.467s]
> [INFO] Maven Jarsigner Plugin ............................ SUCCESS  
> [42.262s]
> [INFO] Maven Javadoc Plugin .............................. FAILURE  
> [1:26.097s]
> [INFO] Maven Linkcheck Plugin ............................ SUCCESS  
> [3.727s]
> [INFO] Maven One Plugin .................................. SUCCESS  
> [2.335s]
> [INFO] Maven Patch Plugin ................................ SUCCESS  
> [5.945s]
> [INFO] Maven PDF Plugin .................................. SUCCESS  
> [49.261s]
> [INFO] Maven PMD Plugin .................................. SUCCESS  
> [1:59.888s]
> [INFO] Maven RAR Plugin .................................. SUCCESS  
> [18.140s]
> [INFO] Maven Reactor Plugin .............................. SUCCESS  
> [2.811s]
> [INFO] Maven Repository Plugin ........................... SUCCESS  
> [1:08.663s]
> [INFO] Maven Resources Plugin ............................ SUCCESS  
> [1:13.618s]
> [INFO] Maven Site Plugin 3 ............................... SUCCESS  
> [10:34.034s]
> [INFO] Maven Source Plugin ............................... SUCCESS  
> [1:13.641s]
> [INFO] Maven Stage Plugin ................................ SUCCESS  
> [2.983s]
> [INFO] Maven Toolchains Plugin ........................... SUCCESS  
> [2.045s]
> [INFO] Maven Verifier Plugin ............................. SUCCESS  
> [22.842s]
> [INFO] Maven WAR Plugin .................................. SUCCESS  
> [1:39.986s]
> [INFO] Maven SCM Publish Plugin .......................... SUCCESS  
> [1:29.258s]
> [INFO] Maven Invoker Plugin .............................. SUCCESS  
> [6:44.828s]
> [INFO] Maven Project Info Reports Plugin ................. SUCCESS  
> [3:01.277s]
> [INFO] Maven Remote Resources Plugin ..................... SUCCESS  
> [1:32.700s]
> [INFO] Maven Shade Plugin ................................ SUCCESS  
> [4:54.409s]
> [INFO] Maven Plugins Aggregator .......................... SUCCESS  
> [0.089s]
> [INFO]  
> ------------------------------------------------------------------------
> [INFO] BUILD FAILURE
> [INFO]  
> ------------------------------------------------------------------------
> [INFO] Total time: 1:33:20.756s
> [INFO] Finished at: Fri Mar 01 17:11:05 GMT 2013
> [INFO] Final Memory: 139M/326M
> [INFO]  
> ------------------------------------------------------------------------
> [WARNING] The requested profile "apache.snapshots" could not be  
> activated because it does not exist.
> [ERROR] Failed to execute goal  
> org.apache.maven.plugins:maven-surefire-plugin:2.12:test (default-test)  
> on project maven-javadoc-plugin: There are test failures.
> [ERROR]
> [ERROR] Please refer to  
> F:\hudson\hudson-slave\workspace\maven-plugins-ITs-m3-windows\maven-javadoc-plugin\target\surefire-reports
 
> for the individual test results.
> [ERROR] -> [Help 1]
> [ERROR]
> [ERROR] To see the full stack trace of the errors, re-run Maven with the  
> -e switch.
> [ERROR] Re-run Maven using the -X switch to enable full debug logging.
> [ERROR]
> [ERROR] For more information about the errors and possible solutions,  
> please read the following articles:
> [ERROR] [Help 1]  
> http://cwiki.apache.org/confluence/display/MAVEN/MojoFailureException
> [ERROR]
> [ERROR] After correcting the problems, you can resume the build with the  
> command
> [ERROR]   mvn <goals> -rf :maven-javadoc-plugin
> Build step 'Invoke top-level Maven targets' marked build as failure
> Recording test results

---------------------------------------------------------------------
To unsubscribe, e-mail: dev-unsubscribe@maven.apache.org
For additional commands, e-mail: dev-help@maven.apache.org


Mime
View raw message