maven-dev mailing list archives

Site index · List index
Message view « Date » · « Thread »
Top « Date » · « Thread »
From Anders Hammar <and...@hammar.net>
Subject Re: Build failed in Jenkins: core-it-maven-3-win #352
Date Tue, 19 Mar 2013 20:11:01 GMT
Looking into this...

/Anders


On Tue, Mar 19, 2013 at 8:36 PM, Stuart McCulloch <mcculls@gmail.com> wrote:

> Misconfigured job?  The maven assembly is unpacked to
> f:\ws\m3-its\apache-maven-3-SNAPSHOT but the maven.home used in the
> following test step is
> f:/ws/m3-its/core-it-maven-3-win/apache-maven-3-SNAPSHOT
>
> On 19 Mar 2013, at 19:11, Apache Jenkins Server wrote:
>
> > See <https://builds.apache.org/job/core-it-maven-3-win/352/>
> >
> > ------------------------------------------
> > [...truncated 7672 lines...]
> > [INFO]
> ------------------------------------------------------------------------
> > [INFO] Building Maven ITs 2.1-SNAPSHOT
> > [INFO]
> ------------------------------------------------------------------------
> > Downloading:
> http://repo.maven.apache.org/maven2/junit/junit/4.8.2/junit-4.8.2.pom
> > Downloaded:
> http://repo.maven.apache.org/maven2/junit/junit/4.8.2/junit-4.8.2.pom (2
> KB at 9.1 KB/sec)
> > Downloading:
> http://repo.maven.apache.org/maven2/org/apache/maven/shared/maven-verifier/1.4/maven-verifier-1.4.pom
> > Downloaded:
> http://repo.maven.apache.org/maven2/org/apache/maven/shared/maven-verifier/1.4/maven-verifier-1.4.pom(3
KB at 10.5 KB/sec)
> > Downloading:
> http://repo.maven.apache.org/maven2/org/apache/maven/shared/maven-shared-utils/0.2/maven-shared-utils-0.2.pom
> > Downloaded:
> http://repo.maven.apache.org/maven2/org/apache/maven/shared/maven-shared-utils/0.2/maven-shared-utils-0.2.pom(4
KB at 70.6 KB/sec)
> > Downloading:
> http://repo.maven.apache.org/maven2/org/mortbay/jetty/jetty/6.1.14/jetty-6.1.14.pom
> > Downloaded:
> http://repo.maven.apache.org/maven2/org/mortbay/jetty/jetty/6.1.14/jetty-6.1.14.pom(5
KB at 65.3 KB/sec)
> > Downloading:
> http://repo.maven.apache.org/maven2/org/mortbay/jetty/project/6.1.14/project-6.1.14.pom
> > Downloaded:
> http://repo.maven.apache.org/maven2/org/mortbay/jetty/project/6.1.14/project-6.1.14.pom(9
KB at 153.2 KB/sec)
> > Downloading:
> http://repo.maven.apache.org/maven2/org/mortbay/jetty/jetty-util/6.1.14/jetty-util-6.1.14.pom
> > Downloaded:
> http://repo.maven.apache.org/maven2/org/mortbay/jetty/jetty-util/6.1.14/jetty-util-6.1.14.pom(4
KB at 61.8 KB/sec)
> > Downloading:
> http://repo.maven.apache.org/maven2/org/mortbay/jetty/servlet-api-2.5/6.1.14/servlet-api-2.5-6.1.14.pom
> > Downloaded:
> http://repo.maven.apache.org/maven2/org/mortbay/jetty/servlet-api-2.5/6.1.14/servlet-api-2.5-6.1.14.pom(4
KB at 48.6 KB/sec)
> > Downloading:
> http://repo.maven.apache.org/maven2/org/apache/maven/wagon/wagon-webdav-jackrabbit/2.0/wagon-webdav-jackrabbit-2.0.pom
> > Downloaded:
> http://repo.maven.apache.org/maven2/org/apache/maven/wagon/wagon-webdav-jackrabbit/2.0/wagon-webdav-jackrabbit-2.0.pom(5
KB at 86.2 KB/sec)
> > Downloading:
> http://repo.maven.apache.org/maven2/org/apache/maven/wagon/wagon-http-shared/2.0/wagon-http-shared-2.0.pom
> > Downloaded:
> http://repo.maven.apache.org/maven2/org/apache/maven/wagon/wagon-http-shared/2.0/wagon-http-shared-2.0.pom(3
KB at 17.2 KB/sec)
> > Downloading:
> http://repo.maven.apache.org/maven2/org/apache/jackrabbit/jackrabbit-webdav/2.2.5/jackrabbit-webdav-2.2.5.pom
> > Downloaded:
> http://repo.maven.apache.org/maven2/org/apache/jackrabbit/jackrabbit-webdav/2.2.5/jackrabbit-webdav-2.2.5.pom(4
KB at 50.7 KB/sec)
> > Downloading:
> http://repo.maven.apache.org/maven2/org/apache/jackrabbit/jackrabbit-parent/2.2.5/jackrabbit-parent-2.2.5.pom
> > Downloaded:
> http://repo.maven.apache.org/maven2/org/apache/jackrabbit/jackrabbit-parent/2.2.5/jackrabbit-parent-2.2.5.pom(11
KB at 158.5 KB/sec)
> > Downloading:
> http://repo.maven.apache.org/maven2/org/apache/jackrabbit/parent/5/parent-5.pom
> > Downloaded:
> http://repo.maven.apache.org/maven2/org/apache/jackrabbit/parent/5/parent-5.pom(17 KB
at 210.9 KB/sec)
> > Downloading:
> http://repo.maven.apache.org/maven2/org/apache/jackrabbit/jackrabbit-jcr-commons/2.2.5/jackrabbit-jcr-commons-2.2.5.pom
> > Downloaded:
> http://repo.maven.apache.org/maven2/org/apache/jackrabbit/jackrabbit-jcr-commons/2.2.5/jackrabbit-jcr-commons-2.2.5.pom(3
KB at 42.1 KB/sec)
> > Downloading:
> http://repo.maven.apache.org/maven2/org/slf4j/slf4j-api/1.5.11/slf4j-api-1.5.11.pom
> > Downloaded:
> http://repo.maven.apache.org/maven2/org/slf4j/slf4j-api/1.5.11/slf4j-api-1.5.11.pom(3
KB at 51.3 KB/sec)
> > Downloading:
> http://repo.maven.apache.org/maven2/org/slf4j/slf4j-parent/1.5.11/slf4j-parent-1.5.11.pom
> > Downloaded:
> http://repo.maven.apache.org/maven2/org/slf4j/slf4j-parent/1.5.11/slf4j-parent-1.5.11.pom(9
KB at 134.4 KB/sec)
> > Downloading:
> http://repo.maven.apache.org/maven2/org/slf4j/jcl-over-slf4j/1.5.11/jcl-over-slf4j-1.5.11.pom
> > Downloaded:
> http://repo.maven.apache.org/maven2/org/slf4j/jcl-over-slf4j/1.5.11/jcl-over-slf4j-1.5.11.pom(3
KB at 33.4 KB/sec)
> > Downloading:
> http://repo.maven.apache.org/maven2/org/slf4j/slf4j-api/1.6.1/slf4j-api-1.6.1.pom
> > Downloaded:
> http://repo.maven.apache.org/maven2/org/slf4j/slf4j-api/1.6.1/slf4j-api-1.6.1.pom(3 KB
at 13.7 KB/sec)
> > Downloading:
> http://repo.maven.apache.org/maven2/org/slf4j/slf4j-parent/1.6.1/slf4j-parent-1.6.1.pom
> > Downloaded:
> http://repo.maven.apache.org/maven2/org/slf4j/slf4j-parent/1.6.1/slf4j-parent-1.6.1.pom(10
KB at 140.1 KB/sec)
> > Downloading:
> http://repo.maven.apache.org/maven2/org/slf4j/slf4j-simple/1.6.1/slf4j-simple-1.6.1.pom
> > Downloaded:
> http://repo.maven.apache.org/maven2/org/slf4j/slf4j-simple/1.6.1/slf4j-simple-1.6.1.pom(2
KB at 4.5 KB/sec)
> > Downloading:
> http://repo.maven.apache.org/maven2/junit/junit/4.8.2/junit-4.8.2.jar
> > Downloading:
> http://repo.maven.apache.org/maven2/org/apache/maven/shared/maven-verifier/1.4/maven-verifier-1.4.jar
> > Downloading:
> http://repo.maven.apache.org/maven2/org/mortbay/jetty/jetty-util/6.1.14/jetty-util-6.1.14.jar
> > Downloading:
> http://repo.maven.apache.org/maven2/org/codehaus/plexus/plexus-utils/1.5.8/plexus-utils-1.5.8.jar
> > Downloading:
> http://repo.maven.apache.org/maven2/org/mortbay/jetty/jetty/6.1.14/jetty-6.1.14.jar
> > Downloaded:
> http://repo.maven.apache.org/maven2/org/apache/maven/shared/maven-verifier/1.4/maven-verifier-1.4.jar(38
KB at 351.2 KB/sec)
> > Downloading:
> http://repo.maven.apache.org/maven2/org/mortbay/jetty/servlet-api-2.5/6.1.14/servlet-api-2.5-6.1.14.jar
> > Downloaded:
> http://repo.maven.apache.org/maven2/junit/junit/4.8.2/junit-4.8.2.jar(232 KB at 1170.6
KB/sec)
> > Downloading:
> http://repo.maven.apache.org/maven2/org/apache/maven/wagon/wagon-webdav-jackrabbit/2.0/wagon-webdav-jackrabbit-2.0.jar
> > Downloaded:
> http://repo.maven.apache.org/maven2/org/mortbay/jetty/jetty-util/6.1.14/jetty-util-6.1.14.jar(160
KB at 792.5 KB/sec)
> > Downloading:
> http://repo.maven.apache.org/maven2/org/apache/maven/wagon/wagon-http-shared/2.0/wagon-http-shared-2.0.jar
> > Downloaded:
> http://repo.maven.apache.org/maven2/org/apache/maven/wagon/wagon-webdav-jackrabbit/2.0/wagon-webdav-jackrabbit-2.0.jar(19
KB at 322.8 KB/sec)
> > Downloading:
> http://repo.maven.apache.org/maven2/org/apache/jackrabbit/jackrabbit-webdav/2.2.5/jackrabbit-webdav-2.2.5.jar
> > Downloaded:
> http://repo.maven.apache.org/maven2/org/apache/maven/wagon/wagon-http-shared/2.0/wagon-http-shared-2.0.jar(26
KB at 466.3 KB/sec)
> > Downloading:
> http://repo.maven.apache.org/maven2/org/apache/jackrabbit/jackrabbit-jcr-commons/2.2.5/jackrabbit-jcr-commons-2.2.5.jar
> > Downloaded:
> http://repo.maven.apache.org/maven2/org/mortbay/jetty/servlet-api-2.5/6.1.14/servlet-api-2.5-6.1.14.jar(130
KB at 722.2 KB/sec)
> > Downloading:
> http://repo.maven.apache.org/maven2/org/slf4j/jcl-over-slf4j/1.5.11/jcl-over-slf4j-1.5.11.jar
> > Downloaded:
> http://repo.maven.apache.org/maven2/org/codehaus/plexus/plexus-utils/1.5.8/plexus-utils-1.5.8.jar(262
KB at 883.7 KB/sec)
> > Downloading:
> http://repo.maven.apache.org/maven2/org/apache/maven/wagon/wagon-provider-api/2.0/wagon-provider-api-2.0.jar
> > Downloaded:
> http://repo.maven.apache.org/maven2/org/slf4j/jcl-over-slf4j/1.5.11/jcl-over-slf4j-1.5.11.jar(17
KB at 307.0 KB/sec)
> > Downloading:
> http://repo.maven.apache.org/maven2/org/slf4j/slf4j-api/1.6.1/slf4j-api-1.6.1.jar
> > Downloaded:
> http://repo.maven.apache.org/maven2/org/apache/maven/wagon/wagon-provider-api/2.0/wagon-provider-api-2.0.jar(52
KB at 880.6 KB/sec)
> > Downloading:
> http://repo.maven.apache.org/maven2/org/slf4j/slf4j-simple/1.6.1/slf4j-simple-1.6.1.jar
> > Downloaded:
> http://repo.maven.apache.org/maven2/org/apache/jackrabbit/jackrabbit-webdav/2.2.5/jackrabbit-webdav-2.2.5.jar(282
KB at 1842.0 KB/sec)
> > Downloaded:
> http://repo.maven.apache.org/maven2/org/slf4j/slf4j-api/1.6.1/slf4j-api-1.6.1.jar(25
KB at 327.6 KB/sec)
> > Downloaded:
> http://repo.maven.apache.org/maven2/org/mortbay/jetty/jetty/6.1.14/jetty-6.1.14.jar(505
KB at 1212.3 KB/sec)
> > Downloaded:
> http://repo.maven.apache.org/maven2/org/apache/jackrabbit/jackrabbit-jcr-commons/2.2.5/jackrabbit-jcr-commons-2.2.5.jar(280
KB at 1580.7 KB/sec)
> > Downloaded:
> http://repo.maven.apache.org/maven2/org/slf4j/slf4j-simple/1.6.1/slf4j-simple-1.6.1.jar(8
KB at 23.3 KB/sec)
> > [INFO]
> > [INFO] --- maven-clean-plugin:2.5:clean (default-clean) @ core-it-suite
> ---
> > [INFO] Deleting
> F:\ws\m3-its\core-integration-testing-trunk\core-it-suite\target
> > [INFO]
> > [INFO] --- maven-remote-resources-plugin:1.3:process (default) @
> core-it-suite ---
> > [INFO]
> > [INFO] --- maven-resources-plugin:2.5:resources (default-resources) @
> core-it-suite ---
> > [debug] execute contextualize
> > [INFO] Using 'UTF-8' encoding to copy filtered resources.
> > [INFO] skip non existing resourceDirectory
> F:\ws\m3-its\core-integration-testing-trunk\core-it-suite\src\main\resources
> > [INFO] Copying 3 resources
> > [INFO]
> > [INFO] --- maven-compiler-plugin:2.5.1:compile (default-compile) @
> core-it-suite ---
> > [INFO] No sources to compile
> > [INFO]
> > [INFO] --- maven-resources-plugin:2.5:testResources
> (default-testResources) @ core-it-suite ---
> > [debug] execute contextualize
> > [INFO] Using 'UTF-8' encoding to copy filtered resources.
> > [INFO] Copying 2737 resources
> > [INFO] Copying 2 resources
> > [INFO] Copying 3 resources
> > [INFO]
> > [INFO] --- maven-compiler-plugin:2.5.1:testCompile (default-testCompile)
> @ core-it-suite ---
> > [INFO] Compiling 572 source files to
> F:\ws\m3-its\core-integration-testing-trunk\core-it-suite\target\test-classes
> > [INFO]
> > [INFO] --- maven-surefire-plugin:2.13:test (default-test) @
> core-it-suite ---
> > [WARNING] useSystemClassloader setting has no effect when not forking
> > [INFO] Surefire report directory:
> F:\ws\m3-its\core-integration-testing-trunk\core-it-suite\target\surefire-reports
> > Downloading:
> http://repo.maven.apache.org/maven2/org/apache/maven/surefire/surefire-junit4/2.13/surefire-junit4-2.13.pom
> > Downloaded:
> http://repo.maven.apache.org/maven2/org/apache/maven/surefire/surefire-junit4/2.13/surefire-junit4-2.13.pom(3
KB at 26.7 KB/sec)
> > Downloading:
> http://repo.maven.apache.org/maven2/org/apache/maven/surefire/surefire-junit4/2.13/surefire-junit4-2.13.jar
> > Downloaded:
> http://repo.maven.apache.org/maven2/org/apache/maven/surefire/surefire-junit4/2.13/surefire-junit4-2.13.jar(78
KB at 468.2 KB/sec)
> >
> > -------------------------------------------------------
> > T E S T S
> > -------------------------------------------------------
> > Running org.apache.maven.it.IntegrationTestSuite
> > Tests run: 1, Failures: 0, Errors: 1, Skipped: 0, Time elapsed: 0.05 sec
> <<< FAILURE!
> > initializationError(org.apache.maven.it.IntegrationTestSuite)  Time
> elapsed: 0.003 sec  <<< ERROR!
> > org.apache.maven.it.VerificationException: Illegal maven output: String
> 'Maven version: ' not found in the following output:
> > The system cannot find the path specified.
> >       at org.apache.maven.it.Verifier.getMavenVersion(Verifier.java:1445)
> >       at
> org.apache.maven.it.IntegrationTestSuite.suite(IntegrationTestSuite.java:54)
> >
> >
> > Results :
> >
> > Tests in error:
> >  IntegrationTestSuite.suite:54 ยป Verification Illegal maven output:
> String 'Mav...
> >
> > Tests run: 1, Failures: 0, Errors: 1, Skipped: 0
> >
> > [INFO]
> ------------------------------------------------------------------------
> > [INFO] Reactor Summary:
> > [INFO]
> > [INFO] Maven Core ITs .................................... SUCCESS
> [26.319s]
> > [INFO] Maven IT Support .................................. SUCCESS
> [0.086s]
> > [INFO] Maven IT :: Plugins ............................... SUCCESS
> [0.083s]
> > [INFO] Maven IT Plugin :: Active Collection .............. SUCCESS
> [10.968s]
> > [INFO] Maven IT Plugin :: Ant-Based ...................... SUCCESS
> [6.044s]
> > [INFO] Maven IT Plugin :: Artifact ....................... SUCCESS
> [1.077s]
> > [INFO] Maven IT Plugin :: Class Loader :: Dependency A ... SUCCESS
> [0.146s]
> > [INFO] Maven IT Plugin :: Class Loader :: Dependency B ... SUCCESS
> [0.167s]
> > [INFO] Maven IT Plugin :: Class Loader :: Dependency C ... SUCCESS
> [0.088s]
> > [INFO] Maven IT Plugin :: Class Loader ................... SUCCESS
> [1.836s]
> > [INFO] Maven IT Plugin :: Class Loader :: Aggregator ..... SUCCESS
> [0.022s]
> > [INFO] Maven IT Plugin :: Configuration .................. SUCCESS
> [0.677s]
> > [INFO] Maven IT Plugin :: Context Passing ................ SUCCESS
> [0.282s]
> > [INFO] Maven ITs :: Core Plugin Stubs .................... SUCCESS
> [0.062s]
> > [INFO] Maven IT Clean Plugin Stub ........................ SUCCESS
> [0.230s]
> > [INFO] Maven IT Compiler Plugin Stub ..................... SUCCESS
> [0.531s]
> > [INFO] Maven IT Deploy Plugin Stub ....................... SUCCESS
> [0.336s]
> > [INFO] Maven IT EAR Plugin Stub .......................... SUCCESS
> [0.249s]
> > [INFO] Maven IT EJB Plugin Stub .......................... SUCCESS
> [0.220s]
> > [INFO] Maven IT Install Plugin Stub ...................... SUCCESS
> [0.313s]
> > [INFO] Maven IT JAR Plugin Stub .......................... SUCCESS
> [0.221s]
> > [INFO] Maven IT Javadoc Plugin Stub ...................... SUCCESS
> [0.306s]
> > [INFO] Maven IT Plugin Plugin Stub ....................... SUCCESS
> [0.311s]
> > [INFO] Maven IT RAR Plugin Stub .......................... SUCCESS
> [0.407s]
> > [INFO] Maven IT Resources Plugin Stub .................... SUCCESS
> [0.176s]
> > [INFO] Maven IT Site Plugin Stub ......................... SUCCESS
> [0.203s]
> > [INFO] Maven IT Source Plugin Stub ....................... SUCCESS
> [0.195s]
> > [INFO] Maven IT Surefire Plugin Stub ..................... SUCCESS
> [0.451s]
> > [INFO] Maven IT WAR Plugin Stub .......................... SUCCESS
> [0.255s]
> > [INFO] Maven IT Plugin :: Dependency Collection .......... SUCCESS
> [3.333s]
> > [INFO] Maven IT Plugin :: Dependency Resolution .......... SUCCESS
> [11.003s]
> > [INFO] Maven IT Plugin :: Expression ..................... SUCCESS
> [0.607s]
> > [INFO] Maven IT Plugin :: Error Mojos .................... SUCCESS
> [3.570s]
> > [INFO] Maven IT Component ................................ SUCCESS
> [0.119s]
> > [INFO] Maven IT Plugin :: Extension Consumer ............. SUCCESS
> [0.140s]
> > [INFO] Maven IT Plugin :: Extension Provider ............. SUCCESS
> [0.151s]
> > [INFO] Maven IT Plugin :: Fork ........................... SUCCESS
> [0.270s]
> > [INFO] Maven IT Plugin :: Invalid Descriptor ............. SUCCESS
> [0.177s]
> > [INFO] Maven IT Plugin :: Log File ....................... SUCCESS
> [0.315s]
> > [INFO] Maven IT Helper Library ........................... SUCCESS
> [1.479s]
> > [INFO] Maven IT Plugin :: Model Interpolation ............ SUCCESS
> [0.550s]
> > [INFO] Maven IT Plugin :: No Default Component ........... SUCCESS
> [0.588s]
> > [INFO] Maven IT Plugin :: No Project ..................... SUCCESS
> [0.156s]
> > [INFO] Maven IT Plugin :: Online ......................... SUCCESS
> [0.101s]
> > [INFO] Maven IT Plugin :: Optional Mojos ................. SUCCESS
> [0.251s]
> > [INFO] Maven IT Plugin :: Packaging ...................... SUCCESS
> [0.198s]
> > [INFO] Maven IT Plugin :: Parameter Implementation ....... SUCCESS
> [0.165s]
> > [INFO] Maven IT Plugin :: Plugin Dependency .............. SUCCESS
> [0.186s]
> > [INFO] Maven IT Plugin :: Project ........................ SUCCESS
> [0.408s]
> > [INFO] Maven IT Plugin :: Project Interpolation .......... SUCCESS
> [0.250s]
> > [INFO] Maven IT Plugin :: Setter ......................... SUCCESS
> [0.229s]
> > [INFO] Maven IT Plugin :: Singleton Component ............ SUCCESS
> [0.280s]
> > [INFO] Maven IT Plugin :: Site ........................... SUCCESS
> [0.463s]
> > [INFO] Maven IT Plugin :: Toolchain ...................... SUCCESS
> [5.515s]
> > [INFO] Maven IT Plugin :: Touch .......................... SUCCESS
> [0.566s]
> > [INFO] Maven IT Plugin :: Uses Properties Plugin ......... SUCCESS
> [0.134s]
> > [INFO] Maven IT Plugin :: Uses Wagon Plugin .............. SUCCESS
> [1.178s]
> > [INFO] Maven IT Plugin :: This plugin should contain the mojos needed by
> all tests.  SUCCESS [0.167s]
> > [INFO] Maven IT Plugin :: Plexus Utils 1.1 ............... SUCCESS
> [0.469s]
> > [INFO] Maven IT Plugin :: Plexus Utils New ............... SUCCESS
> [0.179s]
> > [INFO] Maven IT Plugin :: Plexus Component API ........... SUCCESS
> [1.287s]
> > [INFO] Maven IT Plugin :: Log4J Client ................... SUCCESS
> [0.710s]
> > [INFO] Maven IT Plugin :: Extension 1 .................... SUCCESS
> [0.160s]
> > [INFO] Maven IT Plugin :: Extension 2 .................... SUCCESS
> [0.235s]
> > [INFO] Maven IT Plugin :: Plexus Lifecycle ............... SUCCESS
> [2.352s]
> > [INFO] Maven IT Plugin :: Settings ....................... SUCCESS
> [0.283s]
> > [INFO] Maven IT Toolchain ................................ SUCCESS
> [0.376s]
> > [INFO] Maven IT Wagon .................................... SUCCESS
> [0.225s]
> > [INFO] Maven IT Support Artifacts ........................ SUCCESS
> [2.095s]
> > [INFO] Maven IT Extension ................................ SUCCESS
> [0.164s]
> > [INFO] Maven ITs ......................................... FAILURE
> [32.963s]
> > [INFO]
> ------------------------------------------------------------------------
> > [INFO] BUILD FAILURE
> > [INFO]
> ------------------------------------------------------------------------
> > [INFO] Total time: 2:09.991s
> > [INFO] Finished at: Tue Mar 19 19:11:50 GMT 2013
> > [INFO] Final Memory: 41M/749M
> > [INFO]
> ------------------------------------------------------------------------
> > [ERROR] Failed to execute goal
> org.apache.maven.plugins:maven-surefire-plugin:2.13:test (default-test) on
> project core-it-suite: There are test failures.
> > [ERROR]
> > [ERROR] Please refer to
> F:\ws\m3-its\core-integration-testing-trunk\core-it-suite\target\surefire-reports
> for the individual test results.
> > [ERROR] -> [Help 1]
> > org.apache.maven.lifecycle.LifecycleExecutionException: Failed to
> execute goal org.apache.maven.plugins:maven-surefire-plugin:2.13:test
> (default-test) on project core-it-suite: There are test failures.
> >
> > Please refer to
> F:\ws\m3-its\core-integration-testing-trunk\core-it-suite\target\surefire-reports
> for the individual test results.
> >       at
> org.apache.maven.lifecycle.internal.MojoExecutor.execute(MojoExecutor.java:213)
> >       at
> org.apache.maven.lifecycle.internal.MojoExecutor.execute(MojoExecutor.java:153)
> >       at
> org.apache.maven.lifecycle.internal.MojoExecutor.execute(MojoExecutor.java:145)
> >       at
> org.apache.maven.lifecycle.internal.LifecycleModuleBuilder.buildProject(LifecycleModuleBuilder.java:84)
> >       at
> org.apache.maven.lifecycle.internal.LifecycleModuleBuilder.buildProject(LifecycleModuleBuilder.java:59)
> >       at
> org.apache.maven.lifecycle.internal.LifecycleStarter.singleThreadedBuild(LifecycleStarter.java:183)
> >       at
> org.apache.maven.lifecycle.internal.LifecycleStarter.execute(LifecycleStarter.java:161)
> >       at org.apache.maven.DefaultMaven.doExecute(DefaultMaven.java:320)
> >       at org.apache.maven.DefaultMaven.execute(DefaultMaven.java:156)
> >       at org.apache.maven.cli.MavenCli.execute(MavenCli.java:537)
> >       at org.apache.maven.cli.MavenCli.doMain(MavenCli.java:196)
> >       at org.apache.maven.cli.MavenCli.main(MavenCli.java:141)
> >       at sun.reflect.NativeMethodAccessorImpl.invoke0(Native Method)
> >       at
> sun.reflect.NativeMethodAccessorImpl.invoke(NativeMethodAccessorImpl.java:39)
> >       at
> sun.reflect.DelegatingMethodAccessorImpl.invoke(DelegatingMethodAccessorImpl.java:25)
> >       at java.lang.reflect.Method.invoke(Method.java:597)
> >       at
> org.codehaus.plexus.classworlds.launcher.Launcher.launchEnhanced(Launcher.java:290)
> >       at
> org.codehaus.plexus.classworlds.launcher.Launcher.launch(Launcher.java:230)
> >       at
> org.codehaus.plexus.classworlds.launcher.Launcher.mainWithExitCode(Launcher.java:409)
> >       at
> org.codehaus.plexus.classworlds.launcher.Launcher.main(Launcher.java:352)
> > Caused by: org.apache.maven.plugin.MojoFailureException: There are test
> failures.
> >
> > Please refer to
> F:\ws\m3-its\core-integration-testing-trunk\core-it-suite\target\surefire-reports
> for the individual test results.
> >       at
> org.apache.maven.plugin.surefire.SurefireHelper.reportExecution(SurefireHelper.java:82)
> >       at
> org.apache.maven.plugin.surefire.SurefirePlugin.handleSummary(SurefirePlugin.java:151)
> >       at
> org.apache.maven.plugin.surefire.AbstractSurefireMojo.executeAfterPreconditionsChecked(AbstractSurefireMojo.java:721)
> >       at
> org.apache.maven.plugin.surefire.AbstractSurefireMojo.execute(AbstractSurefireMojo.java:620)
> >       at
> org.apache.maven.plugin.DefaultBuildPluginManager.executeMojo(DefaultBuildPluginManager.java:101)
> >       at
> org.apache.maven.lifecycle.internal.MojoExecutor.execute(MojoExecutor.java:209)
> >       ... 19 more
> > [ERROR]
> > [ERROR] Re-run Maven using the -X switch to enable full debug logging.
> > [ERROR]
> > [ERROR] For more information about the errors and possible solutions,
> please read the following articles:
> > [ERROR] [Help 1]
> http://cwiki.apache.org/confluence/display/MAVEN/MojoFailureException
> > [ERROR]
> > [ERROR] After correcting the problems, you can resume the build with the
> command
> > [ERROR]   mvn <goals> -rf :core-it-suite
> > Build step 'Invoke top-level Maven targets' marked build as failure
> > Recording test results
>
>

Mime
  • Unnamed multipart/alternative (inline, None, 0 bytes)
View raw message