maven-dev mailing list archives

Site index · List index
Message view « Date » · « Thread »
Top « Date » · « Thread »
From Amiragl <>
Subject bug while using maven-surefire-plugin in test report generation
Date Wed, 12 Oct 2011 09:29:28 GMT
Hi All,

I wanna generate my reports so i used maven-surefire-plugin so this is my
pom.xml code:


But i'm getting this error when i run maven test:

Tests run: 6, Failures: 2, Errors: 2, Skipped: 0

[INFO] Total time: 4.881s
[INFO] Finished at: Wed Oct 12 10:43:42 CEST 2011
[INFO] Final Memory: 19M/129M
[ERROR] Failed to execute goal
org.apache.maven.plugins:maven-surefire-plugin:2.10:test (default-test) on
project jebouquine: There are test failures.
[ERROR] Please refer to C:\Users\Amira\workspace1\jebouquine\target\reports
for the individual test results.
[ERROR] -> [Help 1]
[ERROR] To see the full stack trace of the errors, re-run Maven with the -e
[ERROR] Re-run Maven using the -X switch to enable full debug logging.
[ERROR] For more information about the errors and possible solutions, please
read the following articles:
[ERROR] [Help 1]

Thank you in advance

View this message in context:
Sent from the Maven Developers mailing list archive at

To unsubscribe, e-mail:
For additional commands, e-mail:

View raw message