maven-dev mailing list archives

Site index · List index
Message view « Date » · « Thread »
Top « Date » · « Thread »
From Stephen Connolly <stephen.alan.conno...@gmail.com>
Subject Re: Build failed in Hudson: maven-release » java-5x,ubuntu #146
Date Fri, 26 Nov 2010 22:56:57 GMT
And the build works on my other machine just fine...

I suspect it's just a gremlin... I'll kick off the build again with a noddy
change.

On 26 November 2010 20:25, Stephen Connolly <stephen.alan.connolly@gmail.com
> wrote:

> I'm looking into this... Was working on my machine before I committed
>
> - Stephen
>
> ---
> Sent from my Android phone, so random spelling mistakes are a direct result
> of using swype to type on the screen
>
> On 26 Nov 2010 18:13, "GRiD .ORG" <builds@lists.sonatype.com> wrote:
>
> See <
> https://grid.sonatype.org/ci/job/maven-release/./jdk=java-5x,label=ubuntu/146/changes
> >
>
> Changes:
>
> [stephenc] [MRELEASE-621] Implementing a new release phase after the
> preparation has been completed and immediately before committing the next
> development versions back into SCM.
>
> o This new feature can be used to hook in plugins that lock down version
> ranges for the release and open them back up again after the release has
> been prepared, as well as other niceties that people doing Continuous
> Deployment might well want.
>
> [stephenc] Make it easier to run integration tests from the command line
> and use the latest version of the maven invoker plugin
>
> ------------------------------------------
> [...truncated 55 lines...]
> [INFO] [modello:xpp3-reader {execution: default}]
> [INFO] outputDirectory:
> /opt/grid/slave/workspace/maven-release/jdk/java-5x/label/ubuntu/trunk/maven-release-manager/target/generated-sources/modello
> [INFO] Working on model: src/main/mdo/release-descriptor.mdo
> [INFO] Generating current version: 2.2.0
> [INFO] [modello:java {execution: default}]
> [INFO] outputDirectory:
> /opt/grid/slave/workspace/maven-release/jdk/java-5x/label/ubuntu/trunk/maven-release-manager/target/generated-sources/modello
> [INFO] Working on model: src/main/mdo/release-descriptor.mdo
> [INFO] Generating current version: 2.2.0
> [INFO] [modello:xpp3-writer {execution: default}]
> [INFO] outputDirectory:
> /opt/grid/slave/workspace/maven-release/jdk/java-5x/label/ubuntu/trunk/maven-release-manager/target/generated-sources/modello
> [INFO] Working on model: src/main/mdo/release-descriptor.mdo
> [INFO] Generating current version: 2.2.0
> [INFO] [remote-resources:process {execution: default}]
> [INFO] [plexus:descriptor {execution: create-component-descriptor}]
> [INFO] Discovered 25 component descriptors(s)
> [INFO] [resources:resources {execution: default-resources}]
> [INFO] Using 'UTF-8' encoding to copy filtered resources.
> [INFO] skip non existing resourceDirectory
> /opt/grid/slave/workspace/maven-release/jdk/java-5x/label/ubuntu/trunk/maven-release-manager/src/main/resources
> [INFO] Copying 3 resources
> [INFO] [plexus:merge-descriptors {execution: merge}]
> [INFO] [compiler:compile {execution: default-compile}]
> [INFO] Compiling 68 source files to
> /opt/grid/slave/workspace/maven-release/jdk/java-5x/label/ubuntu/trunk/maven-release-manager/target/classes
> [INFO] [resources:testResources {execution: default-testResources}]
> [INFO] Using 'UTF-8' encoding to copy filtered resources.
> [INFO] Copying 610 resources
> [INFO] Copying 3 resources
> [INFO] [compiler:testCompile {execution: default-testCompile}]
> [INFO] Compiling 40 source files to
> /opt/grid/slave/workspace/maven-release/jdk/java-5x/label/ubuntu/trunk/maven-release-manager/target/test-classes
> [INFO] [surefire:test {execution: default-test}]
> [INFO] Surefire report directory:
> /opt/grid/slave/workspace/maven-release/jdk/java-5x/label/ubuntu/trunk/maven-release-manager/target/surefire-reports
>
> -------------------------------------------------------
>  T E S T S
> -------------------------------------------------------
> Running org.apache.maven.shared.release.phase.RestoreBackupPomsPhaseTest
> Tests run: 2, Failures: 0, Errors: 0, Skipped: 0, Time elapsed: 0.933 sec
> Running org.apache.maven.shared.release.DefaultReleaseManagerTest
> [ERROR] Cannot perform release - the preparation step was stopped mid-way.
> Please re-run release:prepare to continue, or perform the release from an
> SCM tag.
> [ERROR] No SCM URL was provided to perform the release from
> [ERROR] No such provider: '...'.
> [ERROR] ...
> [ERROR] ...
> [ERROR]
> Tests run: 27, Failures: 0, Errors: 0, Skipped: 0, Time elapsed: 2.649 sec
> Running org.apache.maven.shared.release.phase.CheckoutProjectFromScmTest
> Tests run: 3, Failures: 0, Errors: 0, Skipped: 0, Time elapsed: 0.959 sec
> Running org.apache.maven.shared.release.phase.InputVariablesPhaseTest
> Tests run: 7, Failures: 0, Errors: 0, Skipped: 0, Time elapsed: 0.344 sec
> Running
> org.apache.maven.shared.release.phase.RewritePomsForDevelopmentPhaseTest
> Tests run: 51, Failures: 0, Errors: 0, Skipped: 0, Time elapsed: 12.41 sec
> Running org.apache.maven.shared.release.phase.RunPrepareGoalsPhaseTest
> Tests run: 5, Failures: 0, Errors: 0, Skipped: 0, Time elapsed: 0.319 sec
> Running org.apache.maven.shared.release.phase.RemoveReleasePomsPhaseTest
> Tests run: 3, Failures: 0, Errors: 0, Skipped: 0, Time elapsed: 1.411 sec
> Running org.apache.maven.shared.release.phase.RunPerformGoalsPhaseTest
> Tests run: 1, Failures: 0, Errors: 0, Skipped: 0, Time elapsed: 0.134 sec
> Running
> org.apache.maven.shared.release.config.PropertiesReleaseDescriptorStoreTest
> Tests run: 14, Failures: 0, Errors: 0, Skipped: 0, Time elapsed: 0.588 sec
> Running org.apache.maven.shared.release.exec.CommandLineFactoryTest
> Tests run: 1, Failures: 0, Errors: 0, Skipped: 0, Time elapsed: 0.183 sec
> Running org.apache.maven.shared.release.config.ReleaseUtilsTest
> Tests run: 6, Failures: 0, Errors: 0, Skipped: 0, Time elapsed: 0.007 sec
> Running org.apache.maven.shared.release.phase.ScmCommitPreparationPhaseTest
> Tests run: 15, Failures: 0, Errors: 0, Skipped: 0, Time elapsed: 1.854 sec
> Running
> org.apache.maven.shared.release.phase.RewritePomsForReleasePhaseTest
> Tests run: 60, Failures: 0, Errors: 0, Skipped: 0, Time elapsed: 13.485 sec
> Running
> org.apache.maven.shared.release.phase.CheckDependencySnapshotsPhaseTest
> Tests run: 42, Failures: 0, Errors: 0, Skipped: 0, Time elapsed: 10.713 sec
> Running
> org.apache.maven.shared.release.scm.DefaultScmRepositoryConfiguratorTest
> Tests run: 8, Failures: 0, Errors: 0, Skipped: 0, Time elapsed: 0.429 sec
> Running org.apache.maven.shared.release.phase.RunCompleteGoalsPhaseTest
> Tests run: 5, Failures: 0, Errors: 0, Skipped: 0, Time elapsed: 0.348 sec
> Running org.apache.maven.shared.release.phase.ScmTagPhaseTest
> Tests run: 11, Failures: 0, Errors: 0, Skipped: 0, Time elapsed: 3.329 sec
> Running org.apache.maven.shared.release.phase.CheckPomPhaseTest
> Tests run: 9, Failures: 0, Errors: 0, Skipped: 0, Time elapsed: 0.396 sec
> Running org.apache.maven.shared.release.phase.MapVersionsPhaseTest
> Tests run: 10, Failures: 0, Errors: 0, Skipped: 0, Time elapsed: 0.29 sec
> Running org.apache.maven.shared.release.phase.GenerateReleasePomsPhaseTest
> Tests run: 37, Failures: 0, Errors: 0, Skipped: 0, Time elapsed: 13.388 sec
> Running org.apache.maven.shared.release.exec.TeeConsumerTest
> Tests run: 1, Failures: 0, Errors: 0, Skipped: 0, Time elapsed: 0.026 sec
> Running
> org.apache.maven.shared.release.phase.ScmCheckModificationsPhaseTest
> Tests run: 9, Failures: 0, Errors: 0, Skipped: 0, Time elapsed: 1.216 sec
> Running org.apache.maven.shared.release.util.ReleaseUtilTest
> Tests run: 22, Failures: 0, Errors: 0, Skipped: 0, Time elapsed: 0.694 sec
> Running org.apache.maven.shared.release.versions.DefaultVersionInfoTest
> Tests run: 21, Failures: 0, Errors: 0, Skipped: 0, Time elapsed: 1.335 sec
> Running org.apache.maven.shared.release.phase.CreateBackupPomsPhaseTest
> Tests run: 2, Failures: 0, Errors: 0, Skipped: 0, Time elapsed: 0.178 sec
> Running org.apache.maven.shared.release.exec.TeeOutputStreamTest
> Tests run: 1, Failures: 0, Errors: 0, Skipped: 0, Time elapsed: 0.009 sec
> Running org.apache.maven.shared.release.phase.ScmCommitDevelopmentPhaseTest
> Tests run: 4, Failures: 0, Errors: 0, Skipped: 0, Time elapsed: 0.934 sec
> Running org.apache.maven.shared.release.phase.EndReleasePhaseTest
> Tests run: 2, Failures: 0, Errors: 0, Skipped: 0, Time elapsed: 0.138 sec
>
> Results :
>
> Tests run: 379, Failures: 0, Errors: 0, Skipped: 0
>
> [INFO] [jar:jar {execution: default-jar}]
> [INFO] Building jar:
> /opt/grid/slave/workspace/maven-release/jdk/java-5x/label/ubuntu/trunk/maven-release-manager/target/maven-release-manager-2.2-SNAPSHOT.jar
> [INFO] [install:install {execution: default-install}]
> [INFO] Installing
> /opt/grid/slave/workspace/maven-release/jdk/java-5x/label/ubuntu/trunk/maven-release-manager/target/maven-release-manager-2.2-SNAPSHOT.jar
> to <
> https://grid.sonatype.org/ci/job/maven-release/./jdk=java-5x,label=ubuntu/ws/.repository/org/apache/maven/release/maven-release-manager/2.2-SNAPSHOT/maven-release-manager-2.2-SNAPSHOT.jar
> >
> [INFO]
> ------------------------------------------------------------------------
> [INFO] Building Maven Release Plugin
> [INFO]    task-segment: [clean, install]
> [INFO]
> ------------------------------------------------------------------------
> Downloading:
> http://repository.sonatype.org:8081/content/groups/sonatype-public-grid/org/apache/maven/plugins/maven-invoker-plugin/1.5/maven-invoker-plugin-1.5.pom
> 8K<http://repository.sonatype.org:8081/content/groups/sonatype-public-grid/org/apache/maven/plugins/maven-invoker-plugin/1.5/maven-invoker-plugin-1.5.pom8K>downloaded
 (maven-invoker-plugin-1.5.pom)
> Downloading:
> http://repository.sonatype.org:8081/content/groups/sonatype-public-grid/org/apache/maven/plugins/maven-invoker-plugin/1.5/maven-invoker-plugin-1.5.jar
> 90K<http://repository.sonatype.org:8081/content/groups/sonatype-public-grid/org/apache/maven/plugins/maven-invoker-plugin/1.5/maven-invoker-plugin-1.5.jar90K>downloaded
 (maven-invoker-plugin-1.5.jar)
> [INFO] [clean:clean {execution: default-clean}]
> [INFO] Deleting file set:
> /opt/grid/slave/workspace/maven-release/jdk/java-5x/label/ubuntu/trunk/maven-release-plugin/target
> (included: [**], excluded: [])
> [INFO] [enforcer:enforce {execution: ensure-no-container-api}]
> [INFO] [plugin:helpmojo {execution: generated-helpmojo}]
> [INFO] Using 'UTF-8' encoding to read mojo metadata.
> [INFO] Applying mojo extractor for language: java
> [INFO] Mojo extractor for language: java found 8 mojo descriptors.
> [INFO] Applying mojo extractor for language: bsh
> [INFO] Mojo extractor for language: bsh found 0 mojo descriptors.
> [INFO] [plugin:descriptor {execution: default-descriptor}]
> [INFO] Using 'UTF-8' encoding to read mojo metadata.
> [INFO] Applying mojo extractor for language: java
> [INFO] Mojo extractor for language: java found 9 mojo descriptors.
> [INFO] Applying mojo extractor for language: bsh
> [INFO] Mojo extractor for language: bsh found 0 mojo descriptors.
> [INFO] [remote-resources:process {execution: default}]
> [INFO] [resources:resources {execution: default-resources}]
> [INFO] Using 'UTF-8' encoding to copy filtered resources.
> [INFO] skip non existing resourceDirectory
> /opt/grid/slave/workspace/maven-release/jdk/java-5x/label/ubuntu/trunk/maven-release-plugin/src/main/resources
> [INFO] Copying 3 resources
> [INFO] [compiler:compile {execution: default-compile}]
> [INFO] Compiling 10 source files to
> /opt/grid/slave/workspace/maven-release/jdk/java-5x/label/ubuntu/trunk/maven-release-plugin/target/classes
> [INFO] [resources:testResources {execution: default-testResources}]
> [INFO] Using 'UTF-8' encoding to copy filtered resources.
> [INFO] Copying 9 resources
> [INFO] Copying 3 resources
> [INFO] [compiler:testCompile {execution: default-testCompile}]
> [INFO] Compiling 6 source files to
> /opt/grid/slave/workspace/maven-release/jdk/java-5x/label/ubuntu/trunk/maven-release-plugin/target/test-classes
> [INFO] [surefire:test {execution: default-test}]
> [INFO] Surefire report directory:
> /opt/grid/slave/workspace/maven-release/jdk/java-5x/label/ubuntu/trunk/maven-release-plugin/target/surefire-reports
>
> -------------------------------------------------------
>  T E S T S
> -------------------------------------------------------
> Running org.apache.maven.plugins.release.StageReleaseMojoTest
> Tests run: 1, Failures: 0, Errors: 0, Skipped: 0, Time elapsed: 1.741 sec
> Running org.apache.maven.plugins.release.PrepareReleaseMojoTest
> Tests run: 3, Failures: 0, Errors: 0, Skipped: 0, Time elapsed: 0.802 sec
> Running org.apache.maven.plugins.release.PerformReleaseMojoTest
> Tests run: 9, Failures: 0, Errors: 0, Skipped: 0, Time elapsed: 1.743 sec
> Running org.apache.maven.plugins.release.CleanReleaseMojoTest
> Tests run: 1, Failures: 0, Errors: 0, Skipped: 0, Time elapsed: 0.113 sec
>
> Results :
>
> Tests run: 14, Failures: 0, Errors: 0, Skipped: 0
>
> [INFO] [jar:jar {execution: default-jar}]
> [INFO] Building jar:
> /opt/grid/slave/workspace/maven-release/jdk/java-5x/label/ubuntu/trunk/maven-release-plugin/target/maven-release-plugin-2.2-SNAPSHOT.jar
> [INFO] [plugin:addPluginArtifactMetadata {execution:
> default-addPluginArtifactMetadata}]
> [INFO] [invoker:install {execution: integration-test-prepare}]
> [INFO] Installing
> /opt/grid/slave/workspace/maven-release/jdk/java-5x/label/ubuntu/trunk/maven-release-manager/pom.xml
> to
> /opt/grid/slave/workspace/maven-release/jdk/java-5x/label/ubuntu/trunk/maven-release-plugin/target/local-repo/org/apache/maven/release/maven-release-manager/2.2-SNAPSHOT/maven-release-manager-2.2-SNAPSHOT.pom
> [INFO] Installing
> /opt/grid/slave/workspace/maven-release/jdk/java-5x/label/ubuntu/trunk/maven-release-manager/target/maven-release-manager-2.2-SNAPSHOT.jar
> to
> /opt/grid/slave/workspace/maven-release/jdk/java-5x/label/ubuntu/trunk/maven-release-plugin/target/local-repo/org/apache/maven/release/maven-release-manager/2.2-SNAPSHOT/maven-release-manager-2.2-SNAPSHOT.jar
> [INFO] Installing
> /opt/grid/slave/workspace/maven-release/jdk/java-5x/label/ubuntu/trunk/pom.xml
> to
> /opt/grid/slave/workspace/maven-release/jdk/java-5x/label/ubuntu/trunk/maven-release-plugin/target/local-repo/org/apache/maven/release/maven-release/2.2-SNAPSHOT/maven-release-2.2-SNAPSHOT.pom
> [INFO] Installing
> /opt/grid/slave/workspace/maven-release/jdk/java-5x/label/ubuntu/trunk/maven-release-plugin/pom.xml
> to
> /opt/grid/slave/workspace/maven-release/jdk/java-5x/label/ubuntu/trunk/maven-release-plugin/target/local-repo/org/apache/maven/plugins/maven-release-plugin/2.2-SNAPSHOT/maven-release-plugin-2.2-SNAPSHOT.pom
> [INFO] Installing
> /opt/grid/slave/workspace/maven-release/jdk/java-5x/label/ubuntu/trunk/maven-release-plugin/target/maven-release-plugin-2.2-SNAPSHOT.jar
> to
> /opt/grid/slave/workspace/maven-release/jdk/java-5x/label/ubuntu/trunk/maven-release-plugin/target/local-repo/org/apache/maven/plugins/maven-release-plugin/2.2-SNAPSHOT/maven-release-plugin-2.2-SNAPSHOT.jar
> [INFO] [invoker:install {execution: integration-test-branch}]
> [INFO] Installing
> /opt/grid/slave/workspace/maven-release/jdk/java-5x/label/ubuntu/trunk/maven-release-manager/pom.xml
> to
> /opt/grid/slave/workspace/maven-release/jdk/java-5x/label/ubuntu/trunk/maven-release-plugin/target/local-repo/org/apache/maven/release/maven-release-manager/2.2-SNAPSHOT/maven-release-manager-2.2-SNAPSHOT.pom
> [INFO] Installing
> /opt/grid/slave/workspace/maven-release/jdk/java-5x/label/ubuntu/trunk/maven-release-manager/target/maven-release-manager-2.2-SNAPSHOT.jar
> to
> /opt/grid/slave/workspace/maven-release/jdk/java-5x/label/ubuntu/trunk/maven-release-plugin/target/local-repo/org/apache/maven/release/maven-release-manager/2.2-SNAPSHOT/maven-release-manager-2.2-SNAPSHOT.jar
> [INFO] Installing
> /opt/grid/slave/workspace/maven-release/jdk/java-5x/label/ubuntu/trunk/pom.xml
> to
> /opt/grid/slave/workspace/maven-release/jdk/java-5x/label/ubuntu/trunk/maven-release-plugin/target/local-repo/org/apache/maven/release/maven-release/2.2-SNAPSHOT/maven-release-2.2-SNAPSHOT.pom
> [INFO] Installing
> /opt/grid/slave/workspace/maven-release/jdk/java-5x/label/ubuntu/trunk/maven-release-plugin/pom.xml
> to
> /opt/grid/slave/workspace/maven-release/jdk/java-5x/label/ubuntu/trunk/maven-release-plugin/target/local-repo/org/apache/maven/plugins/maven-release-plugin/2.2-SNAPSHOT/maven-release-plugin-2.2-SNAPSHOT.pom
> [INFO] Installing
> /opt/grid/slave/workspace/maven-release/jdk/java-5x/label/ubuntu/trunk/maven-release-plugin/target/maven-release-plugin-2.2-SNAPSHOT.jar
> to
> /opt/grid/slave/workspace/maven-release/jdk/java-5x/label/ubuntu/trunk/maven-release-plugin/target/local-repo/org/apache/maven/plugins/maven-release-plugin/2.2-SNAPSHOT/maven-release-plugin-2.2-SNAPSHOT.jar
> [INFO] [invoker:run {execution: integration-test-prepare}]
> [INFO] Building: setup/maven-scm-provider-stub/pom.xml
> [INFO] ..FAILED (59.3 s)
> [INFO]   The build exited with code 137. See
> /opt/grid/slave/workspace/maven-release/jdk/java-5x/label/ubuntu/trunk/maven-release-plugin/target/it/setup/maven-scm-provider-stub/build.log
> for details.
> [INFO] Building: setup/maven-scm-provider-dummy/pom.xml
> [INFO] ..SUCCESS (15.5 s)
> [INFO] Building: projects/prepare/regular-multi-module/pom.xml
> [INFO] ..FAILED (39.6 s)
> [INFO]   The build exited with code 137. See
> /opt/grid/slave/workspace/maven-release/jdk/java-5x/label/ubuntu/trunk/maven-release-plugin/target/it/projects/prepare/regular-multi-module/build.log
> for details.
> [INFO] Building: projects/prepare/forked-basic/pom.xml
> [INFO] ..SUCCESS (19.8 s)
> [INFO] Building: projects/prepare/invoker-basic/pom.xml
> [INFO] ..SUCCESS (11.2 s)
> [INFO] Building: projects/prepare/flat-multi-module/parent-project/pom.xml
> [INFO] ..SUCCESS (18.6 s)
> [INFO] Building: projects/prepare/completion-goals/pom.xml
> [INFO] ..SUCCESS (19.5 s)
> [INFO] -------------------------------------------------
> [INFO] Build Summary:
> [INFO]   Passed: 5, Failed: 2, Errors: 0, Skipped: 0
> [INFO] -------------------------------------------------
> [ERROR] The following builds failed:
> [ERROR] *  setup/maven-scm-provider-stub/pom.xml
> [ERROR] *  projects/prepare/regular-multi-module/pom.xml
> [INFO] -------------------------------------------------
> [INFO]
> [INFO]
> [INFO]
> ------------------------------------------------------------------------
> [INFO] Reactor Summary:
> [INFO]
> ------------------------------------------------------------------------
> [INFO] Maven Release ......................................... SUCCESS
> [14.220s]
> [INFO] Maven Release Manager ................................. SUCCESS
> [1:55.111s]
> [INFO] Maven Release Plugin .................................. FAILED
> [3:32.332s]
> [INFO]
> ------------------------------------------------------------------------
> [INFO] Error for project: Maven Release Plugin (during install)
> [INFO]
> ------------------------------------------------------------------------
> [INFO] : org.apache.maven.plugin.invoker.InvokerSession@4b3ca972
> 2 builds failed.
> [INFO]
> ------------------------------------------------------------------------
> [INFO] Trace
> org.apache.maven.BuildFailureException: 2 builds failed.
>        at
> org.apache.maven.lifecycle.DefaultLifecycleExecutor.executeGoals(DefaultLifecycleExecutor.java:715)
>        at
> org.apache.maven.lifecycle.DefaultLifecycleExecutor.executeGoalWithLifecycle(DefaultLifecycleExecutor.java:556)
>        at
> org.apache.maven.lifecycle.DefaultLifecycleExecutor.executeGoal(DefaultLifecycleExecutor.java:535)
>        at
> org.apache.maven.lifecycle.DefaultLifecycleExecutor.executeGoalAndHandleFailures(DefaultLifecycleExecutor.java:387)
>        at
> org.apache.maven.lifecycle.DefaultLifecycleExecutor.executeTaskSegments(DefaultLifecycleExecutor.java:348)
>        at
> org.apache.maven.lifecycle.DefaultLifecycleExecutor.execute(DefaultLifecycleExecutor.java:180)
>        at org.apache.maven.DefaultMaven.doExecute(DefaultMaven.java:328)
>        at org.apache.maven.DefaultMaven.execute(DefaultMaven.java:138)
>        at org.apache.maven.cli.MavenCli.main(MavenCli.java:362)
>        at
> org.apache.maven.cli.compat.CompatibleMain.main(CompatibleMain.java:60)
>        at sun.reflect.NativeMethodAccessorImpl.invoke0(Native Method)
>        at
> sun.reflect.NativeMethodAccessorImpl.invoke(NativeMethodAccessorImpl.java:39)
>        at
> sun.reflect.DelegatingMethodAccessorImpl.invoke(DelegatingMethodAccessorImpl.java:25)
>        at java.lang.reflect.Method.invoke(Method.java:592)
>        at
> org.codehaus.classworlds.Launcher.launchEnhanced(Launcher.java:315)
>        at org.codehaus.classworlds.Launcher.launch(Launcher.java:255)
>        at
> org.codehaus.classworlds.Launcher.mainWithExitCode(Launcher.java:430)
>        at org.codehaus.classworlds.Launcher.main(Launcher.java:375)
> Caused by: org.apache.maven.plugin.MojoFailureException: 2 builds failed.
>        at
> org.apache.maven.plugin.invoker.InvokerSession.handleFailures(InvokerSession.java:263)
>        at
> org.apache.maven.plugin.invoker.InvokerMojo.processResults(InvokerMojo.java:58)
>        at
> org.apache.maven.plugin.invoker.AbstractInvokerMojo.execute(AbstractInvokerMojo.java:620)
>        at
> org.apache.maven.plugin.DefaultPluginManager.executeMojo(DefaultPluginManager.java:490)
>        at
> org.apache.maven.lifecycle.DefaultLifecycleExecutor.executeGoals(DefaultLifecycleExecutor.java:694)
>        ... 17 more
> [INFO]
> ------------------------------------------------------------------------
> [INFO] BUILD ERRORS
> [INFO]
> ------------------------------------------------------------------------
> [INFO] Total time: 5 minutes 42 seconds
> [INFO] Finished at: Fri Nov 26 12:12:34 CST 2010
> [INFO] Final Memory: 83M/389M
> [INFO]
> ------------------------------------------------------------------------
> Failed to send e-mail to stephenc because no e-mail address is known, and
> no default e-mail domain is configured
>
>

Mime
  • Unnamed multipart/alternative (inline, None, 0 bytes)
View raw message