maven-dev mailing list archives

Site index · List index
Message view « Date » · « Thread »
Top « Date » · « Thread »
From Olivier Lamy <ol...@apache.org>
Subject cvs exe version on the grid (windows node)
Date Sun, 16 May 2010 07:37:34 GMT
ping !


2010/5/8 Olivier Lamy <olamy@apache.org>:
> By any chance, this windauze use a cvs 1.12.13 ?
> It looks to have an issue with this version and local cvs repository.
> I have tested with 1.11.22 and no problem.
>
> Related thread : http://www.mail-archive.com/bug-cvs@nongnu.org/msg01258.html
>
> Any chance to change the cvs exe version ?
>
> 2010/5/8 Hudson <Hudson@sonatype.org>:
>> See <http://grid.sonatype.org/ci/job/maven-scm/./jdk=1.5,label=windows/126/changes>
>>
>> Changes:
>>
>> [Olivier Lamy] upgrade parent
>>
>> ------------------------------------------
>> [...truncated 3760 lines...]
>> Tests run: 1, Failures: 0, Errors: 0, Skipped: 0, Time elapsed: 0.293 sec
>> Running org.apache.maven.scm.provider.vss.commands.checkout.VssCheckOutCommandTest
>> Tests run: 1, Failures: 0, Errors: 0, Skipped: 0, Time elapsed: 0.536 sec
>> Running org.apache.maven.scm.provider.vss.commands.status.VssStatusConsumerTest
>> Tests run: 1, Failures: 0, Errors: 0, Skipped: 0, Time elapsed: 0.029 sec
>> Running org.apache.maven.scm.provider.vss.commands.VssCommandLineUtilsTest
>> Tests run: 2, Failures: 0, Errors: 0, Skipped: 0, Time elapsed: 0.058 sec
>> Running org.apache.maven.scm.provider.vss.commands.edit.VssEditCommandTest
>> Tests run: 4, Failures: 0, Errors: 0, Skipped: 0, Time elapsed: 0.36 sec
>> Running org.apache.maven.scm.provider.vss.VssScmProviderTest
>> Tests run: 1, Failures: 0, Errors: 0, Skipped: 0, Time elapsed: 0.015 sec
>> Running org.apache.maven.scm.provider.vss.commands.status.VssStatusCommandTest
>> Tests run: 1, Failures: 0, Errors: 0, Skipped: 0, Time elapsed: 0.035 sec
>> Running org.apache.maven.scm.provider.vss.commands.update.VssUpdateCommandTest
>> Tests run: 1, Failures: 0, Errors: 0, Skipped: 0, Time elapsed: 0.048 sec
>> Running org.apache.maven.scm.provider.vss.commands.add.VssAddCommandTest
>> Tests run: 2, Failures: 0, Errors: 0, Skipped: 0, Time elapsed: 0.059 sec
>>
>> Results :
>>
>> Tests run: 14, Failures: 0, Errors: 0, Skipped: 0
>>
>> [INFO]
>> [INFO] --- maven-jar-plugin:2.3:jar (default-jar) @ maven-scm-provider-vss ---
>> [INFO] Building jar: C:\home\hudson\workspace\maven-scm\jdk\1.5\label\windows\trunk\maven-scm-providers\maven-scm-provider-vss\target\maven-scm-provider-vss-1.4-SNAPSHOT.jar
>> [INFO]
>> [INFO] --- maven-install-plugin:2.3:install (default-install) @ maven-scm-provider-vss
---
>> [INFO] Installing C:\home\hudson\workspace\maven-scm\jdk\1.5\label\windows\trunk\maven-scm-providers\maven-scm-provider-vss\target\maven-scm-provider-vss-1.4-SNAPSHOT.jar
to C:\opt\repos\scm\org\apache\maven\scm\maven-scm-provider-vss\1.4-SNAPSHOT\maven-scm-provider-vss-1.4-SNAPSHOT.jar
>> [INFO]
>> [INFO] --- maven-deploy-plugin:2.5:deploy (default-deploy) @ maven-scm-provider-vss
---
>> [INFO] Retrieving previous build number from apache.snapshots.https
>> [INFO] repository metadata for: 'snapshot org.apache.maven.scm:maven-scm-provider-vss:1.4-SNAPSHOT'
could not be found on repository: apache.snapshots.https, so will be created
>> Uploading: file:/opt/repos/deploy-junk/org/apache/maven/scm/maven-scm-provider-vss/1.4-SNAPSHOT/maven-scm-provider-vss-1.4-20100508.133653-1.jar
>> 67 KB uploaded at 11058.9 KB/sec
>> [INFO] Retrieving previous metadata from apache.snapshots.https
>> [INFO] repository metadata for: 'artifact org.apache.maven.scm:maven-scm-provider-vss'
could not be found on repository: apache.snapshots.https, so will be created
>> [INFO] Uploading repository metadata for: 'artifact org.apache.maven.scm:maven-scm-provider-vss'
>> [INFO] Retrieving previous metadata from apache.snapshots.https
>> [INFO] repository metadata for: 'snapshot org.apache.maven.scm:maven-scm-provider-vss:1.4-SNAPSHOT'
could not be found on repository: apache.snapshots.https, so will be created
>> [INFO] Uploading repository metadata for: 'snapshot org.apache.maven.scm:maven-scm-provider-vss:1.4-SNAPSHOT'
>> [INFO] Uploading project information for maven-scm-provider-vss 1.4-20100508.133653-1
>> [INFO]
>> [INFO] ------------------------------------------------------------------------
>> [INFO] Building Maven SCM TFS Provider 1.4-SNAPSHOT
>> [INFO] ------------------------------------------------------------------------
>> [INFO]
>> [INFO] --- maven-clean-plugin:2.4:clean (default-clean) @ maven-scm-provider-tfs
---
>> [INFO] Deleting C:\home\hudson\workspace\maven-scm\jdk\1.5\label\windows\trunk\maven-scm-providers\maven-scm-provider-tfs\target
>> [INFO]
>> [INFO] --- maven-remote-resources-plugin:1.1:process (default) @ maven-scm-provider-tfs
---
>> [INFO]
>> [INFO] --- maven-resources-plugin:2.4:resources (default-resources) @ maven-scm-provider-tfs
---
>> [INFO] Using 'UTF-8' encoding to copy filtered resources.
>> [INFO] skip non existing resourceDirectory C:\home\hudson\workspace\maven-scm\jdk\1.5\label\windows\trunk\maven-scm-providers\maven-scm-provider-tfs\src\main\resources
>> [INFO] Copying 3 resources
>> [INFO]
>> [INFO] --- maven-compiler-plugin:2.3:compile (default-compile) @ maven-scm-provider-tfs
---
>> [INFO] Compiling 19 source files to C:\home\hudson\workspace\maven-scm\jdk\1.5\label\windows\trunk\maven-scm-providers\maven-scm-provider-tfs\target\classes
>> [INFO]
>> [INFO] --- plexus-maven-plugin:1.3.8:descriptor (default) @ maven-scm-provider-tfs
---
>> [INFO] Discovered 1 component descriptors(s)
>> [INFO]
>> [INFO] --- maven-resources-plugin:2.4:testResources (default-testResources) @ maven-scm-provider-tfs
---
>> [INFO] Using 'UTF-8' encoding to copy filtered resources.
>> [INFO] skip non existing resourceDirectory C:\home\hudson\workspace\maven-scm\jdk\1.5\label\windows\trunk\maven-scm-providers\maven-scm-provider-tfs\src\test\resources
>> [INFO] Copying 3 resources
>> [INFO]
>> [INFO] --- maven-compiler-plugin:2.3:testCompile (default-testCompile) @ maven-scm-provider-tfs
---
>> [INFO] Compiling 12 source files to C:\home\hudson\workspace\maven-scm\jdk\1.5\label\windows\trunk\maven-scm-providers\maven-scm-provider-tfs\target\test-classes
>> [INFO]
>> [INFO] --- maven-surefire-plugin:2.5:test (default-test) @ maven-scm-provider-tfs
---
>> [INFO] Surefire report directory: C:\home\hudson\workspace\maven-scm\jdk\1.5\label\windows\trunk\maven-scm-providers\maven-scm-provider-tfs\target\surefire-reports
>>
>> -------------------------------------------------------
>>  T E S T S
>> -------------------------------------------------------
>> Running org.apache.maven.scm.provider.tfs.command.TfsUpdateCommandTest
>> Tests run: 2, Failures: 0, Errors: 0, Skipped: 0, Time elapsed: 0.27 sec
>> Running org.apache.maven.scm.provider.tfs.command.TfsEditCommandTest
>> Tests run: 3, Failures: 0, Errors: 0, Skipped: 0, Time elapsed: 0.056 sec
>> Running org.apache.maven.scm.provider.tfs.command.TfsCommandTest
>> Tests run: 1, Failures: 0, Errors: 0, Skipped: 0, Time elapsed: 0.033 sec
>> Running org.apache.maven.scm.provider.tfs.command.TfsStatusCommandTest
>> Tests run: 4, Failures: 0, Errors: 0, Skipped: 0, Time elapsed: 0.047 sec
>> Running org.apache.maven.scm.provider.tfs.command.TfsListCommandTest
>> Tests run: 3, Failures: 0, Errors: 0, Skipped: 0, Time elapsed: 0.048 sec
>> Running org.apache.maven.scm.provider.tfs.command.TfsAddCommandTest
>> Tests run: 2, Failures: 0, Errors: 0, Skipped: 0, Time elapsed: 0.024 sec
>> Running org.apache.maven.scm.provider.tfs.command.TfsChangeLogCommandTest
>> Tests run: 4, Failures: 0, Errors: 0, Skipped: 0, Time elapsed: 0.063 sec
>> Running org.apache.maven.scm.provider.tfs.command.TfsBranchCommandTest
>> Tests run: 2, Failures: 0, Errors: 0, Skipped: 0, Time elapsed: 0.046 sec
>> Running org.apache.maven.scm.provider.tfs.command.TfsUnEditCommandTest
>> Tests run: 2, Failures: 0, Errors: 0, Skipped: 0, Time elapsed: 0.031 sec
>> Running org.apache.maven.scm.provider.tfs.command.TfsCheckOutCommandTest
>> Tests run: 4, Failures: 0, Errors: 0, Skipped: 0, Time elapsed: 0.06 sec
>> Running org.apache.maven.scm.provider.tfs.command.TfsTagCommandTest
>> Tests run: 2, Failures: 0, Errors: 0, Skipped: 0, Time elapsed: 0.026 sec
>> Running org.apache.maven.scm.provider.tfs.command.TfsCheckInCommandTest
>> Tests run: 2, Failures: 0, Errors: 0, Skipped: 0, Time elapsed: 0.039 sec
>>
>> Results :
>>
>> Tests run: 31, Failures: 0, Errors: 0, Skipped: 0
>>
>> [INFO]
>> [INFO] --- maven-jar-plugin:2.3:jar (default-jar) @ maven-scm-provider-tfs ---
>> [INFO] Building jar: C:\home\hudson\workspace\maven-scm\jdk\1.5\label\windows\trunk\maven-scm-providers\maven-scm-provider-tfs\target\maven-scm-provider-tfs-1.4-SNAPSHOT.jar
>> [INFO]
>> [INFO] --- maven-install-plugin:2.3:install (default-install) @ maven-scm-provider-tfs
---
>> [INFO] Installing C:\home\hudson\workspace\maven-scm\jdk\1.5\label\windows\trunk\maven-scm-providers\maven-scm-provider-tfs\target\maven-scm-provider-tfs-1.4-SNAPSHOT.jar
to C:\opt\repos\scm\org\apache\maven\scm\maven-scm-provider-tfs\1.4-SNAPSHOT\maven-scm-provider-tfs-1.4-SNAPSHOT.jar
>> [INFO]
>> [INFO] --- maven-deploy-plugin:2.5:deploy (default-deploy) @ maven-scm-provider-tfs
---
>> [INFO] Retrieving previous build number from apache.snapshots.https
>> [INFO] repository metadata for: 'snapshot org.apache.maven.scm:maven-scm-provider-tfs:1.4-SNAPSHOT'
could not be found on repository: apache.snapshots.https, so will be created
>> Uploading: file:/opt/repos/deploy-junk/org/apache/maven/scm/maven-scm-provider-tfs/1.4-SNAPSHOT/maven-scm-provider-tfs-1.4-20100508.133653-1.jar
>> 38 KB uploaded at 9345.0 KB/sec
>> [INFO] Uploading project information for maven-scm-provider-tfs 1.4-20100508.133653-1
>> [INFO] Retrieving previous metadata from apache.snapshots.https
>> [INFO] repository metadata for: 'artifact org.apache.maven.scm:maven-scm-provider-tfs'
could not be found on repository: apache.snapshots.https, so will be created
>> [INFO] Uploading repository metadata for: 'artifact org.apache.maven.scm:maven-scm-provider-tfs'
>> [INFO] Retrieving previous metadata from apache.snapshots.https
>> [INFO] repository metadata for: 'snapshot org.apache.maven.scm:maven-scm-provider-tfs:1.4-SNAPSHOT'
could not be found on repository: apache.snapshots.https, so will be created
>> [INFO] Uploading repository metadata for: 'snapshot org.apache.maven.scm:maven-scm-provider-tfs:1.4-SNAPSHOT'
>> [INFO]
>> [INFO] ------------------------------------------------------------------------
>> [INFO] Skipping Maven SCM Standard Providers
>> [INFO] This project has been banned from the build due to previous failures.
>> [INFO] ------------------------------------------------------------------------
>> [INFO]
>> [INFO] ------------------------------------------------------------------------
>> [INFO] Skipping Maven SCM Client
>> [INFO] This project has been banned from the build due to previous failures.
>> [INFO] ------------------------------------------------------------------------
>> [INFO]
>> [INFO] ------------------------------------------------------------------------
>> [INFO] Skipping Maven SCM Plugin
>> [INFO] This project has been banned from the build due to previous failures.
>> [INFO] ------------------------------------------------------------------------
>> [INFO] ------------------------------------------------------------------------
>> [INFO] Reactor Summary:
>> [INFO]
>> [INFO] Maven SCM ......................................... SUCCESS [19.584s]
>> [INFO] Maven SCM API ..................................... SUCCESS [21.836s]
>> [INFO] Maven SCM Managers ................................ SUCCESS [0.080s]
>> [INFO] Maven SCM Manager for Plexus ...................... SUCCESS [5.541s]
>> [INFO] Maven SCM Test .................................... SUCCESS [2.342s]
>> [INFO] Maven SCM Providers ............................... SUCCESS [0.121s]
>> [INFO] Maven SCM AccuRev Provider ........................ SUCCESS [11.213s]
>> [INFO] Maven SCM Bazaar Provider ......................... SUCCESS [3.036s]
>> [INFO] Maven SCM Clearcase Provider ...................... SUCCESS [14.411s]
>> [INFO] Maven SCM CVS Provider - Parent ................... SUCCESS [0.108s]
>> [INFO] Maven SCM CVS Provider TCK tests .................. SUCCESS [2.164s]
>> [INFO] Maven SCM CVS Provider - Common library ........... SUCCESS [3.517s]
>> [INFO] Maven SCM CVS Provider - CVS Executable Impl. ..... FAILURE [6.361s]
>> [INFO] Maven SCM CVS Provider - CVS Java Impl. ........... FAILURE [6.269s]
>> [INFO] Maven SCM Mercurial (Hg) Provider ................. SUCCESS [2.772s]
>> [INFO] Maven SCM Git Provider - Parent ................... SUCCESS [0.092s]
>> [INFO] Maven SCM Git Provider - Common library ........... SUCCESS [3.610s]
>> [INFO] Maven SCM git Provider TCK Tests .................. SUCCESS [2.311s]
>> [INFO] Maven SCM Git Provider - Git Executable Impl. ..... SUCCESS [4.624s]
>> [INFO] Maven SCM Local Provider .......................... SUCCESS [2.927s]
>> [INFO] Maven SCM Perforce Provider ....................... SUCCESS [6.309s]
>> [INFO] Maven SCM Starteam Provider ....................... SUCCESS [6.090s]
>> [INFO] Maven SCM Subversion Provider - Parent ............ SUCCESS [0.110s]
>> [INFO] Maven SCM Subversion Provider - Common library .... SUCCESS [3.242s]
>> [INFO] Maven SCM Subversion Provider TCK Tests ........... SUCCESS [1.376s]
>> [INFO] Maven SCM Subversion Provider - SVN Executable Impl.  SUCCESS [1:08.478s]
>> [INFO] Maven SCM Synergy Provider ........................ SUCCESS [4.514s]
>> [INFO] Maven SCM Visual Source Safe Provider ............. SUCCESS [10.083s]
>> [INFO] Maven SCM TFS Provider ............................ SUCCESS [3.278s]
>> [INFO] Maven SCM Standard Providers ...................... SKIPPED
>> [INFO] Maven SCM Client .................................. SKIPPED
>> [INFO] Maven SCM Plugin .................................. SKIPPED
>> [INFO] ------------------------------------------------------------------------
>> [INFO] BUILD FAILURE
>> [INFO] ------------------------------------------------------------------------
>> [INFO] Total time: 3:37.714s
>> [INFO] Finished at: Sat May 08 06:40:10 PDT 2010
>> [INFO] Final Memory: 15M/31M
>> [INFO] ------------------------------------------------------------------------
>> [ERROR] Failed to execute goal org.apache.maven.plugins:maven-surefire-plugin:2.5:test
(default-test) on project maven-scm-provider-cvsexe: There are test failures.
>>
>> Please refer to C:\home\hudson\workspace\maven-scm\jdk\1.5\label\windows\trunk\maven-scm-providers\maven-scm-providers-cvs\maven-scm-provider-cvsexe\target\surefire-reports
for the individual test results.
>> -> [Help 1]
>> org.apache.maven.lifecycle.LifecycleExecutionException: Failed to execute goal org.apache.maven.plugins:maven-surefire-plugin:2.5:test
(default-test) on project maven-scm-provider-cvsexe: There are test failures.
>>
>> Please refer to C:\home\hudson\workspace\maven-scm\jdk\1.5\label\windows\trunk\maven-scm-providers\maven-scm-providers-cvs\maven-scm-provider-cvsexe\target\surefire-reports
for the individual test results.
>>        at org.apache.maven.lifecycle.DefaultLifecycleExecutor.execute(DefaultLifecycleExecutor.java:566)
>>        at org.apache.maven.lifecycle.DefaultLifecycleExecutor.execute(DefaultLifecycleExecutor.java:317)
>>        at org.apache.maven.DefaultMaven.doExecute(DefaultMaven.java:247)
>>        at org.apache.maven.DefaultMaven.execute(DefaultMaven.java:104)
>>        at org.apache.maven.cli.MavenCli.execute(MavenCli.java:423)
>>        at org.apache.maven.cli.MavenCli.doMain(MavenCli.java:158)
>>        at org.apache.maven.cli.MavenCli.main(MavenCli.java:123)
>>        at sun.reflect.NativeMethodAccessorImpl.invoke0(Native Method)
>>        at sun.reflect.NativeMethodAccessorImpl.invoke(NativeMethodAccessorImpl.java:39)
>>        at sun.reflect.DelegatingMethodAccessorImpl.invoke(DelegatingMethodAccessorImpl.java:25)
>>        at java.lang.reflect.Method.invoke(Method.java:585)
>>        at org.codehaus.plexus.classworlds.launcher.Launcher.launchEnhanced(Launcher.java:290)
>>        at org.codehaus.plexus.classworlds.launcher.Launcher.launch(Launcher.java:230)
>>        at org.codehaus.plexus.classworlds.launcher.Launcher.mainWithExitCode(Launcher.java:409)
>>        at org.codehaus.plexus.classworlds.launcher.Launcher.main(Launcher.java:352)
>> Caused by: org.apache.maven.plugin.MojoFailureException: There are test failures.
>>
>> Please refer to C:\home\hudson\workspace\maven-scm\jdk\1.5\label\windows\trunk\maven-scm-providers\maven-scm-providers-cvs\maven-scm-provider-cvsexe\target\surefire-reports
for the individual test results.
>>        at org.apache.maven.plugin.surefire.SurefirePlugin.execute(SurefirePlugin.java:629)
>>        at org.apache.maven.plugin.DefaultBuildPluginManager.executeMojo(DefaultBuildPluginManager.java:105)
>>        at org.apache.maven.lifecycle.DefaultLifecycleExecutor.execute(DefaultLifecycleExecutor.java:562)
>>        ... 14 more
>> [ERROR] Failed to execute goal org.apache.maven.plugins:maven-surefire-plugin:2.5:test
(default-test) on project maven-scm-provider-cvsjava: There are test failures.
>>
>> Please refer to C:\home\hudson\workspace\maven-scm\jdk\1.5\label\windows\trunk\maven-scm-providers\maven-scm-providers-cvs\maven-scm-provider-cvsjava\target\surefire-reports
for the individual test results.
>> -> [Help 1]
>> org.apache.maven.lifecycle.LifecycleExecutionException: Failed to execute goal org.apache.maven.plugins:maven-surefire-plugin:2.5:test
(default-test) on project maven-scm-provider-cvsjava: There are test failures.
>>
>> Please refer to C:\home\hudson\workspace\maven-scm\jdk\1.5\label\windows\trunk\maven-scm-providers\maven-scm-providers-cvs\maven-scm-provider-cvsjava\target\surefire-reports
for the individual test results.
>>        at org.apache.maven.lifecycle.DefaultLifecycleExecutor.execute(DefaultLifecycleExecutor.java:566)
>>        at org.apache.maven.lifecycle.DefaultLifecycleExecutor.execute(DefaultLifecycleExecutor.java:317)
>>        at org.apache.maven.DefaultMaven.doExecute(DefaultMaven.java:247)
>>        at org.apache.maven.DefaultMaven.execute(DefaultMaven.java:104)
>>        at org.apache.maven.cli.MavenCli.execute(MavenCli.java:423)
>>        at org.apache.maven.cli.MavenCli.doMain(MavenCli.java:158)
>>        at org.apache.maven.cli.MavenCli.main(MavenCli.java:123)
>>        at sun.reflect.NativeMethodAccessorImpl.invoke0(Native Method)
>>        at sun.reflect.NativeMethodAccessorImpl.invoke(NativeMethodAccessorImpl.java:39)
>>        at sun.reflect.DelegatingMethodAccessorImpl.invoke(DelegatingMethodAccessorImpl.java:25)
>>        at java.lang.reflect.Method.invoke(Method.java:585)
>>        at org.codehaus.plexus.classworlds.launcher.Launcher.launchEnhanced(Launcher.java:290)
>>        at org.codehaus.plexus.classworlds.launcher.Launcher.launch(Launcher.java:230)
>>        at org.codehaus.plexus.classworlds.launcher.Launcher.mainWithExitCode(Launcher.java:409)
>>        at org.codehaus.plexus.classworlds.launcher.Launcher.main(Launcher.java:352)
>> Caused by: org.apache.maven.plugin.MojoFailureException: There are test failures.
>>
>> Please refer to C:\home\hudson\workspace\maven-scm\jdk\1.5\label\windows\trunk\maven-scm-providers\maven-scm-providers-cvs\maven-scm-provider-cvsjava\target\surefire-reports
for the individual test results.
>>        at org.apache.maven.plugin.surefire.SurefirePlugin.execute(SurefirePlugin.java:629)
>>        at org.apache.maven.plugin.DefaultBuildPluginManager.executeMojo(DefaultBuildPluginManager.java:105)
>>        at org.apache.maven.lifecycle.DefaultLifecycleExecutor.execute(DefaultLifecycleExecutor.java:562)
>>        ... 14 more
>> [ERROR]
>> [ERROR] Re-run Maven using the -X switch to enable full debug logging.
>> [ERROR]
>> [ERROR] For more information about the errors and possible solutions, please read
the following articles:
>> [ERROR] [Help 1] http://cwiki.apache.org/confluence/display/MAVEN/MojoFailureException
>> [ERROR]
>> [ERROR] After correcting the problems, you can resume the build with the command
>> [ERROR]   mvn <goals> -rf :maven-scm-provider-cvsexe
>> Recording test results
>> Failed to send e-mail to dantran because no e-mail address is known, and no default
e-mail domain is configured
>>
>>
>
>
>
> --
> Olivier
> http://twitter.com/olamy
> http://fr.linkedin.com/in/olamy
> http://www.viadeo.com/fr/profile/olivier.lamy7
>



-- 
Olivier
http://twitter.com/olamy
http://fr.linkedin.com/in/olamy
http://www.viadeo.com/fr/profile/olivier.lamy7

---------------------------------------------------------------------
To unsubscribe, e-mail: dev-unsubscribe@maven.apache.org
For additional commands, e-mail: dev-help@maven.apache.org


Mime
View raw message