maven-dev mailing list archives

Site index · List index
Message view « Date » · « Thread »
Top « Date » · « Thread »
From Stephen Connolly <stephen.alan.conno...@gmail.com>
Subject Re: Build failed in Hudson: surefire » 1.5,ubuntu #61
Date Mon, 17 May 2010 13:49:12 GMT
Everything passed on my machine before I committed the change... I'll re-run
again

On 17 May 2010 14:48, Stephen Connolly <stephen.alan.connolly@gmail.com>wrote:

> Balls!
>
> FYI, I'm looking into this
>
> -Stephen
>
>
> On 17 May 2010 14:40, Hudson <Hudson@sonatype.org> wrote:
>
>> See <
>> http://grid.sonatype.org/ci/job/surefire/./jdk=1.5,label=ubuntu/61/changes
>> >
>>
>> Changes:
>>
>> [stephenc] [SUREFIRE-592] Tidy-up poms
>>
>> o Removing unused dependencies
>>
>> [stephenc] [SUREFIRE-592] Partial refactoring
>>
>> o Need to refactor further to remove isolate the extra dummy accessors in
>> each of the three mojos
>>
>> [stephenc] as far as I can tell these two methods are unused.
>>
>> [stephenc] synchronizing with the latest SurefirePlugin code (before I
>> refactor to a common base class)
>>
>> ------------------------------------------
>> [...truncated 1869 lines...]
>> Downloading:
>> http://repository.sonatype.org:8081/content/groups/sonatype-public-grid/org/apache/maven/doxia/doxia-module-fml/1.0-alpha-11/doxia-module-fml-1.0-alpha-11.jar
>> 18 KB downloaded at 63.8 KB/sec
>> Downloading:
>> http://repository.sonatype.org:8081/content/groups/sonatype-public-grid/org/apache/maven/doxia/doxia-module-xdoc/1.0-alpha-11/doxia-module-xdoc-1.0-alpha-11.jar
>> 27 KB downloaded at 400.5 KB/sec
>> Downloading:
>> http://repository.sonatype.org:8081/content/groups/sonatype-public-grid/org/apache/maven/doxia/doxia-module-xhtml/1.0-alpha-11/doxia-module-xhtml-1.0-alpha-11.jar
>> 21 KB downloaded at 211.9 KB/sec
>> Downloading:
>> http://repository.sonatype.org:8081/content/groups/sonatype-public-grid/org/beanshell/bsh/2.0b4/bsh-2.0b4.jar
>> 276 KB downloaded at 2670.8 KB/sec
>> Downloading:
>> http://repository.sonatype.org:8081/content/groups/sonatype-public-grid/org/codehaus/groovy/groovy/1.5.6/groovy-1.5.6.jar
>> 2252 KB downloaded at 4810.6 KB/sec
>> Downloading:
>> http://repository.sonatype.org:8081/content/groups/sonatype-public-grid/antlr/antlr/2.7.6/antlr-2.7.6.jar
>> 434 KB downloaded at 3049.6 KB/sec
>> Downloading:
>> http://repository.sonatype.org:8081/content/groups/sonatype-public-grid/asm/asm/2.2/asm-2.2.jar
>> 34 KB downloaded at 365.2 KB/sec
>> Downloading:
>> http://repository.sonatype.org:8081/content/groups/sonatype-public-grid/org/apache/ant/ant/1.7.1/ant-1.7.1.jar
>> 1292 KB downloaded at 7975.3 KB/sec
>> Downloading:
>> http://repository.sonatype.org:8081/content/groups/sonatype-public-grid/org/apache/ant/ant-launcher/1.7.0/ant-launcher-1.7.0.jar
>> 12 KB downloaded at 125.9 KB/sec
>> Downloading:
>> http://repository.sonatype.org:8081/content/groups/sonatype-public-grid/asm/asm-util/2.2/asm-util-2.2.jar
>> 33 KB downloaded at 327.4 KB/sec
>> Downloading:
>> http://repository.sonatype.org:8081/content/groups/sonatype-public-grid/asm/asm-analysis/2.2/asm-analysis-2.2.jar
>> 18 KB downloaded at 185.0 KB/sec
>> Downloading:
>> http://repository.sonatype.org:8081/content/groups/sonatype-public-grid/asm/asm-tree/2.2/asm-tree-2.2.jar
>> 16 KB downloaded at 226.9 KB/sec
>> Downloading:
>> http://repository.sonatype.org:8081/content/groups/sonatype-public-grid/jline/jline/0.9.94/jline-0.9.94.jar
>> 86 KB downloaded at 641.2 KB/sec
>> Downloading:
>> http://repository.sonatype.org:8081/content/groups/sonatype-public-grid/org/codehaus/plexus/plexus-interpolation/1.2/plexus-interpolation-1.2.jar
>> 36 KB downloaded at 416.8 KB/sec
>> [INFO] Installing <
>> http://grid.sonatype.org/ci/job/surefire/./jdk=1.5,label=ubuntu/ws/trunk/maven-surefire-report-plugin/pom.xml>
>> to
>> /opt/repos/surefire/jdk=1.5,label=ubuntu/org/apache/maven/plugins/maven-surefire-report-plugin/2.6-SNAPSHOT/maven-surefire-report-plugin-2.6-SNAPSHOT.pom
>> [INFO] Installing <
>> http://grid.sonatype.org/ci/job/surefire/./jdk=1.5,label=ubuntu/ws/trunk/maven-surefire-report-plugin/target/maven-surefire-report-plugin-2.6-SNAPSHOT.jar>
>> to
>> /opt/repos/surefire/jdk=1.5,label=ubuntu/org/apache/maven/plugins/maven-surefire-report-plugin/2.6-SNAPSHOT/maven-surefire-report-plugin-2.6-20100517.132817-21.jar
>> [INFO] Installing <
>> http://grid.sonatype.org/ci/job/surefire/./jdk=1.5,label=ubuntu/ws/trunk/pom.xml>
>> to
>> /opt/repos/surefire/jdk=1.5,label=ubuntu/org/apache/maven/surefire/surefire/2.6-SNAPSHOT/surefire-2.6-SNAPSHOT.pom
>> [INFO] Installing <
>> http://grid.sonatype.org/ci/job/surefire/./jdk=1.5,label=ubuntu/ws/trunk/maven-surefire-plugin/pom.xml>
>> to
>> /opt/repos/surefire/jdk=1.5,label=ubuntu/org/apache/maven/plugins/maven-surefire-plugin/2.6-SNAPSHOT/maven-surefire-plugin-2.6-SNAPSHOT.pom
>> [INFO] Skipped re-installing <
>> http://grid.sonatype.org/ci/job/surefire/./jdk=1.5,label=ubuntu/ws/trunk/maven-surefire-plugin/target/maven-surefire-plugin-2.6-SNAPSHOT.jar>
>> to
>> /opt/repos/surefire/jdk=1.5,label=ubuntu/org/apache/maven/plugins/maven-surefire-plugin/2.6-SNAPSHOT/maven-surefire-plugin-2.6-20100517.132817-21.jar,
>> seems unchanged
>> [INFO] Installing <
>> http://grid.sonatype.org/ci/job/surefire/./jdk=1.5,label=ubuntu/ws/trunk/surefire-booter/target/dependency-reduced-pom.xml>
>> to
>> /opt/repos/surefire/jdk=1.5,label=ubuntu/org/apache/maven/surefire/surefire-booter/2.6-SNAPSHOT/surefire-booter-2.6-SNAPSHOT.pom
>> [INFO] Skipped re-installing <
>> http://grid.sonatype.org/ci/job/surefire/./jdk=1.5,label=ubuntu/ws/trunk/surefire-booter/target/surefire-booter-2.6-SNAPSHOT.jar>
>> to
>> /opt/repos/surefire/jdk=1.5,label=ubuntu/org/apache/maven/surefire/surefire-booter/2.6-SNAPSHOT/surefire-booter-2.6-20100517.132817-21.jar,
>> seems unchanged
>> [INFO] Installing <
>> http://grid.sonatype.org/ci/job/surefire/./jdk=1.5,label=ubuntu/ws/trunk/surefire-api/target/dependency-reduced-pom.xml>
>> to
>> /opt/repos/surefire/jdk=1.5,label=ubuntu/org/apache/maven/surefire/surefire-api/2.6-SNAPSHOT/surefire-api-2.6-SNAPSHOT.pom
>> [INFO] Skipped re-installing <
>> http://grid.sonatype.org/ci/job/surefire/./jdk=1.5,label=ubuntu/ws/trunk/surefire-api/target/surefire-api-2.6-SNAPSHOT.jar>
>> to
>> /opt/repos/surefire/jdk=1.5,label=ubuntu/org/apache/maven/surefire/surefire-api/2.6-SNAPSHOT/surefire-api-2.6-20100517.132817-21.jar,
>> seems unchanged
>> [INFO] Installing <
>> http://grid.sonatype.org/ci/job/surefire/./jdk=1.5,label=ubuntu/ws/trunk/maven-surefire-common/pom.xml>
>> to
>> /opt/repos/surefire/jdk=1.5,label=ubuntu/org/apache/maven/surefire/maven-surefire-common/2.6-SNAPSHOT/maven-surefire-common-2.6-SNAPSHOT.pom
>> [INFO] Skipped re-installing <
>> http://grid.sonatype.org/ci/job/surefire/./jdk=1.5,label=ubuntu/ws/trunk/maven-surefire-common/target/maven-surefire-common-2.6-SNAPSHOT.jar>
>> to
>> /opt/repos/surefire/jdk=1.5,label=ubuntu/org/apache/maven/surefire/maven-surefire-common/2.6-SNAPSHOT/maven-surefire-common-2.6-20100517.132817-1.jar,
>> seems unchanged
>> [INFO] Installing <
>> http://grid.sonatype.org/ci/job/surefire/./jdk=1.5,label=ubuntu/ws/trunk/surefire-providers/surefire-testng/pom.xml>
>> to
>> /opt/repos/surefire/jdk=1.5,label=ubuntu/org/apache/maven/surefire/surefire-testng/2.6-SNAPSHOT/surefire-testng-2.6-SNAPSHOT.pom
>> [INFO] Installing <
>> http://grid.sonatype.org/ci/job/surefire/./jdk=1.5,label=ubuntu/ws/trunk/surefire-providers/surefire-testng/target/surefire-testng-2.6-SNAPSHOT.jar>
>> to
>> /opt/repos/surefire/jdk=1.5,label=ubuntu/org/apache/maven/surefire/surefire-testng/2.6-SNAPSHOT/surefire-testng-2.6-20100517.132817-21.jar
>> [INFO] Installing <
>> http://grid.sonatype.org/ci/job/surefire/./jdk=1.5,label=ubuntu/ws/trunk/surefire-providers/pom.xml>
>> to
>> /opt/repos/surefire/jdk=1.5,label=ubuntu/org/apache/maven/surefire/surefire-providers/2.6-SNAPSHOT/surefire-providers-2.6-SNAPSHOT.pom
>> [INFO] Installing <
>> http://grid.sonatype.org/ci/job/surefire/./jdk=1.5,label=ubuntu/ws/trunk/surefire-providers/surefire-junit/pom.xml>
>> to
>> /opt/repos/surefire/jdk=1.5,label=ubuntu/org/apache/maven/surefire/surefire-junit/2.6-SNAPSHOT/surefire-junit-2.6-SNAPSHOT.pom
>> [INFO] Installing <
>> http://grid.sonatype.org/ci/job/surefire/./jdk=1.5,label=ubuntu/ws/trunk/surefire-providers/surefire-junit/target/surefire-junit-2.6-SNAPSHOT.jar>
>> to
>> /opt/repos/surefire/jdk=1.5,label=ubuntu/org/apache/maven/surefire/surefire-junit/2.6-SNAPSHOT/surefire-junit-2.6-20100517.132817-21.jar
>> [INFO] Installing <
>> http://grid.sonatype.org/ci/job/surefire/./jdk=1.5,label=ubuntu/ws/trunk/surefire-providers/surefire-junit4/pom.xml>
>> to
>> /opt/repos/surefire/jdk=1.5,label=ubuntu/org/apache/maven/surefire/surefire-junit4/2.6-SNAPSHOT/surefire-junit4-2.6-SNAPSHOT.pom
>> [INFO] Skipped re-installing <
>> http://grid.sonatype.org/ci/job/surefire/./jdk=1.5,label=ubuntu/ws/trunk/surefire-providers/surefire-junit4/target/surefire-junit4-2.6-SNAPSHOT.jar>
>> to
>> /opt/repos/surefire/jdk=1.5,label=ubuntu/org/apache/maven/surefire/surefire-junit4/2.6-SNAPSHOT/surefire-junit4-2.6-20100517.132817-21.jar,
>> seems unchanged
>> [INFO] Installing <
>> http://grid.sonatype.org/ci/job/surefire/./jdk=1.5,label=ubuntu/ws/trunk/surefire-providers/surefire-junit47/pom.xml>
>> to
>> /opt/repos/surefire/jdk=1.5,label=ubuntu/org/apache/maven/surefire/surefire-junit47/2.6-SNAPSHOT/surefire-junit47-2.6-SNAPSHOT.pom
>> [INFO] Skipped re-installing <
>> http://grid.sonatype.org/ci/job/surefire/./jdk=1.5,label=ubuntu/ws/trunk/surefire-providers/surefire-junit47/target/surefire-junit47-2.6-SNAPSHOT.jar>
>> to
>> /opt/repos/surefire/jdk=1.5,label=ubuntu/org/apache/maven/surefire/surefire-junit47/2.6-SNAPSHOT/surefire-junit47-2.6-20100517.132817-21.jar,
>> seems unchanged
>> [INFO] Installing <
>> http://grid.sonatype.org/ci/job/surefire/./jdk=1.5,label=ubuntu/ws/trunk/surefire-integration-tests/pom.xml>
>> to
>> /opt/repos/surefire/jdk=1.5,label=ubuntu/org/apache/maven/surefire/surefire-integration-tests/2.6-SNAPSHOT/surefire-integration-tests-2.6-SNAPSHOT.pom
>> [INFO] Installing <
>> http://grid.sonatype.org/ci/job/surefire/./jdk=1.5,label=ubuntu/ws/trunk/surefire-integration-tests/target/surefire-integration-tests-2.6-SNAPSHOT.jar>
>> to
>> /opt/repos/surefire/jdk=1.5,label=ubuntu/org/apache/maven/surefire/surefire-integration-tests/2.6-SNAPSHOT/surefire-integration-tests-2.6-SNAPSHOT.jar
>> [INFO]
>> [INFO] --- maven-failsafe-plugin:2.5:integration-test (default) @
>> surefire-integration-tests ---
>> Downloading:
>> http://repository.sonatype.org:8081/content/groups/sonatype-public-grid/org/apache/maven/plugins/maven-failsafe-plugin/2.5/maven-failsafe-plugin-2.5.pom
>> 10 KB downloaded at 113.9 KB/sec
>> [INFO] Failsafe report directory: <
>> http://grid.sonatype.org/ci/job/surefire/./jdk=1.5,label=ubuntu/ws/trunk/surefire-integration-tests/target/failsafe-reports
>> >
>>
>> -------------------------------------------------------
>>  T E S T S
>> -------------------------------------------------------
>> Running org.apache.maven.surefire.its.UseIsolatedClassLoaderIT
>> Tests run: 1, Failures: 0, Errors: 0, Skipped: 0, Time elapsed: 15.023 sec
>> Running org.apache.maven.surefire.its.Surefire377TestNgAndJUnitTogetherIT
>> Tests run: 1, Failures: 0, Errors: 1, Skipped: 0, Time elapsed: 3.957 sec
>> <<< FAILURE!
>> Running org.apache.maven.surefire.its.ArgLineIT
>> Tests run: 1, Failures: 0, Errors: 1, Skipped: 0, Time elapsed: 3.415 sec
>> <<< FAILURE!
>> Running org.apache.maven.surefire.its.Surefire44InnerClassTestIT
>> Tests run: 1, Failures: 0, Errors: 1, Skipped: 0, Time elapsed: 3.56 sec
>> <<< FAILURE!
>> Running org.apache.maven.surefire.its.ClassPathOrderIT
>> Tests run: 1, Failures: 0, Errors: 1, Skipped: 0, Time elapsed: 5.64 sec
>> <<< FAILURE!
>> Running org.apache.maven.surefire.its.CheckTestNgSuiteXmlIT
>> Tests run: 2, Failures: 0, Errors: 0, Skipped: 0, Time elapsed: 30.867 sec
>> Running org.apache.maven.surefire.its.ForkModeIT
>> Tests run: 5, Failures: 0, Errors: 0, Skipped: 0, Time elapsed: 48.442 sec
>> Running org.apache.maven.surefire.its.Surefire613TestCountInParallelIT
>> Tests run: 1, Failures: 0, Errors: 0, Skipped: 0, Time elapsed: 8.773 sec
>> Running org.apache.maven.surefire.its.IncludesExcludesIT
>> Tests run: 1, Failures: 0, Errors: 1, Skipped: 0, Time elapsed: 3.887 sec
>> <<< FAILURE!
>> Running org.apache.maven.surefire.its.UmlautDirIT
>> Tests run: 2, Failures: 0, Errors: 1, Skipped: 0, Time elapsed: 12.138 sec
>> <<< FAILURE!
>> Running org.apache.maven.surefire.its.PlexusConflictIT
>> Tests run: 2, Failures: 0, Errors: 0, Skipped: 0, Time elapsed: 15.898 sec
>> Running org.apache.maven.surefire.its.CheckTestNgBeforeMethodIT
>> Tests run: 1, Failures: 0, Errors: 0, Skipped: 0, Time elapsed: 4.507 sec
>> Running org.apache.maven.surefire.its.AbstractTestCaseIT
>> Tests run: 1, Failures: 0, Errors: 1, Skipped: 0, Time elapsed: 4.059 sec
>> <<< FAILURE!
>> Running org.apache.maven.surefire.its.CheckTestNgBeforeMethodFailureIT
>> Tests run: 1, Failures: 1, Errors: 0, Skipped: 0, Time elapsed: 3.378 sec
>> <<< FAILURE!
>> Running org.apache.maven.surefire.its.TwoTestCasesIT
>> Tests run: 4, Failures: 0, Errors: 4, Skipped: 0, Time elapsed: 14.416 sec
>> <<< FAILURE!
>> Running org.apache.maven.surefire.its.Surefire146ForkPerTestNoSetupIT
>> Tests run: 1, Failures: 0, Errors: 1, Skipped: 0, Time elapsed: 4.151 sec
>> <<< FAILURE!
>> Running org.apache.maven.surefire.its.PlainOldJavaClasspathIT
>> Tests run: 1, Failures: 0, Errors: 1, Skipped: 0, Time elapsed: 4.461 sec
>> <<< FAILURE!
>> Running org.apache.maven.surefire.its.WorkingDirectoryMissingIT
>> Tests run: 1, Failures: 0, Errors: 1, Skipped: 0, Time elapsed: 4.422 sec
>> <<< FAILURE!
>> Running org.apache.maven.surefire.its.Surefire162CharsetProviderIT
>> Tests run: 1, Failures: 0, Errors: 1, Skipped: 0, Time elapsed: 3.361 sec
>> <<< FAILURE!
>> Running org.apache.maven.surefire.its.Junit4IgnoreIT
>> Tests run: 1, Failures: 0, Errors: 1, Skipped: 0, Time elapsed: 3.989 sec
>> <<< FAILURE!
>> Running org.apache.maven.surefire.its.JUnit44HamcrestIT
>> Tests run: 1, Failures: 0, Errors: 1, Skipped: 0, Time elapsed: 6.541 sec
>> <<< FAILURE!
>> Running org.apache.maven.surefire.its.AdditionalClasspathIT
>> Tests run: 1, Failures: 0, Errors: 1, Skipped: 0, Time elapsed: 5.601 sec
>> <<< FAILURE!
>> Running org.apache.maven.surefire.its.EnvironmentVariableIT
>> Tests run: 1, Failures: 0, Errors: 1, Skipped: 0, Time elapsed: 4.921 sec
>> <<< FAILURE!
>> Running org.apache.maven.surefire.its.CheckTestNgListenerReporterIT
>> Tests run: 1, Failures: 0, Errors: 1, Skipped: 0, Time elapsed: 4.085 sec
>> <<< FAILURE!
>> Running org.apache.maven.surefire.its.SiblingAggregatorIT
>> Tests run: 1, Failures: 0, Errors: 0, Skipped: 0, Time elapsed: 4.741 sec
>> Running org.apache.maven.surefire.its.CheckTestFailIfNoTestsIT
>> Tests run: 2, Failures: 0, Errors: 0, Skipped: 0, Time elapsed: 11.742 sec
>> Running org.apache.maven.surefire.its.CheckTestNgJdk14IT
>> Tests run: 1, Failures: 0, Errors: 1, Skipped: 0, Time elapsed: 5.398 sec
>> <<< FAILURE!
>> Running org.apache.maven.surefire.its.CheckTestNgVersionsIT
>> Tests run: 6, Failures: 0, Errors: 0, Skipped: 0, Time elapsed: 56.14 sec
>> Running org.apache.maven.surefire.its.Surefire224WellFormedXmlFailuresIT
>> Tests run: 1, Failures: 0, Errors: 0, Skipped: 0, Time elapsed: 4.614 sec
>> Running org.apache.maven.surefire.its.Surefire42NotExtendingTestCaseIT
>> Tests run: 1, Failures: 0, Errors: 1, Skipped: 0, Time elapsed: 4.073 sec
>> <<< FAILURE!
>> Running org.apache.maven.surefire.its.Junit47concurrencyIT
>> Tests run: 1, Failures: 0, Errors: 0, Skipped: 0, Time elapsed: 7.651 sec
>> Running org.apache.maven.surefire.its.AggregateReportIT
>> Tests run: 1, Failures: 0, Errors: 0, Skipped: 0, Time elapsed: 10.408 sec
>> Running org.apache.maven.surefire.its.WorkingDirectoryIT
>> Tests run: 4, Failures: 0, Errors: 0, Skipped: 0, Time elapsed: 20.211 sec
>> Running org.apache.maven.surefire.its.DefaultConfigurationIT
>> Tests run: 1, Failures: 0, Errors: 0, Skipped: 0, Time elapsed: 7.384 sec
>> Running org.apache.maven.surefire.its.Junit4VersionsIT
>> Tests run: 9, Failures: 0, Errors: 0, Skipped: 0, Time elapsed: 80.134 sec
>> Running org.apache.maven.surefire.its.CheckSingleTestIT
>> Tests run: 4, Failures: 0, Errors: 0, Skipped: 0, Time elapsed: 31.537 sec
>> Running org.apache.maven.surefire.its.CheckTestNgPathWithSpacesIT
>> Tests run: 1, Failures: 0, Errors: 0, Skipped: 0, Time elapsed: 6.152 sec
>> Running org.apache.maven.surefire.its.CheckTestNgSuiteXmlSingleIT
>> Tests run: 1, Failures: 0, Errors: 0, Skipped: 0, Time elapsed: 8.208 sec
>> Running org.apache.maven.surefire.its.CheckTestNgReportTestIT
>> Tests run: 1, Failures: 0, Errors: 0, Skipped: 0, Time elapsed: 9.033 sec
>> Running org.apache.maven.surefire.its.CheckTestNgExecuteErrorIT
>> Tests run: 1, Failures: 1, Errors: 0, Skipped: 0, Time elapsed: 3.816 sec
>> <<< FAILURE!
>> Running
>> org.apache.maven.surefire.its.JUnit4ForkAlwaysStaticInitPollutionIT
>> Tests run: 1, Failures: 0, Errors: 1, Skipped: 0, Time elapsed: 3.767 sec
>> <<< FAILURE!
>> Running org.apache.maven.surefire.its.TimeoutForkedTestIT
>> Tests run: 1, Failures: 0, Errors: 0, Skipped: 0, Time elapsed: 3.893 sec
>> Running org.apache.maven.surefire.its.CheckTestFailIfNoTestsForkModeIT
>> Tests run: 6, Failures: 0, Errors: 0, Skipped: 0, Time elapsed: 40.539 sec
>> Running org.apache.maven.surefire.its.CheckTestNgGroupThreadParallelIT
>> Tests run: 1, Failures: 0, Errors: 0, Skipped: 0, Time elapsed: 4.363 sec
>> Running org.apache.maven.surefire.its.PojoSimpleIT
>> Tests run: 1, Failures: 0, Errors: 1, Skipped: 0, Time elapsed: 3.663 sec
>> <<< FAILURE!
>> Running org.apache.maven.surefire.its.SystemPropertiesTestIT
>> Tests run: 2, Failures: 0, Errors: 0, Skipped: 0, Time elapsed: 15.939 sec
>>
>> Results :
>>
>> Failed tests:
>>
>>  testTestNgBeforeMethodFailure(org.apache.maven.surefire.its.CheckTestNgBeforeMethodFailureIT)
>>  testExecuteError(org.apache.maven.surefire.its.CheckTestNgExecuteErrorIT)
>>
>> Tests in error:
>>
>>  testTestNgAndJUnitTogether(org.apache.maven.surefire.its.Surefire377TestNgAndJUnitTogetherIT)
>>  testArgLine(org.apache.maven.surefire.its.ArgLineIT)
>>  testInnerClass(org.apache.maven.surefire.its.Surefire44InnerClassTestIT)
>>  testClassPathOrder(org.apache.maven.surefire.its.ClassPathOrderIT)
>>  testIncludesExcludes(org.apache.maven.surefire.its.IncludesExcludesIT)
>>  testUmlaut(org.apache.maven.surefire.its.UmlautDirIT)
>>  testAbstractTestCase(org.apache.maven.surefire.its.AbstractTestCaseIT)
>>  testTwoTestCases(org.apache.maven.surefire.its.TwoTestCasesIT)
>>  testTwoTestCaseSuite(org.apache.maven.surefire.its.TwoTestCasesIT)
>>  testJunit4Suite(org.apache.maven.surefire.its.TwoTestCasesIT)
>>  testTestNGSuite(org.apache.maven.surefire.its.TwoTestCasesIT)
>>
>>  testForkPerTestNoSetup(org.apache.maven.surefire.its.Surefire146ForkPerTestNoSetupIT)
>>
>>  testPlainOldJavaClasspath(org.apache.maven.surefire.its.PlainOldJavaClasspathIT)
>>
>>  testWorkingDirectory(org.apache.maven.surefire.its.WorkingDirectoryMissingIT)
>>
>>  testCharsetProvider(org.apache.maven.surefire.its.Surefire162CharsetProviderIT)
>>  testJunit4Ignore(org.apache.maven.surefire.its.Junit4IgnoreIT)
>>  testJUnit44Hamcrest(org.apache.maven.surefire.its.JUnit44HamcrestIT)
>>
>>  testAdditionalClasspath(org.apache.maven.surefire.its.AdditionalClasspathIT)
>>
>>  testEnvironmentVariable(org.apache.maven.surefire.its.EnvironmentVariableIT)
>>
>>  testTestNgListenerReporter(org.apache.maven.surefire.its.CheckTestNgListenerReporterIT)
>>  testTestNgJdk14(org.apache.maven.surefire.its.CheckTestNgJdk14IT)
>>
>>  testInnerClass(org.apache.maven.surefire.its.Surefire42NotExtendingTestCaseIT)
>>
>>  testJunit4Ignore(org.apache.maven.surefire.its.JUnit4ForkAlwaysStaticInitPollutionIT)
>>  testit(org.apache.maven.surefire.its.PojoSimpleIT)
>>
>> Tests run: 82, Failures: 2, Errors: 24, Skipped: 0
>>
>> [INFO]
>> [INFO] --- maven-failsafe-plugin:2.5:verify (default) @
>> surefire-integration-tests ---
>> [INFO] Failsafe report directory: <
>> http://grid.sonatype.org/ci/job/surefire/./jdk=1.5,label=ubuntu/ws/trunk/surefire-integration-tests/target/failsafe-reports
>> >
>> [INFO]
>> ------------------------------------------------------------------------
>> [INFO] Reactor Summary:
>> [INFO]
>> [INFO] SureFire .......................................... SUCCESS
>> [30.580s]
>> [INFO] SureFire API ...................................... SUCCESS
>> [32.712s]
>> [INFO] SureFire Booter ................................... SUCCESS
>> [5.435s]
>> [INFO] SureFire Providers ................................ SUCCESS
>> [2.145s]
>> [INFO] SureFire JUnit Runner ............................. SUCCESS
>> [4.517s]
>> [INFO] SureFire JUnit4 Runner ............................ SUCCESS
>> [7.855s]
>> [INFO] SureFire JUnitCore Runner ......................... SUCCESS
>> [4.574s]
>> [INFO] SureFire TestNG Runner ............................ SUCCESS
>> [3.673s]
>> [INFO] Maven Surefire Common ............................. SUCCESS
>> [6.371s]
>> [INFO] Maven Surefire Plugin ............................. SUCCESS
>> [14.133s]
>> [INFO] Maven Failsafe Plugin ............................. SUCCESS
>> [8.988s]
>> [INFO] Maven Surefire Report Plugin ...................... SUCCESS
>> [20.046s]
>> [INFO] Maven Surefire Integration Tests .................. FAILURE
>> [9:50.470s]
>> [INFO]
>> ------------------------------------------------------------------------
>> [INFO] BUILD FAILURE
>> [INFO]
>> ------------------------------------------------------------------------
>> [INFO] Total time: 12:14.159s
>> [INFO] Finished at: Mon May 17 07:40:01 GMT-06:00 2010
>> [INFO] Final Memory: 13M/63M
>> [INFO]
>> ------------------------------------------------------------------------
>> [ERROR] Failed to execute goal
>> org.apache.maven.plugins:maven-failsafe-plugin:2.5:verify (default) on
>> project surefire-integration-tests: There are test failures.
>>
>> Please refer to <
>> http://grid.sonatype.org/ci/job/surefire/./jdk=1.5,label=ubuntu/ws/trunk/surefire-integration-tests/target/failsafe-reports>
>> for the individual test results.
>> -> [Help 1]
>> org.apache.maven.lifecycle.LifecycleExecutionException: Failed to execute
>> goal org.apache.maven.plugins:maven-failsafe-plugin:2.5:verify (default) on
>> project surefire-integration-tests: There are test failures.
>>
>> Please refer to <
>> http://grid.sonatype.org/ci/job/surefire/./jdk=1.5,label=ubuntu/ws/trunk/surefire-integration-tests/target/failsafe-reports>
>> for the individual test results.
>>        at
>> org.apache.maven.lifecycle.DefaultLifecycleExecutor.execute(DefaultLifecycleExecutor.java:566)
>>        at
>> org.apache.maven.lifecycle.DefaultLifecycleExecutor.execute(DefaultLifecycleExecutor.java:317)
>>        at org.apache.maven.DefaultMaven.doExecute(DefaultMaven.java:247)
>>        at org.apache.maven.DefaultMaven.execute(DefaultMaven.java:104)
>>        at org.apache.maven.cli.MavenCli.execute(MavenCli.java:423)
>>        at org.apache.maven.cli.MavenCli.doMain(MavenCli.java:158)
>>        at org.apache.maven.cli.MavenCli.main(MavenCli.java:123)
>>        at sun.reflect.NativeMethodAccessorImpl.invoke0(Native Method)
>>        at
>> sun.reflect.NativeMethodAccessorImpl.invoke(NativeMethodAccessorImpl.java:39)
>>        at
>> sun.reflect.DelegatingMethodAccessorImpl.invoke(DelegatingMethodAccessorImpl.java:25)
>>        at java.lang.reflect.Method.invoke(Method.java:585)
>>        at
>> org.codehaus.plexus.classworlds.launcher.Launcher.launchEnhanced(Launcher.java:290)
>>        at
>> org.codehaus.plexus.classworlds.launcher.Launcher.launch(Launcher.java:230)
>>        at
>> org.codehaus.plexus.classworlds.launcher.Launcher.mainWithExitCode(Launcher.java:409)
>>        at
>> org.codehaus.plexus.classworlds.launcher.Launcher.main(Launcher.java:352)
>> Caused by: org.apache.maven.plugin.MojoFailureException: There are test
>> failures.
>>
>> Please refer to <
>> http://grid.sonatype.org/ci/job/surefire/./jdk=1.5,label=ubuntu/ws/trunk/surefire-integration-tests/target/failsafe-reports>
>> for the individual test results.
>>        at
>> org.apache.maven.plugin.failsafe.VerifyMojo.execute(VerifyMojo.java:217)
>>        at
>> org.apache.maven.plugin.DefaultBuildPluginManager.executeMojo(DefaultBuildPluginManager.java:105)
>>        at
>> org.apache.maven.lifecycle.DefaultLifecycleExecutor.execute(DefaultLifecycleExecutor.java:562)
>>        ... 14 more
>> [ERROR]
>> [ERROR] Re-run Maven using the -X switch to enable full debug logging.
>> [ERROR]
>> [ERROR] For more information about the errors and possible solutions,
>> please read the following articles:
>> [ERROR] [Help 1]
>> http://cwiki.apache.org/confluence/display/MAVEN/MojoFailureException
>> [ERROR]
>> [ERROR] After correcting the problems, you can resume the build with the
>> command
>> [ERROR]   mvn <goals> -rf :surefire-integration-tests
>>
>>
>

Mime
  • Unnamed multipart/alternative (inline, None, 0 bytes)
View raw message