maven-dev mailing list archives

Site index · List index
Message view « Date » · « Thread »
Top « Date » · « Thread »
From Lukas Theussl <ltheu...@apache.org>
Subject test failure in embedder
Date Thu, 06 Dec 2007 10:34:08 GMT
Trying to build maven 2.1 with java 5:

Tests run: 1, Failures: 1, Errors: 0, Skipped: 0, Time elapsed: 41.793 
sec <<< FAILURE!
testRunningScmPlugin(org.apache.maven.embedder.execution.EmbedderUsingScmPluginTest) 
  Time elapsed: 41.704 sec  <<< FAILURE!
junit.framework.AssertionFailedError: Encountered Exceptions in 
MavenExecutionResult during testRunningScmPlugin
	at junit.framework.Assert.fail(Assert.java:47)
	at 
org.apache.maven.embedder.execution.AbstractEmbedderExecutionTestCase.assertNoExceptions(AbstractEmbedderExecutionTestCase.java:123)
	at 
org.apache.maven.embedder.execution.AbstractEmbedderExecutionTestCase.runWithProject(AbstractEmbedderExecutionTestCase.java:102)
	at 
org.apache.maven.embedder.execution.AbstractEmbedderExecutionTestCase.runWithProject(AbstractEmbedderExecutionTestCase.java:48)
	at 
org.apache.maven.embedder.execution.EmbedderUsingScmPluginTest.testRunningScmPlugin(EmbedderUsingScmPluginTest.java:49)
	at 
org.apache.maven.embedder.execution.EmbedderUsingScmPluginTest.testRunningScmPlugin(EmbedderUsingScmPluginTest.java:49)



the debug output is:

[ERROR] Provider message:
[ERROR] The svn command failed.
[ERROR] Command output:
[ERROR] svn: error: cannot set LC_ALL locale
svn: error: environment variable LANG is en_US
svn: error: please check that your locale name is correct

org.apache.maven.lifecycle.LifecycleExecutionException: Internal error 
in the plugin manager executing goal 
'org.apache.maven.plugins:maven-scm-plugin:1.0:diff': Mojo execution failed.


---------------------------------------------------------------------
To unsubscribe, e-mail: dev-unsubscribe@maven.apache.org
For additional commands, e-mail: dev-help@maven.apache.org


Mime
View raw message