maven-dev mailing list archives

Site index · List index
Message view « Date » · « Thread »
Top « Date » · « Thread »
From Brett Porter <br...@apache.org>
Subject Re: integration tests (was: [continuum] BUILD FAILURE: Integration Test Executor)
Date Sat, 03 Nov 2007 02:56:54 GMT
Hey John,

On 03/11/2007, at 11:56 AM, Continuum@maven.zones.apache.org wrote:

> Tests in error:  testit0046 
> (org.apache.maven.integrationtests.MavenIT0046Test)

Looks like your changes fixed the two IT problems, but this seems to  
be a new one? I get the same result locally - it's not able to find  
one of the core-it plugins.

Also, the following is appearing at the end of the build result now -  
is this a known problem?

[INFO]  
------------------------------------------------------------------------
[[ERROR]

Mojo:

     org.apache.maven.plugins:maven-surefire-plugin:2.3:test
FAILED for project:

     org.apache.maven.its:core-integration-tests:jar:2.1-SNAPSHOT

Reason:

There are test failures.

For more information, run with the -e flag

Thanks!
Brett

--
Brett Porter - brett@apache.org
Blog: http://www.devzuz.org/blogs/bporter/


---------------------------------------------------------------------
To unsubscribe, e-mail: dev-unsubscribe@maven.apache.org
For additional commands, e-mail: dev-help@maven.apache.org


Mime
View raw message