maven-dev mailing list archives

Site index · List index
Message view « Date » · « Thread »
Top « Date » · « Thread »
From Hervé BOUTEMY <herve.bout...@free.fr>
Subject Re: [continuum] BUILD FAILURE: Maven Project Info Reports Plugin
Date Sun, 26 Aug 2007 21:32:16 GMT
Yes, that's it!
I installed surefire-2.3.1-SNAPSHOT, which I hadn't done previously, and now 
I'm having the build failure.

Thanks for your help, Dennis.

Hervé

Le dimanche 26 août 2007, Dennis Lundberg a écrit :
> I think I solved this, at least it works locally for me now. It seems to
> be the same kind of problem that we ran into in doxia. Leaving the
> surefire-plugin version unspecified made it pick up version
> 2.3.1-SNAPSHOT which seems to have problems with the latest plexus
> container.
>
> Could someone please add some karma for me (dennisl) in
> continuum@maven.zones. It would be nice to be able to run the builds
> manually.
>
> Hervé BOUTEMY wrote:
> > I looked at this build failure and found misc problem when investigating:
> >
> > 1. I can't reproduce the problem on my machine:
> > same Maven version, same JDK version, no SNAPSHOT dependency, but I get
> > no surefire failure
> > Do I miss something in my configuration? Does somebody reproduce the
> > problem on his personal machine?
> >
> > 2. Continuum says this build is failing since 14/08/2007 and was working
> > earlier, but this unit-tests problem is here since the first build: build
> > #1 reports success, but looking at the surefire report, the exact current
> > problem is here
> > http://maven.zones.apache.org/continuum/surefireReport.action?buildId=72&
> >projectId=28
> >
> > Can someone test this build on his machine to help determine if we must
> > investigate on Maven Project Info Reports Plugin code or Continuum
> > configuration?
> >
> > thanks
> >
> > Hervé
> >
> > Le jeudi 23 août 2007, Vincent Siveton a écrit :
> >> Hi,
> >>
> >> It is a plexus error. Do someone has a clue?
> >>
> >> Moreover, the default reply for continuum@maven.zones.apache.org
> >> should be only dev@maven, not both.
> >>
> >> Cheers,
> >>
> >> Vincent
> >>
> >> 7/8/22, Continuum@maven.zones.apache.org 
<continuum@maven.zones.apache.org>:
> >>> Online report :
> >>> http://maven.zones.apache.org/continuum/buildResult.action?buildId=1688
> >>>0& projectId=28
> >>>
> >>> Build statistics:
> >>>   State: Failed
> >>>   Previous State: Failed
> >>>   Started at: Wed 22 Aug 2007 19:45:53 +0000
> >>>   Finished at: Wed 22 Aug 2007 19:46:30 +0000
> >>>   Total time: 36s
> >>>   Build Trigger: Schedule
> >>>   Build Number: 47
> >>>   Exit code: 1
> >>>   Building machine hostname: maven.zones.apache.org
> >>>   Operating system : SunOS(unknown)
> >>>   Java Home version :
> >>>           java version "1.5.0_12"
> >>>           Java(TM) 2 Runtime Environment, Standard Edition (build
> >>> 1.5.0_12-b04) Java HotSpot(TM) Server VM (build 1.5.0_12-b04, mixed
> >>> mode)
> >>>
> >>>   Builder version :
> >>>           Maven version: 2.0.7
> >>>           Java version: 1.5.0_12
> >>>           OS name: "sunos" version: "5.10" arch: "x86"
> >>>
> >>> ***********************************************************************
> >>>** *** SCM Changes:
> >>> ***********************************************************************
> >>>** *** Changed: no author @ no date
> >>> Comment: no comment
> >>> Files changed:
> >>>
> >>> 28/src/test/java/org/apache/maven/report/projectinfo/ProjectSummaryRepo
> >>>rt Test.java ( no revision )
> >>> 28/src/test/java/org/apache/maven/report/projectinfo/stubs/SubProject1S
> >>>tu b.java ( no revision )
> >>> 28/src/test/java/org/apache/maven/report/projectinfo/stubs/SubProject2S
> >>>tu b.java ( no revision )
> >>> 28/src/test/java/org/apache/maven/report/projectinfo/stubs/IndexStub.ja
> >>>va ( no revision )
> >>> 28/src/test/java/org/apache/maven/report/projectinfo/stubs/CimStub.java
> >>> ( no revision )
> >>> 28/src/test/java/org/apache/maven/report/projectinfo/stubs/ProjectInfoP
> >>>ro jectStub.java ( no revision )
> >>> 28/src/test/java/org/apache/maven/report/projectinfo/stubs/IssueTrackin
> >>>gS tub.java ( no revision )
> >>> 28/src/test/java/org/apache/maven/report/projectinfo/stubs/MailingListS
> >>>tu b.java ( no revision )
> >>> 28/src/test/java/org/apache/maven/report/projectinfo/stubs/ProjectTeamS
> >>>tu b.java ( no revision )
> >>> 28/src/test/java/org/apache/maven/report/projectinfo/stubs/ProjectInfoP
> >>>lu ginArtifactStub.java ( no revision )
> >>> 28/src/test/java/org/apache/maven/report/projectinfo/stubs/ScmStub.java
> >>> ( no revision )
> >>> 28/src/test/java/org/apache/maven/report/projectinfo/stubs/LicenseStub.
> >>>ja va ( no revision )
> >>> 28/src/test/java/org/apache/maven/report/projectinfo/stubs/Dependencies
> >>>St ub.java ( no revision )
> >>> 28/src/test/java/org/apache/maven/report/projectinfo/stubs/SummaryStub.
> >>>ja va ( no revision )
> >>> 28/src/test/java/org/apache/maven/report/projectinfo/stubs/DependencyCo
> >>>nv ergenceStub.java ( no revision )
> >>> 28/src/test/java/org/apache/maven/report/projectinfo/stubs/SettingsStub
> >>>.j ava ( no revision )
> >>> 28/src/test/java/org/apache/maven/report/projectinfo/stubs/DefaultArtif
> >>>ac tHandlerStub.java ( no revision )
> >>> 28/src/test/java/org/apache/maven/report/projectinfo/AbstractProjectInf
> >>>oT estCase.java ( no revision )
> >>> 28/src/test/java/org/apache/maven/report/projectinfo/DependenciesReport
> >>>Te st.java ( no revision )
> >>> 28/src/test/java/org/apache/maven/report/projectinfo/CimReportTest.java
> >>> ( no revision )
> >>> 28/src/test/java/org/apache/maven/report/projectinfo/IssueTrackingRepor
> >>>tT est.java ( no revision )
> >>> 28/src/test/java/org/apache/maven/report/projectinfo/ProjectIndexPageRe
> >>>po rtTest.java ( no revision )
> >>> 28/src/test/java/org/apache/maven/report/projectinfo/DependencyConverge
> >>>nc eReportTest.java ( no revision )
> >>> 28/src/test/java/org/apache/maven/report/projectinfo/MailingListsReport
> >>>Te st.java ( no revision )
> >>> 28/src/test/java/org/apache/maven/report/projectinfo/LicenseReportTest.
> >>>ja va ( no revision )
> >>> 28/src/test/java/org/apache/maven/report/projectinfo/ScmReportTest.java
> >>> ( no revision )
> >>> 28/src/test/java/org/apache/maven/report/projectinfo/TeamListReportTest
> >>>.j ava ( no revision )
> >>> 28/src/test/resources/plugin-configs/license-plugin-config.xml ( no
> >>> revision ) 28/src/test/resources/plugin-configs/scm-plugin-config.xml (
> >>> no revision ) 28/src/test/resources/plugin-configs/subproject1/pom.xml
> >>> ( no revision )
> >>> 28/src/test/resources/plugin-configs/subproject2/pom.xml ( no revision
> >>> )
> >>> 28/src/test/resources/plugin-configs/dependencies-plugin-config.xml (
> >>> no revision )
> >>> 28/src/test/resources/plugin-configs/index-plugin-config.xml ( no
> >>> revision ) 28/src/test/resources/plugin-configs/cim-plugin-config.xml (
> >>> no revision )
> >>> 28/src/test/resources/plugin-configs/issue-tracking-plugin-config.xml (
> >>> no revision )
> >>> 28/src/test/resources/plugin-configs/mailing-list-plugin-config.xml (
> >>> no revision )
> >>> 28/src/test/resources/plugin-configs/dependency-convergence-plugin-conf
> >>>ig .xml ( no revision )
> >>> 28/src/test/resources/plugin-configs/project-team-plugin-config.xml (
> >>> no revision )
> >>> 28/src/test/resources/plugin-configs/summary-plugin-config.xml ( no
> >>> revision )
> >>> 28/src/test/resources/org/apache/maven/report/projectinfo/AbstractProje
> >>>ct InfoTestCase.xml ( no revision )
> >>> 28/src/main/java/org/apache/maven/report/projectinfo/ProjectSummaryRepo
> >>>rt .java ( no revision )
> >>> 28/src/main/java/org/apache/maven/report/projectinfo/AbstractProjectInf
> >>>oR eport.java ( no revision )
> >>> 28/src/main/java/org/apache/maven/report/projectinfo/DependenciesReport
> >>>.j ava ( no revision )
> >>> 28/src/main/java/org/apache/maven/report/projectinfo/CimReport.java (
> >>> no revision )
> >>> 28/src/main/java/org/apache/maven/report/projectinfo/dependencies/Repos
> >>>it oryUtils.java ( no revision )
> >>> 28/src/main/java/org/apache/maven/report/projectinfo/dependencies/Depen
> >>>de ncies.java ( no revision )
> >>> 28/src/main/java/org/apache/maven/report/projectinfo/dependencies/rende
> >>>re r/DependenciesRenderer.java ( no revision )
> >>> 28/src/main/java/org/apache/maven/report/projectinfo/dependencies/Depen
> >>>de nciesReportConfiguration.java ( no revision )
> >>> 28/src/main/java/org/apache/maven/report/projectinfo/IssueTrackingRepor
> >>>t. java ( no revision )
> >>> 28/src/main/java/org/apache/maven/report/projectinfo/ProjectIndexPageRe
> >>>po rt.java ( no revision )
> >>> 28/src/main/java/org/apache/maven/report/projectinfo/DependencyConverge
> >>>nc eReport.java ( no revision )
> >>> 28/src/main/java/org/apache/maven/report/projectinfo/MailingListsReport
> >>>.j ava ( no revision )
> >>> 28/src/main/java/org/apache/maven/report/projectinfo/LicenseReport.java
> >>> ( no revision )
> >>> 28/src/main/java/org/apache/maven/report/projectinfo/ScmReport.java (
> >>> no revision )
> >>> 28/src/main/java/org/apache/maven/report/projectinfo/TeamListReport.jav
> >>>a ( no revision )
> >>> 28/src/main/resources/project-info-report_hu.properties ( no revision )
> >>> 28/src/main/resources/project-info-report_it.properties ( no revision )
> >>> 28/src/main/resources/project-info-report_no.properties ( no revision )
> >>> 28/src/main/resources/project-info-report_sk.properties ( no revision )
> >>> 28/src/main/resources/project-info-report.properties ( no revision )
> >>> 28/src/main/resources/project-info-report_zh_CN.properties ( no
> >>> revision ) 28/src/main/resources/project-info-report_cs.properties ( no
> >>> revision ) 28/src/main/resources/project-info-report_pt_BR.properties (
> >>> no revision ) 28/src/main/resources/project-info-report_es.properties (
> >>> no revision ) 28/src/main/resources/project-info-report_fr.properties (
> >>> no revision ) 28/src/main/resources/project-info-report_de.properties (
> >>> no revision ) 28/src/main/resources/project-info-report_ko.properties (
> >>> no revision ) 28/src/main/resources/project-info-report_nl.properties (
> >>> no revision ) 28/src/main/resources/project-info-report_ja.properties (
> >>> no revision ) 28/src/main/resources/project-info-report_pl.properties (
> >>> no revision ) 28/src/site/site.xml ( no revision )
> >>>   28/src/site/apt/usage.apt ( no revision )
> >>>   28/src/site/apt/index.apt ( no revision )
> >>>   28/src/site/apt/examples/selective-project-info-reports.apt ( no
> >>> revision ) 28/src/site/apt/examples/individual-reports.apt ( no
> >>> revision ) 28/src/site/apt/examples/scm-report.apt ( no revision )
> >>>   28/src/site/fml/faq.fml ( no revision )
> >>>   28/pom.xml ( no revision )
> >>>
> >>> ***********************************************************************
> >>>** *** SCM Changes since last success:
> >>> ***********************************************************************
> >>>** *** Changed: no author @ no date
> >>> Comment: no comment
> >>> Files changed:
> >>>
> >>> 28/src/test/java/org/apache/maven/report/projectinfo/ProjectSummaryRepo
> >>>rt Test.java ( no revision )
> >>> 28/src/test/java/org/apache/maven/report/projectinfo/stubs/SubProject1S
> >>>tu b.java ( no revision )
> >>> 28/src/test/java/org/apache/maven/report/projectinfo/stubs/SubProject2S
> >>>tu b.java ( no revision )
> >>> 28/src/test/java/org/apache/maven/report/projectinfo/stubs/IndexStub.ja
> >>>va ( no revision )
> >>> 28/src/test/java/org/apache/maven/report/projectinfo/stubs/CimStub.java
> >>> ( no revision )
> >>> 28/src/test/java/org/apache/maven/report/projectinfo/stubs/ProjectInfoP
> >>>ro jectStub.java ( no revision )
> >>> 28/src/test/java/org/apache/maven/report/projectinfo/stubs/IssueTrackin
> >>>gS tub.java ( no revision )
> >>> 28/src/test/java/org/apache/maven/report/projectinfo/stubs/MailingListS
> >>>tu b.java ( no revision )
> >>> 28/src/test/java/org/apache/maven/report/projectinfo/stubs/ProjectTeamS
> >>>tu b.java ( no revision )
> >>> 28/src/test/java/org/apache/maven/report/projectinfo/stubs/ProjectInfoP
> >>>lu ginArtifactStub.java ( no revision )
> >>> 28/src/test/java/org/apache/maven/report/projectinfo/stubs/ScmStub.java
> >>> ( no revision )
> >>> 28/src/test/java/org/apache/maven/report/projectinfo/stubs/LicenseStub.
> >>>ja va ( no revision )
> >>> 28/src/test/java/org/apache/maven/report/projectinfo/stubs/Dependencies
> >>>St ub.java ( no revision )
> >>> 28/src/test/java/org/apache/maven/report/projectinfo/stubs/SummaryStub.
> >>>ja va ( no revision )
> >>> 28/src/test/java/org/apache/maven/report/projectinfo/stubs/DependencyCo
> >>>nv ergenceStub.java ( no revision )
> >>> 28/src/test/java/org/apache/maven/report/projectinfo/stubs/SettingsStub
> >>>.j ava ( no revision )
> >>> 28/src/test/java/org/apache/maven/report/projectinfo/stubs/DefaultArtif
> >>>ac tHandlerStub.java ( no revision )
> >>> 28/src/test/java/org/apache/maven/report/projectinfo/AbstractProjectInf
> >>>oT estCase.java ( no revision )
> >>> 28/src/test/java/org/apache/maven/report/projectinfo/DependenciesReport
> >>>Te st.java ( no revision )
> >>> 28/src/test/java/org/apache/maven/report/projectinfo/CimReportTest.java
> >>> ( no revision )
> >>> 28/src/test/java/org/apache/maven/report/projectinfo/IssueTrackingRepor
> >>>tT est.java ( no revision )
> >>> 28/src/test/java/org/apache/maven/report/projectinfo/ProjectIndexPageRe
> >>>po rtTest.java ( no revision )
> >>> 28/src/test/java/org/apache/maven/report/projectinfo/DependencyConverge
> >>>nc eReportTest.java ( no revision )
> >>> 28/src/test/java/org/apache/maven/report/projectinfo/MailingListsReport
> >>>Te st.java ( no revision )
> >>> 28/src/test/java/org/apache/maven/report/projectinfo/LicenseReportTest.
> >>>ja va ( no revision )
> >>> 28/src/test/java/org/apache/maven/report/projectinfo/ScmReportTest.java
> >>> ( no revision )
> >>> 28/src/test/java/org/apache/maven/report/projectinfo/TeamListReportTest
> >>>.j ava ( no revision )
> >>> 28/src/test/resources/plugin-configs/license-plugin-config.xml ( no
> >>> revision ) 28/src/test/resources/plugin-configs/scm-plugin-config.xml (
> >>> no revision ) 28/src/test/resources/plugin-configs/subproject1/pom.xml
> >>> ( no revision )
> >>> 28/src/test/resources/plugin-configs/subproject2/pom.xml ( no revision
> >>> )
> >>> 28/src/test/resources/plugin-configs/dependencies-plugin-config.xml (
> >>> no revision )
> >>> 28/src/test/resources/plugin-configs/index-plugin-config.xml ( no
> >>> revision ) 28/src/test/resources/plugin-configs/cim-plugin-config.xml (
> >>> no revision )
> >>> 28/src/test/resources/plugin-configs/issue-tracking-plugin-config.xml (
> >>> no revision )
> >>> 28/src/test/resources/plugin-configs/mailing-list-plugin-config.xml (
> >>> no revision )
> >>> 28/src/test/resources/plugin-configs/dependency-convergence-plugin-conf
> >>>ig .xml ( no revision )
> >>> 28/src/test/resources/plugin-configs/project-team-plugin-config.xml (
> >>> no revision )
> >>> 28/src/test/resources/plugin-configs/summary-plugin-config.xml ( no
> >>> revision )
> >>> 28/src/test/resources/org/apache/maven/report/projectinfo/AbstractProje
> >>>ct InfoTestCase.xml ( no revision )
> >>> 28/src/main/java/org/apache/maven/report/projectinfo/ProjectSummaryRepo
> >>>rt .java ( no revision )
> >>> 28/src/main/java/org/apache/maven/report/projectinfo/AbstractProjectInf
> >>>oR eport.java ( no revision )
> >>> 28/src/main/java/org/apache/maven/report/projectinfo/DependenciesReport
> >>>.j ava ( no revision )
> >>> 28/src/main/java/org/apache/maven/report/projectinfo/CimReport.java (
> >>> no revision )
> >>> 28/src/main/java/org/apache/maven/report/projectinfo/dependencies/Repos
> >>>it oryUtils.java ( no revision )
> >>> 28/src/main/java/org/apache/maven/report/projectinfo/dependencies/Depen
> >>>de ncies.java ( no revision )
> >>> 28/src/main/java/org/apache/maven/report/projectinfo/dependencies/rende
> >>>re r/DependenciesRenderer.java ( no revision )
> >>> 28/src/main/java/org/apache/maven/report/projectinfo/dependencies/Depen
> >>>de nciesReportConfiguration.java ( no revision )
> >>> 28/src/main/java/org/apache/maven/report/projectinfo/IssueTrackingRepor
> >>>t. java ( no revision )
> >>> 28/src/main/java/org/apache/maven/report/projectinfo/ProjectIndexPageRe
> >>>po rt.java ( no revision )
> >>> 28/src/main/java/org/apache/maven/report/projectinfo/DependencyConverge
> >>>nc eReport.java ( no revision )
> >>> 28/src/main/java/org/apache/maven/report/projectinfo/MailingListsReport
> >>>.j ava ( no revision )
> >>> 28/src/main/java/org/apache/maven/report/projectinfo/LicenseReport.java
> >>> ( no revision )
> >>> 28/src/main/java/org/apache/maven/report/projectinfo/ScmReport.java (
> >>> no revision )
> >>> 28/src/main/java/org/apache/maven/report/projectinfo/TeamListReport.jav
> >>>a ( no revision )
> >>> 28/src/main/resources/project-info-report_hu.properties ( no revision )
> >>> 28/src/main/resources/project-info-report_it.properties ( no revision )
> >>> 28/src/main/resources/project-info-report_no.properties ( no revision )
> >>> 28/src/main/resources/project-info-report_sk.properties ( no revision )
> >>> 28/src/main/resources/project-info-report.properties ( no revision )
> >>> 28/src/main/resources/project-info-report_zh_CN.properties ( no
> >>> revision ) 28/src/main/resources/project-info-report_cs.properties ( no
> >>> revision ) 28/src/main/resources/project-info-report_pt_BR.properties (
> >>> no revision ) 28/src/main/resources/project-info-report_es.properties (
> >>> no revision ) 28/src/main/resources/project-info-report_fr.properties (
> >>> no revision ) 28/src/main/resources/project-info-report_de.properties (
> >>> no revision ) 28/src/main/resources/project-info-report_ko.properties (
> >>> no revision ) 28/src/main/resources/project-info-report_nl.properties (
> >>> no revision ) 28/src/main/resources/project-info-report_ja.properties (
> >>> no revision ) 28/src/main/resources/project-info-report_pl.properties (
> >>> no revision ) 28/src/site/site.xml ( no revision )
> >>>   28/src/site/apt/usage.apt ( no revision )
> >>>   28/src/site/apt/index.apt ( no revision )
> >>>   28/src/site/apt/examples/selective-project-info-reports.apt ( no
> >>> revision ) 28/src/site/apt/examples/individual-reports.apt ( no
> >>> revision ) 28/src/site/apt/examples/scm-report.apt ( no revision )
> >>>   28/src/site/fml/faq.fml ( no revision )
> >>>   28/pom.xml ( no revision )
> >>>
> >>> Changed: no author @ no date
> >>> Comment: no comment
> >>> Files changed:
> >>>
> >>> 28/src/test/java/org/apache/maven/report/projectinfo/ProjectSummaryRepo
> >>>rt Test.java ( no revision )
> >>> 28/src/test/java/org/apache/maven/report/projectinfo/stubs/SubProject1S
> >>>tu b.java ( no revision )
> >>> 28/src/test/java/org/apache/maven/report/projectinfo/stubs/SubProject2S
> >>>tu b.java ( no revision )
> >>> 28/src/test/java/org/apache/maven/report/projectinfo/stubs/IndexStub.ja
> >>>va ( no revision )
> >>> 28/src/test/java/org/apache/maven/report/projectinfo/stubs/CimStub.java
> >>> ( no revision )
> >>> 28/src/test/java/org/apache/maven/report/projectinfo/stubs/ProjectInfoP
> >>>ro jectStub.java ( no revision )
> >>> 28/src/test/java/org/apache/maven/report/projectinfo/stubs/IssueTrackin
> >>>gS tub.java ( no revision )
> >>> 28/src/test/java/org/apache/maven/report/projectinfo/stubs/MailingListS
> >>>tu b.java ( no revision )
> >>> 28/src/test/java/org/apache/maven/report/projectinfo/stubs/ProjectTeamS
> >>>tu b.java ( no revision )
> >>> 28/src/test/java/org/apache/maven/report/projectinfo/stubs/ProjectInfoP
> >>>lu ginArtifactStub.java ( no revision )
> >>> 28/src/test/java/org/apache/maven/report/projectinfo/stubs/ScmStub.java
> >>> ( no revision )
> >>> 28/src/test/java/org/apache/maven/report/projectinfo/stubs/LicenseStub.
> >>>ja va ( no revision )
> >>> 28/src/test/java/org/apache/maven/report/projectinfo/stubs/Dependencies
> >>>St ub.java ( no revision )
> >>> 28/src/test/java/org/apache/maven/report/projectinfo/stubs/SummaryStub.
> >>>ja va ( no revision )
> >>> 28/src/test/java/org/apache/maven/report/projectinfo/stubs/DependencyCo
> >>>nv ergenceStub.java ( no revision )
> >>> 28/src/test/java/org/apache/maven/report/projectinfo/stubs/SettingsStub
> >>>.j ava ( no revision )
> >>> 28/src/test/java/org/apache/maven/report/projectinfo/stubs/DefaultArtif
> >>>ac tHandlerStub.java ( no revision )
> >>> 28/src/test/java/org/apache/maven/report/projectinfo/AbstractProjectInf
> >>>oT estCase.java ( no revision )
> >>> 28/src/test/java/org/apache/maven/report/projectinfo/DependenciesReport
> >>>Te st.java ( no revision )
> >>> 28/src/test/java/org/apache/maven/report/projectinfo/CimReportTest.java
> >>> ( no revision )
> >>> 28/src/test/java/org/apache/maven/report/projectinfo/IssueTrackingRepor
> >>>tT est.java ( no revision )
> >>> 28/src/test/java/org/apache/maven/report/projectinfo/ProjectIndexPageRe
> >>>po rtTest.java ( no revision )
> >>> 28/src/test/java/org/apache/maven/report/projectinfo/DependencyConverge
> >>>nc eReportTest.java ( no revision )
> >>> 28/src/test/java/org/apache/maven/report/projectinfo/MailingListsReport
> >>>Te st.java ( no revision )
> >>> 28/src/test/java/org/apache/maven/report/projectinfo/LicenseReportTest.
> >>>ja va ( no revision )
> >>> 28/src/test/java/org/apache/maven/report/projectinfo/ScmReportTest.java
> >>> ( no revision )
> >>> 28/src/test/java/org/apache/maven/report/projectinfo/TeamListReportTest
> >>>.j ava ( no revision )
> >>> 28/src/test/resources/plugin-configs/license-plugin-config.xml ( no
> >>> revision ) 28/src/test/resources/plugin-configs/scm-plugin-config.xml (
> >>> no revision ) 28/src/test/resources/plugin-configs/subproject1/pom.xml
> >>> ( no revision )
> >>> 28/src/test/resources/plugin-configs/subproject2/pom.xml ( no revision
> >>> )
> >>> 28/src/test/resources/plugin-configs/dependencies-plugin-config.xml (
> >>> no revision )
> >>> 28/src/test/resources/plugin-configs/index-plugin-config.xml ( no
> >>> revision ) 28/src/test/resources/plugin-configs/cim-plugin-config.xml (
> >>> no revision )
> >>> 28/src/test/resources/plugin-configs/issue-tracking-plugin-config.xml (
> >>> no revision )
> >>> 28/src/test/resources/plugin-configs/mailing-list-plugin-config.xml (
> >>> no revision )
> >>> 28/src/test/resources/plugin-configs/dependency-convergence-plugin-conf
> >>>ig .xml ( no revision )
> >>> 28/src/test/resources/plugin-configs/project-team-plugin-config.xml (
> >>> no revision )
> >>> 28/src/test/resources/plugin-configs/summary-plugin-config.xml ( no
> >>> revision )
> >>> 28/src/test/resources/org/apache/maven/report/projectinfo/AbstractProje
> >>>ct InfoTestCase.xml ( no revision )
> >>> 28/src/main/java/org/apache/maven/report/projectinfo/ProjectSummaryRepo
> >>>rt .java ( no revision )
> >>> 28/src/main/java/org/apache/maven/report/projectinfo/AbstractProjectInf
> >>>oR eport.java ( no revision )
> >>> 28/src/main/java/org/apache/maven/report/projectinfo/DependenciesReport
> >>>.j ava ( no revision )
> >>> 28/src/main/java/org/apache/maven/report/projectinfo/CimReport.java (
> >>> no revision )
> >>> 28/src/main/java/org/apache/maven/report/projectinfo/dependencies/Repos
> >>>it oryUtils.java ( no revision )
> >>> 28/src/main/java/org/apache/maven/report/projectinfo/dependencies/Depen
> >>>de ncies.java ( no revision )
> >>> 28/src/main/java/org/apache/maven/report/projectinfo/dependencies/rende
> >>>re r/DependenciesRenderer.java ( no revision )
> >>> 28/src/main/java/org/apache/maven/report/projectinfo/dependencies/Depen
> >>>de nciesReportConfiguration.java ( no revision )
> >>> 28/src/main/java/org/apache/maven/report/projectinfo/IssueTrackingRepor
> >>>t. java ( no revision )
> >>> 28/src/main/java/org/apache/maven/report/projectinfo/ProjectIndexPageRe
> >>>po rt.java ( no revision )
> >>> 28/src/main/java/org/apache/maven/report/projectinfo/DependencyConverge
> >>>nc eReport.java ( no revision )
> >>> 28/src/main/java/org/apache/maven/report/projectinfo/MailingListsReport
> >>>.j ava ( no revision )
> >>> 28/src/main/java/org/apache/maven/report/projectinfo/LicenseReport.java
> >>> ( no revision )
> >>> 28/src/main/java/org/apache/maven/report/projectinfo/ScmReport.java (
> >>> no revision )
> >>> 28/src/main/java/org/apache/maven/report/projectinfo/TeamListReport.jav
> >>>a ( no revision )
> >>> 28/src/main/resources/project-info-report_hu.properties ( no revision )
> >>> 28/src/main/resources/project-info-report_it.properties ( no revision )
> >>> 28/src/main/resources/project-info-report_no.properties ( no revision )
> >>> 28/src/main/resources/project-info-report_sk.properties ( no revision )
> >>> 28/src/main/resources/project-info-report.properties ( no revision )
> >>> 28/src/main/resources/project-info-report_zh_CN.properties ( no
> >>> revision ) 28/src/main/resources/project-info-report_cs.properties ( no
> >>> revision ) 28/src/main/resources/project-info-report_pt_BR.properties (
> >>> no revision ) 28/src/main/resources/project-info-report_es.properties (
> >>> no revision ) 28/src/main/resources/project-info-report_fr.properties (
> >>> no revision ) 28/src/main/resources/project-info-report_de.properties (
> >>> no revision ) 28/src/main/resources/project-info-report_ko.properties (
> >>> no revision ) 28/src/main/resources/project-info-report_nl.properties (
> >>> no revision ) 28/src/main/resources/project-info-report_ja.properties (
> >>> no revision ) 28/src/main/resources/project-info-report_pl.properties (
> >>> no revision ) 28/src/site/site.xml ( no revision )
> >>>   28/src/site/apt/usage.apt ( no revision )
> >>>   28/src/site/apt/index.apt ( no revision )
> >>>   28/src/site/apt/examples/selective-project-info-reports.apt ( no
> >>> revision ) 28/src/site/apt/examples/individual-reports.apt ( no
> >>> revision ) 28/src/site/apt/examples/scm-report.apt ( no revision )
> >>>   28/src/site/fml/faq.fml ( no revision )
> >>>   28/pom.xml ( no revision )
> >>>
> >>> Changed: no author @ no date
> >>> Comment: no comment
> >>> Files changed:
> >>>
> >>> 28/src/test/java/org/apache/maven/report/projectinfo/ProjectSummaryRepo
> >>>rt Test.java ( no revision )
> >>> 28/src/test/java/org/apache/maven/report/projectinfo/stubs/SubProject1S
> >>>tu b.java ( no revision )
> >>> 28/src/test/java/org/apache/maven/report/projectinfo/stubs/SubProject2S
> >>>tu b.java ( no revision )
> >>> 28/src/test/java/org/apache/maven/report/projectinfo/stubs/IndexStub.ja
> >>>va ( no revision )
> >>> 28/src/test/java/org/apache/maven/report/projectinfo/stubs/CimStub.java
> >>> ( no revision )
> >>> 28/src/test/java/org/apache/maven/report/projectinfo/stubs/ProjectInfoP
> >>>ro jectStub.java ( no revision )
> >>> 28/src/test/java/org/apache/maven/report/projectinfo/stubs/IssueTrackin
> >>>gS tub.java ( no revision )
> >>> 28/src/test/java/org/apache/maven/report/projectinfo/stubs/MailingListS
> >>>tu b.java ( no revision )
> >>> 28/src/test/java/org/apache/maven/report/projectinfo/stubs/ProjectTeamS
> >>>tu b.java ( no revision )
> >>> 28/src/test/java/org/apache/maven/report/projectinfo/stubs/ProjectInfoP
> >>>lu ginArtifactStub.java ( no revision )
> >>> 28/src/test/java/org/apache/maven/report/projectinfo/stubs/ScmStub.java
> >>> ( no revision )
> >>> 28/src/test/java/org/apache/maven/report/projectinfo/stubs/LicenseStub.
> >>>ja va ( no revision )
> >>> 28/src/test/java/org/apache/maven/report/projectinfo/stubs/Dependencies
> >>>St ub.java ( no revision )
> >>> 28/src/test/java/org/apache/maven/report/projectinfo/stubs/SummaryStub.
> >>>ja va ( no revision )
> >>> 28/src/test/java/org/apache/maven/report/projectinfo/stubs/DependencyCo
> >>>nv ergenceStub.java ( no revision )
> >>> 28/src/test/java/org/apache/maven/report/projectinfo/stubs/SettingsStub
> >>>.j ava ( no revision )
> >>> 28/src/test/java/org/apache/maven/report/projectinfo/stubs/DefaultArtif
> >>>ac tHandlerStub.java ( no revision )
> >>> 28/src/test/java/org/apache/maven/report/projectinfo/AbstractProjectInf
> >>>oT estCase.java ( no revision )
> >>> 28/src/test/java/org/apache/maven/report/projectinfo/DependenciesReport
> >>>Te st.java ( no revision )
> >>> 28/src/test/java/org/apache/maven/report/projectinfo/CimReportTest.java
> >>> ( no revision )
> >>> 28/src/test/java/org/apache/maven/report/projectinfo/IssueTrackingRepor
> >>>tT est.java ( no revision )
> >>> 28/src/test/java/org/apache/maven/report/projectinfo/ProjectIndexPageRe
> >>>po rtTest.java ( no revision )
> >>> 28/src/test/java/org/apache/maven/report/projectinfo/DependencyConverge
> >>>nc eReportTest.java ( no revision )
> >>> 28/src/test/java/org/apache/maven/report/projectinfo/MailingListsReport
> >>>Te st.java ( no revision )
> >>> 28/src/test/java/org/apache/maven/report/projectinfo/LicenseReportTest.
> >>>ja va ( no revision )
> >>> 28/src/test/java/org/apache/maven/report/projectinfo/ScmReportTest.java
> >>> ( no revision )
> >>> 28/src/test/java/org/apache/maven/report/projectinfo/TeamListReportTest
> >>>.j ava ( no revision )
> >>> 28/src/test/resources/plugin-configs/license-plugin-config.xml ( no
> >>> revision ) 28/src/test/resources/plugin-configs/scm-plugin-config.xml (
> >>> no revision ) 28/src/test/resources/plugin-configs/subproject1/pom.xml
> >>> ( no revision )
> >>> 28/src/test/resources/plugin-configs/subproject2/pom.xml ( no revision
> >>> )
> >>> 28/src/test/resources/plugin-configs/dependencies-plugin-config.xml (
> >>> no revision )
> >>> 28/src/test/resources/plugin-configs/index-plugin-config.xml ( no
> >>> revision ) 28/src/test/resources/plugin-configs/cim-plugin-config.xml (
> >>> no revision )
> >>> 28/src/test/resources/plugin-configs/issue-tracking-plugin-config.xml (
> >>> no revision )
> >>> 28/src/test/resources/plugin-configs/mailing-list-plugin-config.xml (
> >>> no revision )
> >>> 28/src/test/resources/plugin-configs/dependency-convergence-plugin-conf
> >>>ig .xml ( no revision )
> >>> 28/src/test/resources/plugin-configs/project-team-plugin-config.xml (
> >>> no revision )
> >>> 28/src/test/resources/plugin-configs/summary-plugin-config.xml ( no
> >>> revision )
> >>> 28/src/test/resources/org/apache/maven/report/projectinfo/AbstractProje
> >>>ct InfoTestCase.xml ( no revision )
> >>> 28/src/main/java/org/apache/maven/report/projectinfo/ProjectSummaryRepo
> >>>rt .java ( no revision )
> >>> 28/src/main/java/org/apache/maven/report/projectinfo/AbstractProjectInf
> >>>oR eport.java ( no revision )
> >>> 28/src/main/java/org/apache/maven/report/projectinfo/DependenciesReport
> >>>.j ava ( no revision )
> >>> 28/src/main/java/org/apache/maven/report/projectinfo/CimReport.java (
> >>> no revision )
> >>> 28/src/main/java/org/apache/maven/report/projectinfo/dependencies/Repos
> >>>it oryUtils.java ( no revision )
> >>> 28/src/main/java/org/apache/maven/report/projectinfo/dependencies/Depen
> >>>de ncies.java ( no revision )
> >>> 28/src/main/java/org/apache/maven/report/projectinfo/dependencies/rende
> >>>re r/DependenciesRenderer.java ( no revision )
> >>> 28/src/main/java/org/apache/maven/report/projectinfo/dependencies/Depen
> >>>de nciesReportConfiguration.java ( no revision )
> >>> 28/src/main/java/org/apache/maven/report/projectinfo/IssueTrackingRepor
> >>>t. java ( no revision )
> >>> 28/src/main/java/org/apache/maven/report/projectinfo/ProjectIndexPageRe
> >>>po rt.java ( no revision )
> >>> 28/src/main/java/org/apache/maven/report/projectinfo/DependencyConverge
> >>>nc eReport.java ( no revision )
> >>> 28/src/main/java/org/apache/maven/report/projectinfo/MailingListsReport
> >>>.j ava ( no revision )
> >>> 28/src/main/java/org/apache/maven/report/projectinfo/LicenseReport.java
> >>> ( no revision )
> >>> 28/src/main/java/org/apache/maven/report/projectinfo/ScmReport.java (
> >>> no revision )
> >>> 28/src/main/java/org/apache/maven/report/projectinfo/TeamListReport.jav
> >>>a ( no revision )
> >>> 28/src/main/resources/project-info-report_hu.properties ( no revision )
> >>> 28/src/main/resources/project-info-report_it.properties ( no revision )
> >>> 28/src/main/resources/project-info-report_no.properties ( no revision )
> >>> 28/src/main/resources/project-info-report_sk.properties ( no revision )
> >>> 28/src/main/resources/project-info-report.properties ( no revision )
> >>> 28/src/main/resources/project-info-report_zh_CN.properties ( no
> >>> revision ) 28/src/main/resources/project-info-report_cs.properties ( no
> >>> revision ) 28/src/main/resources/project-info-report_pt_BR.properties (
> >>> no revision ) 28/src/main/resources/project-info-report_es.properties (
> >>> no revision ) 28/src/main/resources/project-info-report_fr.properties (
> >>> no revision ) 28/src/main/resources/project-info-report_de.properties (
> >>> no revision ) 28/src/main/resources/project-info-report_ko.properties (
> >>> no revision ) 28/src/main/resources/project-info-report_nl.properties (
> >>> no revision ) 28/src/main/resources/project-info-report_ja.properties (
> >>> no revision ) 28/src/main/resources/project-info-report_pl.properties (
> >>> no revision ) 28/src/site/site.xml ( no revision )
> >>>   28/src/site/apt/usage.apt ( no revision )
> >>>   28/src/site/apt/index.apt ( no revision )
> >>>   28/src/site/apt/examples/selective-project-info-reports.apt ( no
> >>> revision ) 28/src/site/apt/examples/individual-reports.apt ( no
> >>> revision ) 28/src/site/apt/examples/scm-report.apt ( no revision )
> >>>   28/src/site/fml/faq.fml ( no revision )
> >>>   28/pom.xml ( no revision )
> >>>
> >>> Changed: no author @ no date
> >>> Comment: no comment
> >>> Files changed:
> >>>   src/main/resources/project-info-report_cs.properties ( no revision )
> >>>
> >>> ***********************************************************************
> >>>** *** Dependencies Changes:
> >>> ***********************************************************************
> >>>** *** No dependencies changed
> >>>
> >>> ***********************************************************************
> >>>** *** Test Summary:
> >>> ***********************************************************************
> >>>** *** Tests: 11
> >>> Failures: 11
> >>> Total time: 11585
> >>>
> >>> ***********************************************************************
> >>>** *** Output:
> >>> ***********************************************************************
> >>>** *** [INFO] Scanning for projects...
> >>> [INFO]
> >>> -----------------------------------------------------------------------
> >>>-- --- [INFO] Building Maven Project Info Reports Plugin
> >>> [INFO]    task-segment: [clean, install]
> >>> [INFO]
> >>> -----------------------------------------------------------------------
> >>>-- --- [INFO] [clean:clean]
> >>> [INFO] [plugin:descriptor]
> >>> [INFO] Using 2 extractors.
> >>> [INFO] Applying extractor for language: java
> >>> [INFO] Extractor for language: java found 10 mojo descriptors.
> >>> [INFO] Applying extractor for language: bsh
> >>> [INFO] Extractor for language: bsh found 0 mojo descriptors.
> >>> [INFO] [resources:resources]
> >>> [INFO] Using default encoding to copy filtered resources.
> >>> [INFO] Copying 15 resources
> >>> [INFO] [compiler:compile]
> >>> [INFO] Compiling 15 source files to
> >>> /export/home/build/data/continuum/checkouts/28/target/classes [INFO]
> >>> [resources:testResources]
> >>> [INFO] Using default encoding to copy filtered resources.
> >>> [INFO] Copying 13 resources
> >>> [INFO] [compiler:testCompile]
> >>> [INFO] Compiling 27 source files to
> >>> /export/home/build/data/continuum/checkouts/28/target/test-classes
> >>> [INFO] [surefire:test]
> >>> [INFO] Surefire report directory:
> >>> /export/home/build/data/continuum/checkouts/28/target/surefire-reports
> >>>
> >>> -------------------------------------------------------
> >>>  T E S T S
> >>> -------------------------------------------------------
> >>> Running org.apache.maven.report.projectinfo.DependenciesReportTest
> >>> [INFO] Setting property: classpath.resource.loader.class =>
> >>> 'org.codehaus.plexus.velocity.ContextClassLoaderResourceLoader'. [INFO]
> >>> Setting property: velocimacro.messages.on => 'false'.
> >>> [INFO] Setting property: resource.loader => 'classpath'.
> >>> [INFO] Setting property: resource.manager.logwhenfound => 'false'.
> >>> -----------------------------------------------------
> >>> this realm = plexus.core
> >>> Number of imports: 0
> >>> -----------------------------------------------------
> >>> Tests run: 1, Failures: 0, Errors: 1, Skipped: 0, Time elapsed: 1.434
> >>> sec <<< FAILURE! Running
> >>> org.apache.maven.report.projectinfo.MailingListsReportTest [INFO]
> >>> Setting property: classpath.resource.loader.class =>
> >>> 'org.codehaus.plexus.velocity.ContextClassLoaderResourceLoader'. [INFO]
> >>> Setting property: velocimacro.messages.on => 'false'.
> >>> [INFO] Setting property: resource.loader => 'classpath'.
> >>> [INFO] Setting property: resource.manager.logwhenfound => 'false'.
> >>> [INFO] artifact org.apache.maven.skins:maven-default-skin: checking for
> >>> updates from central [ERROR] VM #displayTree: error : too few arguments
> >>> to macro. Wanted 2 got 0 [ERROR] VM #menuItem: error : too few
> >>> arguments to macro. Wanted 1 got 0
> >>> -----------------------------------------------------
> >>> this realm = plexus.core
> >>> Number of imports: 0
> >>> -----------------------------------------------------
> >>> [INFO] Setting property: classpath.resource.loader.class =>
> >>> 'org.codehaus.plexus.velocity.ContextClassLoaderResourceLoader'. [INFO]
> >>> Setting property: velocimacro.messages.on => 'false'.
> >>> [INFO] Setting property: resource.loader => 'classpath'.
> >>> [INFO] Setting property: resource.manager.logwhenfound => 'false'.
> >>> [INFO] artifact org.apache.maven.skins:maven-default-skin: checking for
> >>> updates from central [ERROR] VM #displayTree: error : too few arguments
> >>> to macro. Wanted 2 got 0 [ERROR] VM #menuItem: error : too few
> >>> arguments to macro. Wanted 1 got 0
> >>> -----------------------------------------------------
> >>> this realm = plexus.core
> >>> Number of imports: 0
> >>> -----------------------------------------------------
> >>> Tests run: 2, Failures: 0, Errors: 2, Skipped: 0, Time elapsed: 2.254
> >>> sec <<< FAILURE! Running
> >>> org.apache.maven.report.projectinfo.TeamListReportTest
> >>> [INFO] Setting property: classpath.resource.loader.class =>
> >>> 'org.codehaus.plexus.velocity.ContextClassLoaderResourceLoader'. [INFO]
> >>> Setting property: velocimacro.messages.on => 'false'.
> >>> [INFO] Setting property: resource.loader => 'classpath'.
> >>> [INFO] Setting property: resource.manager.logwhenfound => 'false'.
> >>> [INFO] artifact org.apache.maven.skins:maven-default-skin: checking for
> >>> updates from central [ERROR] VM #displayTree: error : too few arguments
> >>> to macro. Wanted 2 got 0 [ERROR] VM #menuItem: error : too few
> >>> arguments to macro. Wanted 1 got 0
> >>> -----------------------------------------------------
> >>> this realm = plexus.core
> >>> Number of imports: 0
> >>> -----------------------------------------------------
> >>> Tests run: 1, Failures: 0, Errors: 1, Skipped: 0, Time elapsed: 0.633
> >>> sec <<< FAILURE! Running
> >>> org.apache.maven.report.projectinfo.ProjectIndexPageReportTest [INFO]
> >>> Setting property: classpath.resource.loader.class =>
> >>> 'org.codehaus.plexus.velocity.ContextClassLoaderResourceLoader'. [INFO]
> >>> Setting property: velocimacro.messages.on => 'false'.
> >>> [INFO] Setting property: resource.loader => 'classpath'.
> >>> [INFO] Setting property: resource.manager.logwhenfound => 'false'.
> >>> [INFO] artifact org.apache.maven.skins:maven-default-skin: checking for
> >>> updates from central [ERROR] VM #displayTree: error : too few arguments
> >>> to macro. Wanted 2 got 0 [ERROR] VM #menuItem: error : too few
> >>> arguments to macro. Wanted 1 got 0
> >>> -----------------------------------------------------
> >>> this realm = plexus.core
> >>> Number of imports: 0
> >>> -----------------------------------------------------
> >>> Tests run: 1, Failures: 0, Errors: 1, Skipped: 0, Time elapsed: 0.762
> >>> sec <<< FAILURE! Running
> >>> org.apache.maven.report.projectinfo.ProjectSummaryReportTest [INFO]
> >>> Setting property: classpath.resource.loader.class =>
> >>> 'org.codehaus.plexus.velocity.ContextClassLoaderResourceLoader'. [INFO]
> >>> Setting property: velocimacro.messages.on => 'false'.
> >>> [INFO] Setting property: resource.loader => 'classpath'.
> >>> [INFO] Setting property: resource.manager.logwhenfound => 'false'.
> >>> [INFO] artifact org.apache.maven.skins:maven-default-skin: checking for
> >>> updates from central [ERROR] VM #displayTree: error : too few arguments
> >>> to macro. Wanted 2 got 0 [ERROR] VM #menuItem: error : too few
> >>> arguments to macro. Wanted 1 got 0
> >>> -----------------------------------------------------
> >>> this realm = plexus.core
> >>> Number of imports: 0
> >>> -----------------------------------------------------
> >>> Tests run: 1, Failures: 0, Errors: 1, Skipped: 0, Time elapsed: 0.434
> >>> sec <<< FAILURE! Running
> >>> org.apache.maven.report.projectinfo.IssueTrackingReportTest [INFO]
> >>> Setting property: classpath.resource.loader.class =>
> >>> 'org.codehaus.plexus.velocity.ContextClassLoaderResourceLoader'. [INFO]
> >>> Setting property: velocimacro.messages.on => 'false'.
> >>> [INFO] Setting property: resource.loader => 'classpath'.
> >>> [INFO] Setting property: resource.manager.logwhenfound => 'false'.
> >>> [INFO] artifact org.apache.maven.skins:maven-default-skin: checking for
> >>> updates from central [ERROR] VM #displayTree: error : too few arguments
> >>> to macro. Wanted 2 got 0 [ERROR] VM #menuItem: error : too few
> >>> arguments to macro. Wanted 1 got 0
> >>> -----------------------------------------------------
> >>> this realm = plexus.core
> >>> Number of imports: 0
> >>> -----------------------------------------------------
> >>> Tests run: 1, Failures: 0, Errors: 1, Skipped: 0, Time elapsed: 0.402
> >>> sec <<< FAILURE! Running
> >>> org.apache.maven.report.projectinfo.ScmReportTest [INFO] Setting
> >>> property: classpath.resource.loader.class =>
> >>> 'org.codehaus.plexus.velocity.ContextClassLoaderResourceLoader'. [INFO]
> >>> Setting property: velocimacro.messages.on => 'false'.
> >>> [INFO] Setting property: resource.loader => 'classpath'.
> >>> [INFO] Setting property: resource.manager.logwhenfound => 'false'.
> >>> [INFO] artifact org.apache.maven.skins:maven-default-skin: checking for
> >>> updates from central [ERROR] VM #displayTree: error : too few arguments
> >>> to macro. Wanted 2 got 0 [ERROR] VM #menuItem: error : too few
> >>> arguments to macro. Wanted 1 got 0
> >>> -----------------------------------------------------
> >>> this realm = plexus.core
> >>> Number of imports: 0
> >>> -----------------------------------------------------
> >>> Tests run: 1, Failures: 0, Errors: 1, Skipped: 0, Time elapsed: 0.61
> >>> sec <<< FAILURE! Running
> >>> org.apache.maven.report.projectinfo.LicenseReportTest
> >>> [INFO] Setting property: classpath.resource.loader.class =>
> >>> 'org.codehaus.plexus.velocity.ContextClassLoaderResourceLoader'. [INFO]
> >>> Setting property: velocimacro.messages.on => 'false'.
> >>> [INFO] Setting property: resource.loader => 'classpath'.
> >>> [INFO] Setting property: resource.manager.logwhenfound => 'false'.
> >>> [INFO] artifact org.apache.maven.skins:maven-default-skin: checking for
> >>> updates from central [ERROR] VM #displayTree: error : too few arguments
> >>> to macro. Wanted 2 got 0 [ERROR] VM #menuItem: error : too few
> >>> arguments to macro. Wanted 1 got 0
> >>> -----------------------------------------------------
> >>> this realm = plexus.core
> >>> Number of imports: 0
> >>> -----------------------------------------------------
> >>> Tests run: 1, Failures: 0, Errors: 1, Skipped: 0, Time elapsed: 0.367
> >>> sec <<< FAILURE! Running
> >>> org.apache.maven.report.projectinfo.CimReportTest [INFO] Setting
> >>> property: classpath.resource.loader.class =>
> >>> 'org.codehaus.plexus.velocity.ContextClassLoaderResourceLoader'. [INFO]
> >>> Setting property: velocimacro.messages.on => 'false'.
> >>> [INFO] Setting property: resource.loader => 'classpath'.
> >>> [INFO] Setting property: resource.manager.logwhenfound => 'false'.
> >>> [INFO] artifact org.apache.maven.skins:maven-default-skin: checking for
> >>> updates from central [ERROR] VM #displayTree: error : too few arguments
> >>> to macro. Wanted 2 got 0 [ERROR] VM #menuItem: error : too few
> >>> arguments to macro. Wanted 1 got 0
> >>> -----------------------------------------------------
> >>> this realm = plexus.core
> >>> Number of imports: 0
> >>> -----------------------------------------------------
> >>> Tests run: 1, Failures: 0, Errors: 1, Skipped: 0, Time elapsed: 0.344
> >>> sec <<< FAILURE! Running
> >>> org.apache.maven.report.projectinfo.DependencyConvergenceReportTest
> >>> [INFO] Setting property: classpath.resource.loader.class =>
> >>> 'org.codehaus.plexus.velocity.ContextClassLoaderResourceLoader'. [INFO]
> >>> Setting property: velocimacro.messages.on => 'false'.
> >>> [INFO] Setting property: resource.loader => 'classpath'.
> >>> [INFO] Setting property: resource.manager.logwhenfound => 'false'.
> >>> [INFO] artifact org.apache.maven.skins:maven-default-skin: checking for
> >>> updates from central Java Accessibility Bridge for GNOME loaded.
> >>>
> >>> [ERROR] VM #displayTree: error : too few arguments to macro. Wanted 2
> >>> got 0 [ERROR] VM #menuItem: error : too few arguments to macro. Wanted
> >>> 1 got 0 -----------------------------------------------------
> >>> this realm = plexus.core
> >>> Number of imports: 0
> >>> -----------------------------------------------------
> >>> Tests run: 1, Failures: 0, Errors: 1, Skipped: 0, Time elapsed: 4.448
> >>> sec <<< FAILURE!
> >>>
> >>> Results :
> >>>
> >>> Tests in error:
> >>>  
> >>> testReport(org.apache.maven.report.projectinfo.DependenciesReportTest)
> >>> testReport(org.apache.maven.report.projectinfo.MailingListsReportTest)
> >>>
> >>> testFrenchReport(org.apache.maven.report.projectinfo.MailingListsReport
> >>>Te st)
> >>> testReport(org.apache.maven.report.projectinfo.TeamListReportTest)
> >>> testReport(org.apache.maven.report.projectinfo.ProjectIndexPageReportTe
> >>>st )
> >>> testReport(org.apache.maven.report.projectinfo.ProjectSummaryReportTest
> >>>)
> >>> testReport(org.apache.maven.report.projectinfo.IssueTrackingReportTest)
> >>> testReport(org.apache.maven.report.projectinfo.ScmReportTest)
> >>>   testReport(org.apache.maven.report.projectinfo.LicenseReportTest)
> >>>   testReport(org.apache.maven.report.projectinfo.CimReportTest)
> >>>
> >>> testReport(org.apache.maven.report.projectinfo.DependencyConvergenceRep
> >>>or tTest)
> >>>
> >>> Tests run: 11, Failures: 0, Errors: 11, Skipped: 0
> >>>
> >>> [INFO]
> >>> -----------------------------------------------------------------------
> >>>- [ERROR] BUILD FAILURE
> >>> [INFO]
> >>> -----------------------------------------------------------------------
> >>>- [INFO] There are test failures.
> >>>
> >>> Please refer to
> >>> /export/home/build/data/continuum/checkouts/28/target/surefire-reports
> >>> for the individual test results. [INFO]
> >>> -----------------------------------------------------------------------
> >>>- [INFO] For more information, run Maven with the -e switch
> >>> [INFO]
> >>> -----------------------------------------------------------------------
> >>>- [INFO] Total time: 34 seconds
> >>> [INFO] Finished at: Wed Aug 22 19:46:29 GMT+00:00 2007
> >>> [INFO] Final Memory: 13M/333M
> >>> [INFO]
> >>> -----------------------------------------------------------------------
> >>>-
> >>>
> >>> ***********************************************************************
> >>>** ***
> >>
> >> ---------------------------------------------------------------------
> >> To unsubscribe, e-mail: dev-unsubscribe@maven.apache.org
> >> For additional commands, e-mail: dev-help@maven.apache.org
> >
> > ---------------------------------------------------------------------
> > To unsubscribe, e-mail: dev-unsubscribe@maven.apache.org
> > For additional commands, e-mail: dev-help@maven.apache.org



---------------------------------------------------------------------
To unsubscribe, e-mail: dev-unsubscribe@maven.apache.org
For additional commands, e-mail: dev-help@maven.apache.org


Mime
View raw message