maven-dev mailing list archives

Site index · List index
Message view « Date » · « Thread »
Top « Date » · « Thread »
From Dennis Lundberg <denn...@apache.org>
Subject Re: [vote] [m1] release xdoc-plugin-1.10
Date Mon, 12 Jun 2006 22:10:50 GMT
Looks like it could be jelly related as well.


BUILD FAILED
org.apache.velocity.exception.MethodInvocationException: Invocation of 
method 'anonymousAccessCVS' in  class org.apache.maven.xdoc.util.ScmUtil 
threw except
ion class java.lang.NoClassDefFoundError : 
org/codehaus/plexus/util/StringUtils
         at 
org.apache.velocity.runtime.parser.node.ASTMethod.execute(ASTMethod.java:246)
         at 
org.apache.velocity.runtime.parser.node.ASTReference.execute(ASTReference.java:175)
         at 
org.apache.velocity.runtime.parser.node.ASTReference.value(ASTReference.java:327)
         at 
org.apache.velocity.runtime.parser.node.ASTExpression.value(ASTExpression.java:51)
         at 
org.apache.velocity.runtime.parser.node.ASTSetDirective.render(ASTSetDirective.java:95)
         at 
org.apache.velocity.runtime.parser.node.ASTBlock.render(ASTBlock.java:55)
         at 
org.apache.velocity.runtime.parser.node.ASTIfStatement.render(ASTIfStatement.java:70)
         at 
org.apache.velocity.runtime.parser.node.SimpleNode.render(SimpleNode.java:230)
         at 
org.apache.velocity.runtime.directive.Parse.render(Parse.java:181)
         at 
org.apache.velocity.runtime.parser.node.ASTDirective.render(ASTDirective.java:114)
         at 
org.apache.velocity.runtime.parser.node.ASTBlock.render(ASTBlock.java:55)
         at 
org.apache.velocity.runtime.parser.node.SimpleNode.render(SimpleNode.java:230)
         at 
org.apache.velocity.runtime.parser.node.ASTIfStatement.render(ASTIfStatement.java:89)
         at 
org.apache.velocity.runtime.parser.node.SimpleNode.render(SimpleNode.java:230)
         at org.apache.velocity.Template.merge(Template.java:256)
         at 
org.apache.velocity.app.VelocityEngine.mergeTemplate(VelocityEngine.java:450)
         at 
org.apache.commons.jelly.tags.velocity.MergeTag.mergeTemplate(MergeTag.java:226)
         at 
org.apache.commons.jelly.tags.velocity.MergeTag.doTag(MergeTag.java:108)
         at org.apache.commons.jelly.impl.TagScript.run(TagScript.java:279)
         at 
org.apache.commons.jelly.impl.ScriptBlock.run(ScriptBlock.java:135)
         at 
org.apache.commons.jelly.TagSupport.invokeBody(TagSupport.java:233)
         at 
org.apache.commons.jelly.tags.core.WhenTag.doTag(WhenTag.java:92)
         at org.apache.commons.jelly.impl.TagScript.run(TagScript.java:279)
         at 
org.apache.commons.jelly.impl.ScriptBlock.run(ScriptBlock.java:135)
         at 
org.apache.commons.jelly.TagSupport.invokeBody(TagSupport.java:233)
         at 
org.apache.commons.jelly.tags.core.ChooseTag.doTag(ChooseTag.java:84)
         at org.apache.commons.jelly.impl.TagScript.run(TagScript.java:279)
         at 
org.apache.commons.jelly.impl.ScriptBlock.run(ScriptBlock.java:135)
         at 
org.apache.commons.jelly.TagSupport.invokeBody(TagSupport.java:233)
         at 
org.apache.commons.jelly.tags.core.ForEachTag.doTag(ForEachTag.java:145)
         at org.apache.commons.jelly.impl.TagScript.run(TagScript.java:279)
         at 
org.apache.commons.jelly.impl.ScriptBlock.run(ScriptBlock.java:135)
         at 
org.apache.maven.jelly.tags.werkz.MavenGoalTag.runBodyTag(MavenGoalTag.java:79)
         at 
org.apache.maven.jelly.tags.werkz.MavenGoalTag$MavenGoalAction.performAction(MavenGoalTag.java:110)
         at com.werken.werkz.Goal.fire(Goal.java:639)
         at com.werken.werkz.Goal.attain(Goal.java:575)
         at com.werken.werkz.Goal.attainPrecursors(Goal.java:488)
         at com.werken.werkz.Goal.attain(Goal.java:573)
         at com.werken.werkz.WerkzProject.attainGoal(WerkzProject.java:193)
         at 
org.apache.maven.jelly.tags.werkz.MavenAttainGoalTag.doTag(MavenAttainGoalTag.java:127)
         at org.apache.commons.jelly.impl.TagScript.run(TagScript.java:279)
         at 
org.apache.commons.jelly.impl.ScriptBlock.run(ScriptBlock.java:135)
         at 
org.apache.maven.jelly.tags.werkz.MavenGoalTag.runBodyTag(MavenGoalTag.java:79)
         at 
org.apache.maven.jelly.tags.werkz.MavenGoalTag$MavenGoalAction.performAction(MavenGoalTag.java:110)
         at com.werken.werkz.Goal.fire(Goal.java:639)
         at com.werken.werkz.Goal.attain(Goal.java:575)
         at 
org.apache.maven.plugin.PluginManager.attainGoals(PluginManager.java:671)
         at org.apache.maven.MavenSession.attainGoals(MavenSession.java:263)
         at org.apache.maven.cli.App.doMain(App.java:488)
         at org.apache.maven.cli.App.main(App.java:1239)
         at sun.reflect.NativeMethodAccessorImpl.invoke0(Native Method)
         at 
sun.reflect.NativeMethodAccessorImpl.invoke(NativeMethodAccessorImpl.java:39)
         at 
sun.reflect.DelegatingMethodAccessorImpl.invoke(DelegatingMethodAccessorImpl.java:25)
         at java.lang.reflect.Method.invoke(Method.java:324)
         at com.werken.forehead.Forehead.run(Forehead.java:551)
         at com.werken.forehead.Forehead.main(Forehead.java:581)
File...... C:\Documents and 
Settings\dlg01\.maven\cache\maven-xdoc-plugin-1.10-SNAPSHOT\plugin.jelly
Element... velocity:merge
Line...... 728
Column.... 13
Invocation of method 'anonymousAccessCVS' in  class 
org.apache.maven.xdoc.util.ScmUtil threw exception class 
java.lang.NoClassDefFoundError : org/codehaus/plexus/util/StringUtils
Total time: 30 seconds
Finished at: Tue Jun 13 00:08:45 CEST 2006


Lukas Theussl wrote:
> I cannot reproduce this one, neither with m1.0.2 nor m11b3. I'd be 
> surprised, too, as the xdoc-plugin doesn't use plexus. Can you run with 
> -e, to see the full stack trace?
> 
> -Lukas
> 
> 
> Dennis Lundberg wrote:
>> I decided to try out a Sourceforge project that I work on, but it 
>> failed miserably with the new plugin. Just to make sure it wasn't 
>> something specific to that project I checked out another Sourceforge 
>> project that you are all familiar with: maven-plugins.
>>
>> Steps to reproduce:
>> * check out maven-plugins from sourceforge.net
>> * cd maven-plugins\tasks
>> * maven site
>>
>> This is the results I get:
>>
>> ...
>>
>> xdoc:generate-from-pom:
>>     [echo] Generating xdocs from POM ...
>>
>> BUILD FAILED
>> File...... C:\Documents and 
>> Settings\dlg01\.maven\cache\maven-xdoc-plugin-1.10-SNAPSHOT\plugin.jelly
>> Element... velocity:merge
>> Line...... 728
>> Column.... 13
>> Invocation of method 'anonymousAccessCVS' in  class 
>> org.apache.maven.xdoc.util.ScmUtil threw exception class 
>> java.lang.NoClassDefFoundError : org/codehaus/plexus/util/StringUtils
>> Total time: 31 seconds
>> Finished at: Mon Jun 12 23:16:16 CEST 2006
>>
>>
>> This might be a regression issue, since I'm still using Maven 1.0.2.
>>
>>
>>
> 
> ---------------------------------------------------------------------
> To unsubscribe, e-mail: dev-unsubscribe@maven.apache.org
> For additional commands, e-mail: dev-help@maven.apache.org
> 


-- 
Dennis Lundberg

---------------------------------------------------------------------
To unsubscribe, e-mail: dev-unsubscribe@maven.apache.org
For additional commands, e-mail: dev-help@maven.apache.org


Mime
View raw message