maven-dev mailing list archives

Site index · List index
Message view « Date » · « Thread »
Top « Date » · « Thread »
From Jörg Schaible <Joerg.Schai...@Elsag-Solutions.com>
Subject RC2 bootstrapping failure
Date Tue, 03 Feb 2004 08:39:07 GMT
Hi Folks,

currently RC2 will not build the bootstrap without errors. It throws an exception testing
the Aspectwerkz plugin and skips then any other test. It seems, you're missing a lib in the
repository:

========= snip ===============
...
     [exec] +----------------------------------------
     [exec] | Testing Maven AspectWerkz Plug-in
     [exec] | Memory: 8M/14M
     [exec] +----------------------------------------
     [exec] Starting the reactor...
     [exec] Our processing order:
     [exec] Maven Aspectwerkz plugin test - Parent
     [exec] Maven Aspectwerkz plugin test - Child
     [exec] +----------------------------------------
     [exec] | Executing clean Maven Aspectwerkz plugin test - Parent
     [exec] | Memory: 9M/14M
     [exec] +----------------------------------------
     [exec] +----------------------------------------
     [exec] | Executing clean Maven Aspectwerkz plugin test - Child
     [exec] | Memory: 9M/14M
     [exec] +----------------------------------------
     [exec] Attempting to download test-maven-aspectwerkz-plugin-parent-1.0.jar.
     [exec] WARNING: Failed to download test-maven-aspectwerkz-plugin-parent-1.0.jar.
     [exec] com.werken.werkz.UnattainableGoalException: Unable to obtain goal [testPlugin]
-- file:/C:/Dokumente und Einstellungen/jos/.maven/plugins/maven-multiproject-plugin-1.2-SNAPSHOT/plugin.jelly:184:9:
<maven:reactor> Reactor subproject failure occurred
     [exec]     at com.werken.werkz.Goal.fire(Goal.java:646)
     [exec]     at com.werken.werkz.Goal.attain(Goal.java:575)
     [exec]     at com.werken.werkz.WerkzProject.attainGoal(WerkzProject.java:193)
     [exec]     at org.apache.maven.plugin.PluginManager.attainGoals(PluginManager.java:600)
     [exec]     at org.apache.maven.MavenSession.attainGoals(MavenSession.java:304)
     [exec]     at org.apache.maven.jelly.tags.maven.MavenTag.doTag(MavenTag.java:122)
     [exec]     at org.apache.commons.jelly.impl.TagScript.run(TagScript.java:279)
     [exec]     at org.apache.commons.jelly.impl.ScriptBlock.run(ScriptBlock.java:135)
     [exec]     at org.apache.commons.jelly.TagSupport.invokeBody(TagSupport.java:233)
     [exec]     at org.apache.commons.jelly.tags.util.AvailableTag.doTag(AvailableTag.java:110)
     [exec]     at org.apache.commons.jelly.impl.TagScript.run(TagScript.java:279)
     [exec]     at org.apache.commons.jelly.impl.ScriptBlock.run(ScriptBlock.java:135)
     [exec]     at org.apache.maven.jelly.tags.werkz.MavenGoalTag.runBodyTag(MavenGoalTag.java:117)
     [exec]     at org.apache.maven.jelly.tags.werkz.MavenGoalTag$MavenGoalAction.performAction(MavenGoalTag.java:143)
     [exec]     at com.werken.werkz.Goal.fire(Goal.java:639)
     [exec]     at com.werken.werkz.Goal.attain(Goal.java:575)
     [exec]     at com.werken.werkz.WerkzProject.attainGoal(WerkzProject.java:193)
     [exec]     at org.apache.maven.plugin.PluginManager.attainGoals(PluginManager.java:600)
     [exec]     at org.apache.maven.MavenSession.attainGoals(MavenSession.java:304)
     [exec]     at org.apache.maven.jelly.tags.maven.ReactorTag.doTag(ReactorTag.java:312)
     [exec]     at org.apache.commons.jelly.impl.TagScript.run(TagScript.java:279)
     [exec]     at org.apache.commons.jelly.impl.ScriptBlock.run(ScriptBlock.java:135)
     [exec]     at org.apache.maven.jelly.tags.werkz.MavenGoalTag.runBodyTag(MavenGoalTag.java:117)
     [exec]     at org.apache.maven.jelly.tags.werkz.MavenGoalTag$MavenGoalAction.performAction(MavenGoalTag.java:143)
     [exec]     at com.werken.werkz.Goal.fire(Goal.java:639)
     [exec]     at com.werken.werkz.Goal.attain(Goal.java:575)
     [exec]     at com.werken.werkz.WerkzProject.attainGoal(WerkzProject.java:193)
     [exec]     at org.apache.maven.plugin.PluginManager.attainGoals(PluginManager.java:600)
     [exec]     at org.apache.maven.MavenSession.attainGoals(MavenSession.java:304)
     [exec]     at org.apache.maven.cli.App.doMain(App.java:490)
     [exec]     at org.apache.maven.cli.App.main(App.java:1141)
     [exec]     at sun.reflect.NativeMethodAccessorImpl.invoke0(Native Method)
     [exec]     at sun.reflect.NativeMethodAccessorImpl.invoke(NativeMethodAccessorImpl.java:39)
     [exec]     at sun.reflect.DelegatingMethodAccessorImpl.invoke(DelegatingMethodAccessorImpl.java:25)
     [exec]     at java.lang.reflect.Method.invoke(Method.java:324)
     [exec]     at com.werken.forehead.Forehead.run(Forehead.java:551)
     [exec]     at com.werken.forehead.Forehead.main(Forehead.java:581)
     [exec] org.apache.commons.jelly.JellyTagException: file:/C:/Dokumente und Einstellungen/jos/.maven/plugins/maven-multiproject-plugin-1.2-SNAPSHOT/plugin.jelly:184:9:
<maven:reactor> Reactor subproject failure occurred
     [exec]     at org.apache.maven.jelly.tags.maven.ReactorTag.doTag(ReactorTag.java:320)
     [exec]     at org.apache.commons.jelly.impl.TagScript.run(TagScript.java:279)
     [exec]     at org.apache.commons.jelly.impl.ScriptBlock.run(ScriptBlock.java:135)
     [exec]     at org.apache.maven.jelly.tags.werkz.MavenGoalTag.runBodyTag(MavenGoalTag.java:117)
     [exec]     at org.apache.maven.jelly.tags.werkz.MavenGoalTag$MavenGoalAction.performAction(MavenGoalTag.java:143)
     [exec]     at com.werken.werkz.Goal.fire(Goal.java:639)
     [exec]     at com.werken.werkz.Goal.attain(Goal.java:575)
     [exec]     at com.werken.werkz.WerkzProject.attainGoal(WerkzProject.java:193)
     [exec]     at org.apache.maven.jelly.tags.werkz.MavenAttainGoalTag.doTag(MavenAttainGoalTag.java:165)
     [exec]     at org.apache.commons.jelly.impl.TagScript.run(TagScript.java:279)
     [exec]     at org.apache.commons.jelly.impl.ScriptBlock.run(ScriptBlock.java:135)
     [exec]     at org.apache.maven.jelly.tags.werkz.MavenGoalTag.runBodyTag(MavenGoalTag.java:117)
     [exec]     at org.apache.maven.jelly.tags.werkz.MavenGoalTag$MavenGoalAction.performAction(MavenGoalTag.java:143)
     [exec]     at com.werken.werkz.Goal.fire(Goal.java:639)
     [exec]     at com.werken.werkz.Goal.attain(Goal.java:575)
     [exec]     at com.werken.werkz.WerkzProject.attainGoal(WerkzProject.java:193)
     [exec]     at org.apache.maven.plugin.PluginManager.attainGoals(PluginManager.java:600)
     [exec]     at org.apache.maven.MavenSession.attainGoals(MavenSession.java:304)
     [exec]     at org.apache.maven.jelly.tags.maven.MavenTag.doTag(MavenTag.java:122)
     [exec]     at org.apache.commons.jelly.impl.TagScript.run(TagScript.java:279)
     [exec]     at org.apache.commons.jelly.impl.ScriptBlock.run(ScriptBlock.java:135)
     [exec]     at org.apache.commons.jelly.TagSupport.invokeBody(TagSupport.java:233)
     [exec]     at org.apache.commons.jelly.tags.util.AvailableTag.doTag(AvailableTag.java:110)
     [exec]     at org.apache.commons.jelly.impl.TagScript.run(TagScript.java:279)
     [exec]     at org.apache.commons.jelly.impl.ScriptBlock.run(ScriptBlock.java:135)
     [exec]     at org.apache.maven.jelly.tags.werkz.MavenGoalTag.runBodyTag(MavenGoalTag.java:117)
     [exec]     at org.apache.maven.jelly.tags.werkz.MavenGoalTag$MavenGoalAction.performAction(MavenGoalTag.java:143)
     [exec]     at com.werken.werkz.Goal.fire(Goal.java:639)
     [exec]     at com.werken.werkz.Goal.attain(Goal.java:575)
     [exec]     at com.werken.werkz.WerkzProject.attainGoal(WerkzProject.java:193)
     [exec]     at org.apache.maven.plugin.PluginManager.attainGoals(PluginManager.java:600)
     [exec]     at org.apache.maven.MavenSession.attainGoals(MavenSession.java:304)
     [exec]     at org.apache.maven.jelly.tags.maven.ReactorTag.doTag(ReactorTag.java:312)
     [exec]     at org.apache.commons.jelly.impl.TagScript.run(TagScript.java:279)
     [exec]     at org.apache.commons.jelly.impl.ScriptBlock.run(ScriptBlock.java:135)
     [exec]     at org.apache.maven.jelly.tags.werkz.MavenGoalTag.runBodyTag(MavenGoalTag.java:117)
     [exec]     at org.apache.maven.jelly.tags.werkz.MavenGoalTag$MavenGoalAction.performAction(MavenGoalTag.java:143)
     [exec]     at com.werken.werkz.Goal.fire(Goal.java:639)
     [exec]     at com.werken.werkz.Goal.attain(Goal.java:575)
     [exec]     at com.werken.werkz.WerkzProject.attainGoal(WerkzProject.java:193)
     [exec]     at org.apache.maven.plugin.PluginManager.attainGoals(PluginManager.java:600)
     [exec]     at org.apache.maven.MavenSession.attainGoals(MavenSession.java:304)
     [exec]     at org.apache.maven.cli.App.doMain(App.java:490)
     [exec]     at org.apache.maven.cli.App.main(App.java:1141)
     [exec]     at sun.reflect.NativeMethodAccessorImpl.invoke0(Native Method)
     [exec]     at sun.reflect.NativeMethodAccessorImpl.invoke(NativeMethodAccessorImpl.java:39)
     [exec]     at sun.reflect.DelegatingMethodAccessorImpl.invoke(DelegatingMethodAccessorImpl.java:25)
     [exec]     at java.lang.reflect.Method.invoke(Method.java:324)
     [exec]     at com.werken.forehead.Forehead.run(Forehead.java:551)
     [exec]     at com.werken.forehead.Forehead.main(Forehead.java:581)
     [exec] Caused by: org.apache.maven.verifier.UnsatisfiedDependencyException: The build
cannot continue because of the following unsatisfied dependency:

     [exec] test-maven-aspectwerkz-plugin-parent-1.0.jar (no download url specified)

     [exec]     at org.apache.maven.verifier.DependencyVerifier.satisfyDependencies(DependencyVerifier.java:219)
     [exec]     at org.apache.maven.verifier.DependencyVerifier.verify(DependencyVerifier.java:135)
     [exec]     at org.apache.maven.project.Project.verifyDependencies(Project.java:1395)
     [exec]     at org.apache.maven.plugin.PluginManager.attainGoals(PluginManager.java:489)
     [exec]     at org.apache.maven.MavenSession.attainGoals(MavenSession.java:304)
     [exec]     at org.apache.maven.jelly.tags.maven.ReactorTag.doTag(ReactorTag.java:312)
     [exec]     ... 49 more
     [exec] Root cause
     [exec] org.apache.maven.verifier.UnsatisfiedDependencyException: The build cannot continue
because of the following unsatisfied dependency:

     [exec] test-maven-aspectwerkz-plugin-parent-1.0.jar (no download url specified)

     [exec]     at org.apache.maven.verifier.DependencyVerifier.satisfyDependencies(DependencyVerifier.java:219)
     [exec]     at org.apache.maven.verifier.DependencyVerifier.verify(DependencyVerifier.java:135)
     [exec]     at org.apache.maven.project.Project.verifyDependencies(Project.java:1395)
     [exec]     at org.apache.maven.plugin.PluginManager.attainGoals(PluginManager.java:489)
     [exec]     at org.apache.maven.MavenSession.attainGoals(MavenSession.java:304)
     [exec]     at org.apache.maven.jelly.tags.maven.ReactorTag.doTag(ReactorTag.java:312)
     [exec]     at org.apache.commons.jelly.impl.TagScript.run(TagScript.java:279)
     [exec]     at org.apache.commons.jelly.impl.ScriptBlock.run(ScriptBlock.java:135)
     [exec]     at org.apache.maven.jelly.tags.werkz.MavenGoalTag.runBodyTag(MavenGoalTag.java:117)
     [exec]     at org.apache.maven.jelly.tags.werkz.MavenGoalTag$MavenGoalAction.performAction(MavenGoalTag.java:143)
     [exec]     at com.werken.werkz.Goal.fire(Goal.java:639)
     [exec]     at com.werken.werkz.Goal.attain(Goal.java:575)
     [exec]     at com.werken.werkz.WerkzProject.attainGoal(WerkzProject.java:193)
     [exec]     at org.apache.maven.jelly.tags.werkz.MavenAttainGoalTag.doTag(MavenAttainGoalTag.java:165)
     [exec]     at org.apache.commons.jelly.impl.TagScript.run(TagScript.java:279)
     [exec]     at org.apache.commons.jelly.impl.ScriptBlock.run(ScriptBlock.java:135)
     [exec]     at org.apache.maven.jelly.tags.werkz.MavenGoalTag.runBodyTag(MavenGoalTag.java:117)
     [exec]     at org.apache.maven.jelly.tags.werkz.MavenGoalTag$MavenGoalAction.performAction(MavenGoalTag.java:143)
     [exec]     at com.werken.werkz.Goal.fire(Goal.java:639)
     [exec]     at com.werken.werkz.Goal.attain(Goal.java:575)
     [exec]     at com.werken.werkz.WerkzProject.attainGoal(WerkzProject.java:193)
     [exec]     at org.apache.maven.plugin.PluginManager.attainGoals(PluginManager.java:600)
     [exec]     at org.apache.maven.MavenSession.attainGoals(MavenSession.java:304)
     [exec]     at org.apache.maven.jelly.tags.maven.MavenTag.doTag(MavenTag.java:122)
     [exec]     at org.apache.commons.jelly.impl.TagScript.run(TagScript.java:279)
     [exec]     at org.apache.commons.jelly.impl.ScriptBlock.run(ScriptBlock.java:135)
     [exec]     at org.apache.commons.jelly.TagSupport.invokeBody(TagSupport.java:233)
     [exec]     at org.apache.commons.jelly.tags.util.AvailableTag.doTag(AvailableTag.java:110)
     [exec]     at org.apache.commons.jelly.impl.TagScript.run(TagScript.java:279)
     [exec]     at org.apache.commons.jelly.impl.ScriptBlock.run(ScriptBlock.java:135)
     [exec]     at org.apache.maven.jelly.tags.werkz.MavenGoalTag.runBodyTag(MavenGoalTag.java:117)
     [exec]     at org.apache.maven.jelly.tags.werkz.MavenGoalTag$MavenGoalAction.performAction(MavenGoalTag.java:143)
     [exec]     at com.werken.werkz.Goal.fire(Goal.java:639)
     [exec]     at com.werken.werkz.Goal.attain(Goal.java:575)
     [exec]     at com.werken.werkz.WerkzProject.attainGoal(WerkzProject.java:193)
     [exec]     at org.apache.maven.plugin.PluginManager.attainGoals(PluginManager.java:600)
     [exec]     at org.apache.maven.MavenSession.attainGoals(MavenSession.java:304)
     [exec]     at org.apache.maven.jelly.tags.maven.ReactorTag.doTag(ReactorTag.java:312)
     [exec]     at org.apache.commons.jelly.impl.TagScript.run(TagScript.java:279)
     [exec]     at org.apache.commons.jelly.impl.ScriptBlock.run(ScriptBlock.java:135)
     [exec]     at org.apache.maven.jelly.tags.werkz.MavenGoalTag.runBodyTag(MavenGoalTag.java:117)
     [exec]     at org.apache.maven.jelly.tags.werkz.MavenGoalTag$MavenGoalAction.performAction(MavenGoalTag.java:143)
     [exec]     at com.werken.werkz.Goal.fire(Goal.java:639)
     [exec]     at com.werken.werkz.Goal.attain(Goal.java:575)
     [exec]     at com.werken.werkz.WerkzProject.attainGoal(WerkzProject.java:193)
     [exec]     at org.apache.maven.plugin.PluginManager.attainGoals(PluginManager.java:600)
     [exec]     at org.apache.maven.MavenSession.attainGoals(MavenSession.java:304)
     [exec] Root cause
     [exec]     at org.apache.maven.cli.App.doMain(App.java:490)
     [exec]     at org.apache.maven.cli.App.main(App.java:1141)
     [exec]     at sun.reflect.NativeMethodAccessorImpl.invoke0(Native Method)
     [exec]     at sun.reflect.NativeMethodAccessorImpl.invoke(NativeMethodAccessorImpl.java:39)
     [exec]     at sun.reflect.DelegatingMethodAccessorImpl.invoke(DelegatingMethodAccessorImpl.java:25)
     [exec]     at java.lang.reflect.Method.invoke(Method.java:324)
     [exec]     at com.werken.forehead.Forehead.run(Forehead.java:551)
     [exec]     at com.werken.forehead.Forehead.main(Forehead.java:581)
     [exec] org.apache.maven.verifier.UnsatisfiedDependencyException: The build cannot continue
because of the following unsatisfied dependency:

     [exec] test-maven-aspectwerkz-plugin-parent-1.0.jar (no download url specified)

     [exec]     at org.apache.maven.verifier.DependencyVerifier.satisfyDependencies(DependencyVerifier.java:219)
     [exec]     at org.apache.maven.verifier.DependencyVerifier.verify(DependencyVerifier.java:135)
     [exec]     at org.apache.maven.project.Project.verifyDependencies(Project.java:1395)
     [exec]     at org.apache.maven.plugin.PluginManager.attainGoals(PluginManager.java:489)
     [exec]     at org.apache.maven.MavenSession.attainGoals(MavenSession.java:304)
     [exec]     at org.apache.maven.jelly.tags.maven.ReactorTag.doTag(ReactorTag.java:312)
     [exec]     at org.apache.commons.jelly.impl.TagScript.run(TagScript.java:279)
     [exec]     at org.apache.commons.jelly.impl.ScriptBlock.run(ScriptBlock.java:135)
     [exec]     at org.apache.maven.jelly.tags.werkz.MavenGoalTag.runBodyTag(MavenGoalTag.java:117)
     [exec]     at org.apache.maven.jelly.tags.werkz.MavenGoalTag$MavenGoalAction.performAction(MavenGoalTag.java:143)
     [exec]     at com.werken.werkz.Goal.fire(Goal.java:639)
     [exec]     at com.werken.werkz.Goal.attain(Goal.java:575)
     [exec]     at com.werken.werkz.WerkzProject.attainGoal(WerkzProject.java:193)
     [exec]     at org.apache.maven.jelly.tags.werkz.MavenAttainGoalTag.doTag(MavenAttainGoalTag.java:165)
     [exec]     at org.apache.commons.jelly.impl.TagScript.run(TagScript.java:279)
     [exec]     at org.apache.commons.jelly.impl.ScriptBlock.run(ScriptBlock.java:135)
     [exec]     at org.apache.maven.jelly.tags.werkz.MavenGoalTag.runBodyTag(MavenGoalTag.java:117)
     [exec]     at org.apache.maven.jelly.tags.werkz.MavenGoalTag$MavenGoalAction.performAction(MavenGoalTag.java:143)
     [exec]     at com.werken.werkz.Goal.fire(Goal.java:639)
     [exec]     at com.werken.werkz.Goal.attain(Goal.java:575)
     [exec]     at com.werken.werkz.WerkzProject.attainGoal(WerkzProject.java:193)
     [exec]     at org.apache.maven.plugin.PluginManager.attainGoals(PluginManager.java:600)
     [exec]     at org.apache.maven.MavenSession.attainGoals(MavenSession.java:304)
     [exec]     at org.apache.maven.jelly.tags.maven.MavenTag.doTag(MavenTag.java:122)
     [exec]     at org.apache.commons.jelly.impl.TagScript.run(TagScript.java:279)
     [exec]     at org.apache.commons.jelly.impl.ScriptBlock.run(ScriptBlock.java:135)
     [exec]     at org.apache.commons.jelly.TagSupport.invokeBody(TagSupport.java:233)
     [exec]     at org.apache.commons.jelly.tags.util.AvailableTag.doTag(AvailableTag.java:110)
     [exec]     at org.apache.commons.jelly.impl.TagScript.run(TagScript.java:279)
     [exec]     at org.apache.commons.jelly.impl.ScriptBlock.run(ScriptBlock.java:135)
     [exec]     at org.apache.maven.jelly.tags.werkz.MavenGoalTag.runBodyTag(MavenGoalTag.java:117)
     [exec]     at org.apache.maven.jelly.tags.werkz.MavenGoalTag$MavenGoalAction.performAction(MavenGoalTag.java:143)
     [exec]     at com.werken.werkz.Goal.fire(Goal.java:639)
     [exec]     at com.werken.werkz.Goal.attain(Goal.java:575)
     [exec]     at com.werken.werkz.WerkzProject.attainGoal(WerkzProject.java:193)
     [exec]     at org.apache.maven.plugin.PluginManager.attainGoals(PluginManager.java:600)
     [exec]     at org.apache.maven.MavenSession.attainGoals(MavenSession.java:304)
     [exec]     at org.apache.maven.jelly.tags.maven.ReactorTag.doTag(ReactorTag.java:312)
     [exec]     at org.apache.commons.jelly.impl.TagScript.run(TagScript.java:279)
     [exec]     at org.apache.commons.jelly.impl.ScriptBlock.run(ScriptBlock.java:135)
     [exec]     at org.apache.maven.jelly.tags.werkz.MavenGoalTag.runBodyTag(MavenGoalTag.java:117)
     [exec]     at org.apache.maven.jelly.tags.werkz.MavenGoalTag$MavenGoalAction.performAction(MavenGoalTag.java:143)
     [exec]     at com.werken.werkz.Goal.fire(Goal.java:639)
     [exec]     at com.werken.werkz.Goal.attain(Goal.java:575)
     [exec]     at com.werken.werkz.WerkzProject.attainGoal(WerkzProject.java:193)
     [exec]     at org.apache.maven.plugin.PluginManager.attainGoals(PluginManager.java:600)
     [exec]     at org.apache.maven.MavenSession.attainGoals(MavenSession.java:304)

     [exec]     at org.apache.maven.cli.App.doMain(App.java:490)
     [exec]     at org.apache.maven.cli.App.main(App.java:1141)
     [exec]     at sun.reflect.NativeMethodAccessorImpl.invoke0(Native Method)
     [exec]     at sun.reflect.NativeMethodAccessorImpl.invoke(NativeMethodAccessorImpl.java:39)
     [exec]     at sun.reflect.DelegatingMethodAccessorImpl.invoke(DelegatingMethodAccessorImpl.java:25)
     [exec]     at java.lang.reflect.Method.invoke(Method.java:324)
     [exec]     at com.werken.forehead.Forehead.run(Forehead.java:551)
     [exec]     at com.werken.forehead.Forehead.main(Forehead.java:581)
     [exec] BUILD FAILED
     [exec] com.werken.werkz.UnattainableGoalException: Unable to obtain goal [plugin:test]
-- file:/C:/Dokumente und Einstellungen/jos/.maven/plugins/maven-plugin-plugin-1.2-SNAPSHOT/plugin.jelly:239:34:
<maven:maven> Unable to obtain goal [testPlugin] -- file:/C:/Dokumente und Einstellungen/jos/.maven/plugins/maven-multiproject-plugin-1.2-SNAPSHOT/plugin.jelly:184:9:
<maven:reactor> Reactor subproject failure occurred
     [exec]     at com.werken.werkz.Goal.fire(Goal.java:646)
     [exec]     at com.werken.werkz.Goal.attain(Goal.java:575)
     [exec]     at com.werken.werkz.WerkzProject.attainGoal(WerkzProject.java:193)
     [exec]     at org.apache.maven.plugin.PluginManager.attainGoals(PluginManager.java:600)
     [exec]     at org.apache.maven.MavenSession.attainGoals(MavenSession.java:304)
     [exec]     at org.apache.maven.jelly.tags.maven.ReactorTag.doTag(ReactorTag.java:312)
     [exec]     at org.apache.commons.jelly.impl.TagScript.run(TagScript.java:279)
     [exec]     at org.apache.commons.jelly.impl.ScriptBlock.run(ScriptBlock.java:135)
     [exec]     at org.apache.maven.jelly.tags.werkz.MavenGoalTag.runBodyTag(MavenGoalTag.java:117)
     [exec]     at org.apache.maven.jelly.tags.werkz.MavenGoalTag$MavenGoalAction.performAction(MavenGoalTag.java:143)
     [exec]     at com.werken.werkz.Goal.fire(Goal.java:639)
     [exec]     at com.werken.werkz.Goal.attain(Goal.java:575)
     [exec]     at com.werken.werkz.WerkzProject.attainGoal(WerkzProject.java:193)
     [exec]     at org.apache.maven.plugin.PluginManager.attainGoals(PluginManager.java:600)
     [exec]     at org.apache.maven.MavenSession.attainGoals(MavenSession.java:304)
     [exec]     at org.apache.maven.cli.App.doMain(App.java:490)
     [exec]     at org.apache.maven.cli.App.main(App.java:1141)
     [exec]     at sun.reflect.NativeMethodAccessorImpl.invoke0(Native Method)
     [exec]     at sun.reflect.NativeMethodAccessorImpl.invoke(NativeMethodAccessorImpl.java:39)
     [exec]     at sun.reflect.DelegatingMethodAccessorImpl.invoke(DelegatingMethodAccessorImpl.java:25)
     [exec]     at java.lang.reflect.Method.invoke(Method.java:324)
     [exec]     at com.werken.forehead.Forehead.run(Forehead.java:551)
     [exec]     at com.werken.forehead.Forehead.main(Forehead.java:581)
     [exec] org.apache.commons.jelly.JellyTagException: file:/C:/Dokumente und Einstellungen/jos/.maven/plugins/maven-plugin-plugin-1.2-SNAPSHOT/plugin.jelly:239:34:
<maven:maven> Unable to obtain goal [testPlugin] -- file:/C:/Dokumente und Einstellungen/jos/.maven/plugins/maven-multiproject-plugin-1.2-SNAPSHOT/plugin.jelly:184:9:
<maven:reactor> Reactor subproject failure occurred
     [exec]     at org.apache.maven.jelly.tags.maven.MavenTag.doTag(MavenTag.java:144)
     [exec]     at org.apache.commons.jelly.impl.TagScript.run(TagScript.java:279)
     [exec]     at org.apache.commons.jelly.impl.ScriptBlock.run(ScriptBlock.java:135)
     [exec]     at org.apache.commons.jelly.TagSupport.invokeBody(TagSupport.java:233)
     [exec]     at org.apache.commons.jelly.tags.util.AvailableTag.doTag(AvailableTag.java:110)
     [exec]     at org.apache.commons.jelly.impl.TagScript.run(TagScript.java:279)
     [exec]     at org.apache.commons.jelly.impl.ScriptBlock.run(ScriptBlock.java:135)
     [exec]     at org.apache.maven.jelly.tags.werkz.MavenGoalTag.runBodyTag(MavenGoalTag.java:117)
     [exec]     at org.apache.maven.jelly.tags.werkz.MavenGoalTag$MavenGoalAction.performAction(MavenGoalTag.java:143)
     [exec]     at com.werken.werkz.Goal.fire(Goal.java:639)
     [exec]     at com.werken.werkz.Goal.attain(Goal.java:575)
     [exec]     at com.werken.werkz.WerkzProject.attainGoal(WerkzProject.java:193)
     [exec]     at org.apache.maven.plugin.PluginManager.attainGoals(PluginManager.java:600)
     [exec]     at org.apache.maven.MavenSession.attainGoals(MavenSession.java:304)
     [exec]     at org.apache.maven.jelly.tags.maven.ReactorTag.doTag(ReactorTag.java:312)
     [exec]     at org.apache.commons.jelly.impl.TagScript.run(TagScript.java:279)
     [exec]     at org.apache.commons.jelly.impl.ScriptBlock.run(ScriptBlock.java:135)
     [exec]     at org.apache.maven.jelly.tags.werkz.MavenGoalTag.runBodyTag(MavenGoalTag.java:117)
     [exec]     at org.apache.maven.jelly.tags.werkz.MavenGoalTag$MavenGoalAction.performAction(MavenGoalTag.java:143)
     [exec]     at com.werken.werkz.Goal.fire(Goal.java:639)
     [exec]     at com.werken.werkz.Goal.attain(Goal.java:575)
     [exec]     at com.werken.werkz.WerkzProject.attainGoal(WerkzProject.java:193)
     [exec]     at org.apache.maven.plugin.PluginManager.attainGoals(PluginManager.java:600)
     [exec]     at org.apache.maven.MavenSession.attainGoals(MavenSession.java:304)
     [exec]     at org.apache.maven.cli.App.doMain(App.java:490)
     [exec]     at org.apache.maven.cli.App.main(App.java:1141)
     [exec]     at sun.reflect.NativeMethodAccessorImpl.invoke0(Native Method)
     [exec]     at sun.reflect.NativeMethodAccessorImpl.invoke(NativeMethodAccessorImpl.java:39)
     [exec]     at sun.reflect.DelegatingMethodAccessorImpl.invoke(DelegatingMethodAccessorImpl.java:25)
     [exec]     at java.lang.reflect.Method.invoke(Method.java:324)
     [exec]     at com.werken.forehead.Forehead.run(Forehead.java:551)
     [exec]     at com.werken.forehead.Forehead.main(Forehead.java:581)
     [exec] Caused by: com.werken.werkz.UnattainableGoalException: Unable to obtain goal [testPlugin]
-- file:/C:/Dokumente und Einstellungen/jos/.maven/plugins/maven-multiproject-plugin-1.2-SNAPSHOT/plugin.jelly:184:9:
<maven:reactor> Reactor subproject failure occurred
     [exec]     at com.werken.werkz.Goal.fire(Goal.java:646)
     [exec]     at com.werken.werkz.Goal.attain(Goal.java:575)
     [exec]     at com.werken.werkz.WerkzProject.attainGoal(WerkzProject.java:193)
     [exec]     at org.apache.maven.plugin.PluginManager.attainGoals(PluginManager.java:600)
     [exec]     at org.apache.maven.MavenSession.attainGoals(MavenSession.java:304)
     [exec]     at org.apache.maven.jelly.tags.maven.MavenTag.doTag(MavenTag.java:122)
     [exec]     ... 31 more
     [exec] Root cause
     [exec] com.werken.werkz.UnattainableGoalException: Unable to obtain goal [testPlugin]
-- file:/C:/Dokumente und Einstellungen/jos/.maven/plugins/maven-multiproject-plugin-1.2-SNAPSHOT/plugin.jelly:184:9:
<maven:reactor> Reactor subproject failure occurred
     [exec]     at com.werken.werkz.Goal.fire(Goal.java:646)
     [exec]     at com.werken.werkz.Goal.attain(Goal.java:575)
     [exec]     at com.werken.werkz.WerkzProject.attainGoal(WerkzProject.java:193)
     [exec]     at org.apache.maven.plugin.PluginManager.attainGoals(PluginManager.java:600)
     [exec]     at org.apache.maven.MavenSession.attainGoals(MavenSession.java:304)
     [exec]     at org.apache.maven.jelly.tags.maven.MavenTag.doTag(MavenTag.java:122)
     [exec]     at org.apache.commons.jelly.impl.TagScript.run(TagScript.java:279)
     [exec]     at org.apache.commons.jelly.impl.ScriptBlock.run(ScriptBlock.java:135)
     [exec]     at org.apache.commons.jelly.TagSupport.invokeBody(TagSupport.java:233)
     [exec]     at org.apache.commons.jelly.tags.util.AvailableTag.doTag(AvailableTag.java:110)
     [exec]     at org.apache.commons.jelly.impl.TagScript.run(TagScript.java:279)
     [exec]     at org.apache.commons.jelly.impl.ScriptBlock.run(ScriptBlock.java:135)
     [exec]     at org.apache.maven.jelly.tags.werkz.MavenGoalTag.runBodyTag(MavenGoalTag.java:117)
     [exec]     at org.apache.maven.jelly.tags.werkz.MavenGoalTag$MavenGoalAction.performAction(MavenGoalTag.java:143)
     [exec]     at com.werken.werkz.Goal.fire(Goal.java:639)
     [exec]     at com.werken.werkz.Goal.attain(Goal.java:575)
     [exec]     at com.werken.werkz.WerkzProject.attainGoal(WerkzProject.java:193)
     [exec]     at org.apache.maven.plugin.PluginManager.attainGoals(PluginManager.java:600)
     [exec]     at org.apache.maven.MavenSession.attainGoals(MavenSession.java:304)
     [exec]     at org.apache.maven.jelly.tags.maven.ReactorTag.doTag(ReactorTag.java:312)
     [exec]     at org.apache.commons.jelly.impl.TagScript.run(TagScript.java:279)
     [exec]     at org.apache.commons.jelly.impl.ScriptBlock.run(ScriptBlock.java:135)
     [exec]     at org.apache.maven.jelly.tags.werkz.MavenGoalTag.runBodyTag(MavenGoalTag.java:117)
     [exec]     at org.apache.maven.jelly.tags.werkz.MavenGoalTag$MavenGoalAction.performAction(MavenGoalTag.java:143)
     [exec]     at com.werken.werkz.Goal.fire(Goal.java:639)
     [exec]     at com.werken.werkz.Goal.attain(Goal.java:575)
     [exec]     at com.werken.werkz.WerkzProject.attainGoal(WerkzProject.java:193)
     [exec]     at org.apache.maven.plugin.PluginManager.attainGoals(PluginManager.java:600)
     [exec]     at org.apache.maven.MavenSession.attainGoals(MavenSession.java:304)
     [exec] Root cause
     [exec]     at org.apache.maven.cli.App.doMain(App.java:490)
     [exec]     at org.apache.maven.cli.App.main(App.java:1141)
     [exec]     at sun.reflect.NativeMethodAccessorImpl.invoke0(Native Method)
     [exec]     at sun.reflect.NativeMethodAccessorImpl.invoke(NativeMethodAccessorImpl.java:39)
     [exec]     at sun.reflect.DelegatingMethodAccessorImpl.invoke(DelegatingMethodAccessorImpl.java:25)
     [exec]     at java.lang.reflect.Method.invoke(Method.java:324)
     [exec]     at com.werken.forehead.Forehead.run(Forehead.java:551)
     [exec]     at com.werken.forehead.Forehead.main(Forehead.java:581)
     [exec] com.werken.werkz.UnattainableGoalException: Unable to obtain goal [testPlugin]
-- file:/C:/Dokumente und Einstellungen/jos/.maven/plugins/maven-multiproject-plugin-1.2-SNAPSHOT/plugin.jelly:184:9:
<maven:reactor> Reactor subproject failure occurred
     [exec]     at com.werken.werkz.Goal.fire(Goal.java:646)
     [exec]     at com.werken.werkz.Goal.attain(Goal.java:575)
     [exec]     at com.werken.werkz.WerkzProject.attainGoal(WerkzProject.java:193)
     [exec]     at org.apache.maven.plugin.PluginManager.attainGoals(PluginManager.java:600)
     [exec]     at org.apache.maven.MavenSession.attainGoals(MavenSession.java:304)
     [exec]     at org.apache.maven.jelly.tags.maven.MavenTag.doTag(MavenTag.java:122)
     [exec]     at org.apache.commons.jelly.impl.TagScript.run(TagScript.java:279)
     [exec]     at org.apache.commons.jelly.impl.ScriptBlock.run(ScriptBlock.java:135)
     [exec]     at org.apache.commons.jelly.TagSupport.invokeBody(TagSupport.java:233)
     [exec]     at org.apache.commons.jelly.tags.util.AvailableTag.doTag(AvailableTag.java:110)
     [exec]     at org.apache.commons.jelly.impl.TagScript.run(TagScript.java:279)
     [exec]     at org.apache.commons.jelly.impl.ScriptBlock.run(ScriptBlock.java:135)
     [exec]     at org.apache.maven.jelly.tags.werkz.MavenGoalTag.runBodyTag(MavenGoalTag.java:117)
     [exec]     at org.apache.maven.jelly.tags.werkz.MavenGoalTag$MavenGoalAction.performAction(MavenGoalTag.java:143)
     [exec]     at com.werken.werkz.Goal.fire(Goal.java:639)
     [exec]     at com.werken.werkz.Goal.attain(Goal.java:575)
     [exec]     at com.werken.werkz.WerkzProject.attainGoal(WerkzProject.java:193)
     [exec]     at org.apache.maven.plugin.PluginManager.attainGoals(PluginManager.java:600)
     [exec]     at org.apache.maven.MavenSession.attainGoals(MavenSession.java:304)
     [exec]     at org.apache.maven.jelly.tags.maven.ReactorTag.doTag(ReactorTag.java:312)
     [exec]     at org.apache.commons.jelly.impl.TagScript.run(TagScript.java:279)
     [exec]     at org.apache.commons.jelly.impl.ScriptBlock.run(ScriptBlock.java:135)
     [exec]     at org.apache.maven.jelly.tags.werkz.MavenGoalTag.runBodyTag(MavenGoalTag.java:117)
     [exec]     at org.apache.maven.jelly.tags.werkz.MavenGoalTag$MavenGoalAction.performAction(MavenGoalTag.java:143)
     [exec]     at com.werken.werkz.Goal.fire(Goal.java:639)
     [exec]     at com.werken.werkz.Goal.attain(Goal.java:575)
     [exec]     at com.werken.werkz.WerkzProject.attainGoal(WerkzProject.java:193)
     [exec]     at org.apache.maven.plugin.PluginManager.attainGoals(PluginManager.java:600)
     [exec]     at org.apache.maven.MavenSession.attainGoals(MavenSession.java:304)
     [exec]     at org.apache.maven.cli.App.doMain(App.java:490)
     [exec]     at org.apache.maven.cli.App.main(App.java:1141)
     [exec]     at sun.reflect.NativeMethodAccessorImpl.invoke0(Native Method)
     [exec]     at sun.reflect.NativeMethodAccessorImpl.invoke(NativeMethodAccessorImpl.java:39)
     [exec]     at sun.reflect.DelegatingMethodAccessorImpl.invoke(DelegatingMethodAccessorImpl.java:25)
     [exec]     at java.lang.reflect.Method.invoke(Method.java:324)
     [exec]     at com.werken.forehead.Forehead.run(Forehead.java:551)
     [exec]     at com.werken.forehead.Forehead.main(Forehead.java:581)
     [exec] org.apache.commons.jelly.JellyTagException: file:/C:/Dokumente und Einstellungen/jos/.maven/plugins/maven-multiproject-plugin-1.2-SNAPSHOT/plugin.jelly:184:9:
<maven:reactor> Reactor subproject failure occurred
     [exec]     at org.apache.maven.jelly.tags.maven.ReactorTag.doTag(ReactorTag.java:320)
     [exec]     at org.apache.commons.jelly.impl.TagScript.run(TagScript.java:279)
     [exec]     at org.apache.commons.jelly.impl.ScriptBlock.run(ScriptBlock.java:135)
     [exec]     at org.apache.maven.jelly.tags.werkz.MavenGoalTag.runBodyTag(MavenGoalTag.java:117)
     [exec]     at org.apache.maven.jelly.tags.werkz.MavenGoalTag$MavenGoalAction.performAction(MavenGoalTag.java:143)
     [exec]     at com.werken.werkz.Goal.fire(Goal.java:639)
     [exec]     at com.werken.werkz.Goal.attain(Goal.java:575)
     [exec]     at com.werken.werkz.WerkzProject.attainGoal(WerkzProject.java:193)
     [exec]     at org.apache.maven.jelly.tags.werkz.MavenAttainGoalTag.doTag(MavenAttainGoalTag.java:165)
     [exec]     at org.apache.commons.jelly.impl.TagScript.run(TagScript.java:279)
     [exec]     at org.apache.commons.jelly.impl.ScriptBlock.run(ScriptBlock.java:135)
     [exec]     at org.apache.maven.jelly.tags.werkz.MavenGoalTag.runBodyTag(MavenGoalTag.java:117)
     [exec]     at org.apache.maven.jelly.tags.werkz.MavenGoalTag$MavenGoalAction.performAction(MavenGoalTag.java:143)
     [exec]     at com.werken.werkz.Goal.fire(Goal.java:639)
     [exec]     at com.werken.werkz.Goal.attain(Goal.java:575)
     [exec]     at com.werken.werkz.WerkzProject.attainGoal(WerkzProject.java:193)
     [exec]     at org.apache.maven.plugin.PluginManager.attainGoals(PluginManager.java:600)
     [exec]     at org.apache.maven.MavenSession.attainGoals(MavenSession.java:304)
     [exec]     at org.apache.maven.jelly.tags.maven.MavenTag.doTag(MavenTag.java:122)
     [exec]     at org.apache.commons.jelly.impl.TagScript.run(TagScript.java:279)
     [exec]     at org.apache.commons.jelly.impl.ScriptBlock.run(ScriptBlock.java:135)
     [exec]     at org.apache.commons.jelly.TagSupport.invokeBody(TagSupport.java:233)
     [exec]     at org.apache.commons.jelly.tags.util.AvailableTag.doTag(AvailableTag.java:110)
     [exec]     at org.apache.commons.jelly.impl.TagScript.run(TagScript.java:279)
     [exec]     at org.apache.commons.jelly.impl.ScriptBlock.run(ScriptBlock.java:135)
     [exec]     at org.apache.maven.jelly.tags.werkz.MavenGoalTag.runBodyTag(MavenGoalTag.java:117)
     [exec]     at org.apache.maven.jelly.tags.werkz.MavenGoalTag$MavenGoalAction.performAction(MavenGoalTag.java:143)
     [exec]     at com.werken.werkz.Goal.fire(Goal.java:639)
     [exec]     at com.werken.werkz.Goal.attain(Goal.java:575)
     [exec]     at com.werken.werkz.WerkzProject.attainGoal(WerkzProject.java:193)
     [exec]     at org.apache.maven.plugin.PluginManager.attainGoals(PluginManager.java:600)
     [exec]     at org.apache.maven.MavenSession.attainGoals(MavenSession.java:304)
     [exec]     at org.apache.maven.jelly.tags.maven.ReactorTag.doTag(ReactorTag.java:312)
     [exec]     at org.apache.commons.jelly.impl.TagScript.run(TagScript.java:279)
     [exec]     at org.apache.commons.jelly.impl.ScriptBlock.run(ScriptBlock.java:135)
     [exec]     at org.apache.maven.jelly.tags.werkz.MavenGoalTag.runBodyTag(MavenGoalTag.java:117)
     [exec]     at org.apache.maven.jelly.tags.werkz.MavenGoalTag$MavenGoalAction.performAction(MavenGoalTag.java:143)
     [exec]     at com.werken.werkz.Goal.fire(Goal.java:639)
     [exec]     at com.werken.werkz.Goal.attain(Goal.java:575)
     [exec]     at com.werken.werkz.WerkzProject.attainGoal(WerkzProject.java:193)
     [exec]     at org.apache.maven.plugin.PluginManager.attainGoals(PluginManager.java:600)
     [exec]     at org.apache.maven.MavenSession.attainGoals(MavenSession.java:304)
     [exec]     at org.apache.maven.cli.App.doMain(App.java:490)
     [exec]     at org.apache.maven.cli.App.main(App.java:1141)
     [exec]     at sun.reflect.NativeMethodAccessorImpl.invoke0(Native Method)
     [exec]     at sun.reflect.NativeMethodAccessorImpl.invoke(NativeMethodAccessorImpl.java:39)
     [exec]     at sun.reflect.DelegatingMethodAccessorImpl.invoke(DelegatingMethodAccessorImpl.java:25)
     [exec]     at java.lang.reflect.Method.invoke(Method.java:324)
     [exec]     at com.werken.forehead.Forehead.run(Forehead.java:551)
     [exec]     at com.werken.forehead.Forehead.main(Forehead.java:581)
     [exec] Caused by: org.apache.maven.verifier.UnsatisfiedDependencyException: The build
cannot continue because of the following unsatisfied dependency:

     [exec] test-maven-aspectwerkz-plugin-parent-1.0.jar (no download url specified)

     [exec]     at org.apache.maven.verifier.DependencyVerifier.satisfyDependencies(DependencyVerifier.java:219)
     [exec]     at org.apache.maven.verifier.DependencyVerifier.verify(DependencyVerifier.java:135)
     [exec]     at org.apache.maven.project.Project.verifyDependencies(Project.java:1395)
     [exec]     at org.apache.maven.plugin.PluginManager.attainGoals(PluginManager.java:489)
     [exec]     at org.apache.maven.MavenSession.attainGoals(MavenSession.java:304)
     [exec]     at org.apache.maven.jelly.tags.maven.ReactorTag.doTag(ReactorTag.java:312)
     [exec]     ... 49 more
     [exec] Root cause
     [exec] org.apache.maven.verifier.UnsatisfiedDependencyException: The build cannot continue
because of the following unsatisfied dependency:

     [exec] test-maven-aspectwerkz-plugin-parent-1.0.jar (no download url specified)

     [exec]     at org.apache.maven.verifier.DependencyVerifier.satisfyDependencies(DependencyVerifier.java:219)
     [exec]     at org.apache.maven.verifier.DependencyVerifier.verify(DependencyVerifier.java:135)
     [exec]     at org.apache.maven.project.Project.verifyDependencies(Project.java:1395)
     [exec]     at org.apache.maven.plugin.PluginManager.attainGoals(PluginManager.java:489)
     [exec]     at org.apache.maven.MavenSession.attainGoals(MavenSession.java:304)
     [exec]     at org.apache.maven.jelly.tags.maven.ReactorTag.doTag(ReactorTag.java:312)
     [exec]     at org.apache.commons.jelly.impl.TagScript.run(TagScript.java:279)
     [exec]     at org.apache.commons.jelly.impl.ScriptBlock.run(ScriptBlock.java:135)
     [exec]     at org.apache.maven.jelly.tags.werkz.MavenGoalTag.runBodyTag(MavenGoalTag.java:117)
     [exec]     at org.apache.maven.jelly.tags.werkz.MavenGoalTag$MavenGoalAction.performAction(MavenGoalTag.java:143)
     [exec]     at com.werken.werkz.Goal.fire(Goal.java:639)
     [exec]     at com.werken.werkz.Goal.attain(Goal.java:575)
     [exec]     at com.werken.werkz.WerkzProject.attainGoal(WerkzProject.java:193)
     [exec]     at org.apache.maven.jelly.tags.werkz.MavenAttainGoalTag.doTag(MavenAttainGoalTag.java:165)
     [exec]     at org.apache.commons.jelly.impl.TagScript.run(TagScript.java:279)
     [exec]     at org.apache.commons.jelly.impl.ScriptBlock.run(ScriptBlock.java:135)
     [exec]     at org.apache.maven.jelly.tags.werkz.MavenGoalTag.runBodyTag(MavenGoalTag.java:117)
     [exec]     at org.apache.maven.jelly.tags.werkz.MavenGoalTag$MavenGoalAction.performAction(MavenGoalTag.java:143)
     [exec]     at com.werken.werkz.Goal.fire(Goal.java:639)
     [exec]     at com.werken.werkz.Goal.attain(Goal.java:575)
     [exec]     at com.werken.werkz.WerkzProject.attainGoal(WerkzProject.java:193)
     [exec]     at org.apache.maven.plugin.PluginManager.attainGoals(PluginManager.java:600)
     [exec]     at org.apache.maven.MavenSession.attainGoals(MavenSession.java:304)
     [exec]     at org.apache.maven.jelly.tags.maven.MavenTag.doTag(MavenTag.java:122)
     [exec]     at org.apache.commons.jelly.impl.TagScript.run(TagScript.java:279)
     [exec]     at org.apache.commons.jelly.impl.ScriptBlock.run(ScriptBlock.java:135)
     [exec]     at org.apache.commons.jelly.TagSupport.invokeBody(TagSupport.java:233)
     [exec]     at org.apache.commons.jelly.tags.util.AvailableTag.doTag(AvailableTag.java:110)
     [exec]     at org.apache.commons.jelly.impl.TagScript.run(TagScript.java:279)
     [exec]     at org.apache.commons.jelly.impl.ScriptBlock.run(ScriptBlock.java:135)
     [exec]     at org.apache.maven.jelly.tags.werkz.MavenGoalTag.runBodyTag(MavenGoalTag.java:117)
     [exec]     at org.apache.maven.jelly.tags.werkz.MavenGoalTag$MavenGoalAction.performAction(MavenGoalTag.java:143)
     [exec]     at com.werken.werkz.Goal.fire(Goal.java:639)
     [exec]     at com.werken.werkz.Goal.attain(Goal.java:575)
     [exec]     at com.werken.werkz.WerkzProject.attainGoal(WerkzProject.java:193)
     [exec]     at org.apache.maven.plugin.PluginManager.attainGoals(PluginManager.java:600)
     [exec]     at org.apache.maven.MavenSession.attainGoals(MavenSession.java:304)
     [exec]     at org.apache.maven.jelly.tags.maven.ReactorTag.doTag(ReactorTag.java:312)
     [exec]     at org.apache.commons.jelly.impl.TagScript.run(TagScript.java:279)
     [exec]     at org.apache.commons.jelly.impl.ScriptBlock.run(ScriptBlock.java:135)
     [exec]     at org.apache.maven.jelly.tags.werkz.MavenGoalTag.runBodyTag(MavenGoalTag.java:117)
     [exec]     at org.apache.maven.jelly.tags.werkz.MavenGoalTag$MavenGoalAction.performAction(MavenGoalTag.java:143)
     [exec]     at com.werken.werkz.Goal.fire(Goal.java:639)
     [exec]     at com.werken.werkz.Goal.attain(Goal.java:575)
     [exec]     at com.werken.werkz.WerkzProject.attainGoal(WerkzProject.java:193)
     [exec]     at org.apache.maven.plugin.PluginManager.attainGoals(PluginManager.java:600)
     [exec]     at org.apache.maven.MavenSession.attainGoals(MavenSession.java:304)
     [exec] Root cause
     [exec]     at org.apache.maven.cli.App.doMain(App.java:490)
     [exec]     at org.apache.maven.cli.App.main(App.java:1141)
     [exec]     at sun.reflect.NativeMethodAccessorImpl.invoke0(Native Method)
     [exec]     at sun.reflect.NativeMethodAccessorImpl.invoke(NativeMethodAccessorImpl.java:39)
     [exec]     at sun.reflect.DelegatingMethodAccessorImpl.invoke(DelegatingMethodAccessorImpl.java:25)
     [exec]     at java.lang.reflect.Method.invoke(Method.java:324)
     [exec]     at com.werken.forehead.Forehead.run(Forehead.java:551)
     [exec]     at com.werken.forehead.Forehead.main(Forehead.java:581)
     [exec] org.apache.maven.verifier.UnsatisfiedDependencyException: The build cannot continue
because of the following unsatisfied dependency:

     [exec] test-maven-aspectwerkz-plugin-parent-1.0.jar (no download url specified)

     [exec]     at org.apache.maven.verifier.DependencyVerifier.satisfyDependencies(DependencyVerifier.java:219)
     [exec]     at org.apache.maven.verifier.DependencyVerifier.verify(DependencyVerifier.java:135)
     [exec]     at org.apache.maven.project.Project.verifyDependencies(Project.java:1395)
     [exec]     at org.apache.maven.plugin.PluginManager.attainGoals(PluginManager.java:489)
     [exec]     at org.apache.maven.MavenSession.attainGoals(MavenSession.java:304)
     [exec]     at org.apache.maven.jelly.tags.maven.ReactorTag.doTag(ReactorTag.java:312)
     [exec]     at org.apache.commons.jelly.impl.TagScript.run(TagScript.java:279)
     [exec]     at org.apache.commons.jelly.impl.ScriptBlock.run(ScriptBlock.java:135)
     [exec]     at org.apache.maven.jelly.tags.werkz.MavenGoalTag.runBodyTag(MavenGoalTag.java:117)
     [exec]     at org.apache.maven.jelly.tags.werkz.MavenGoalTag$MavenGoalAction.performAction(MavenGoalTag.java:143)
     [exec]     at com.werken.werkz.Goal.fire(Goal.java:639)
     [exec]     at com.werken.werkz.Goal.attain(Goal.java:575)
     [exec]     at com.werken.werkz.WerkzProject.attainGoal(WerkzProject.java:193)
     [exec]     at org.apache.maven.jelly.tags.werkz.MavenAttainGoalTag.doTag(MavenAttainGoalTag.java:165)
     [exec]     at org.apache.commons.jelly.impl.TagScript.run(TagScript.java:279)
     [exec]     at org.apache.commons.jelly.impl.ScriptBlock.run(ScriptBlock.java:135)
     [exec]     at org.apache.maven.jelly.tags.werkz.MavenGoalTag.runBodyTag(MavenGoalTag.java:117)
     [exec]     at org.apache.maven.jelly.tags.werkz.MavenGoalTag$MavenGoalAction.performAction(MavenGoalTag.java:143)
     [exec]     at com.werken.werkz.Goal.fire(Goal.java:639)
     [exec]     at com.werken.werkz.Goal.attain(Goal.java:575)
     [exec]     at com.werken.werkz.WerkzProject.attainGoal(WerkzProject.java:193)
     [exec]     at org.apache.maven.plugin.PluginManager.attainGoals(PluginManager.java:600)
     [exec]     at org.apache.maven.MavenSession.attainGoals(MavenSession.java:304)
     [exec]     at org.apache.maven.jelly.tags.maven.MavenTag.doTag(MavenTag.java:122)
     [exec]     at org.apache.commons.jelly.impl.TagScript.run(TagScript.java:279)
     [exec]     at org.apache.commons.jelly.impl.ScriptBlock.run(ScriptBlock.java:135)
     [exec]     at org.apache.commons.jelly.TagSupport.invokeBody(TagSupport.java:233)
     [exec]     at org.apache.commons.jelly.tags.util.AvailableTag.doTag(AvailableTag.java:110)
     [exec]     at org.apache.commons.jelly.impl.TagScript.run(TagScript.java:279)
     [exec]     at org.apache.commons.jelly.impl.ScriptBlock.run(ScriptBlock.java:135)
     [exec]     at org.apache.maven.jelly.tags.werkz.MavenGoalTag.runBodyTag(MavenGoalTag.java:117)
     [exec]     at org.apache.maven.jelly.tags.werkz.MavenGoalTag$MavenGoalAction.performAction(MavenGoalTag.java:143)
     [exec]     at com.werken.werkz.Goal.fire(Goal.java:639)
     [exec]     at com.werken.werkz.Goal.attain(Goal.java:575)
     [exec]     at com.werken.werkz.WerkzProject.attainGoal(WerkzProject.java:193)
     [exec]     at org.apache.maven.plugin.PluginManager.attainGoals(PluginManager.java:600)
     [exec]     at org.apache.maven.MavenSession.attainGoals(MavenSession.java:304)
     [exec]     at org.apache.maven.jelly.tags.maven.ReactorTag.doTag(ReactorTag.java:312)
     [exec]     at org.apache.commons.jelly.impl.TagScript.run(TagScript.java:279)
     [exec]     at org.apache.commons.jelly.impl.ScriptBlock.run(ScriptBlock.java:135)
     [exec]     at org.apache.maven.jelly.tags.werkz.MavenGoalTag.runBodyTag(MavenGoalTag.java:117)
     [exec]     at org.apache.maven.jelly.tags.werkz.MavenGoalTag$MavenGoalAction.performAction(MavenGoalTag.java:143)
     [exec]     at com.werken.werkz.Goal.fire(Goal.java:639)
     [exec]     at com.werken.werkz.Goal.attain(Goal.java:575)
     [exec]     at com.werken.werkz.WerkzProject.attainGoal(WerkzProject.java:193)
     [exec]     at org.apache.maven.plugin.PluginManager.attainGoals(PluginManager.java:600)
     [exec]     at org.apache.maven.MavenSession.attainGoals(MavenSession.java:304)
     [exec]     at org.apache.maven.cli.App.doMain(App.java:490)
     [exec]     at org.apache.maven.cli.App.main(App.java:1141)
     [exec]     at sun.reflect.NativeMethodAccessorImpl.invoke0(Native Method)
     [exec]     at sun.reflect.NativeMethodAccessorImpl.invoke(NativeMethodAccessorImpl.java:39)
     [exec]     at sun.reflect.DelegatingMethodAccessorImpl.invoke(DelegatingMethodAccessorImpl.java:25)
     [exec]     at java.lang.reflect.Method.invoke(Method.java:324)
     [exec]     at com.werken.forehead.Forehead.run(Forehead.java:551)
     [exec]     at com.werken.forehead.Forehead.main(Forehead.java:581)
     [exec] File...... file:/C:/Work/Apps/Maven/maven/maven.xml
     [exec] Element... maven:reactor
     [exec] Total time: 37 seconds
     [exec] Finished at: Tue Feb 03 09:22:00 CET 2004

     [exec] Line...... 79
     [exec] Column.... 7
     [exec] Unable to obtain goal [plugin:test] -- file:/C:/Dokumente und Einstellungen/jos/.maven/plugins/maven-plugin-plugin-1.2-SNAPSHOT/plugin.jelly:239:34:
<maven:maven> Unable to obtain goal [testPlugin] -- file:/C:/Dokumente und Einstellungen/jos/.maven/plugins/maven-multiproject-plugin-1.2-SNAPSHOT/plugin.jelly:184:9:
<maven:reactor> Reactor subproject failure occurred
     [echo] 
     [echo] +------------------------------------------------------------------+
     [echo] |                                                                  |
     [echo] | B U I L D I N G  M A V E N  W I T H  I T S E L F                 |
     [echo] |                                                                  |
     [echo] +------------------------------------------------------------------+
...
========= snap ===============

Regards,
Jörg

---------------------------------------------------------------------
To unsubscribe, e-mail: dev-unsubscribe@maven.apache.org
For additional commands, e-mail: dev-help@maven.apache.org


Mime
View raw message