maven-dev mailing list archives

Site index · List index
Message view « Date » · « Thread »
Top « Date » · « Thread »
From "James CE Johnson" <j...@tragus.org>
Subject CVS HEAD build failures
Date Mon, 02 Dec 2002 13:49:06 GMT
Good morning,

I can't seem to build the mainline this morning. When I try, I get this:


     [echo]
     [echo]
+------------------------------------------------------------------+
     [echo] |                                                             
    |
     [echo] | B U I L D I N G  T H E  P L U G I N S                       
    |
     [echo] |                                                             
    |
     [echo]
+------------------------------------------------------------------+
     [echo]
     [exec]  __  __
     [exec] |  \/  |__ Jakarta _ ___
     [exec] | |\/| / _` \ V / -_) ' \  ~ intelligent projects ~
     [exec] |_|  |_\__,_|\_/\___|_||_|   v. 1.0-beta-8

     [exec] /home/jcej/jakarta/jakarta-turbine-maven-20021202

     [exec] maven:plugins-build:
     [exec] [ERROR] java.lang.reflect.InvocationTargetException
     [exec] [ERROR]     at
sun.reflect.NativeMethodAccessorImpl.invoke0(Native Method)
     [exec] [ERROR]     at
sun.reflect.NativeMethodAccessorImpl.invoke(NativeMethodAccessorImpl.java:39)
     [exec] [ERROR]     at
sun.reflect.DelegatingMethodAccessorImpl.invoke(DelegatingMethodAccessorImpl.java:25)
     [exec] [ERROR]     at java.lang.reflect.Method.invoke(Method.java:324)
     [exec] [ERROR]     at
com.werken.forehead.Forehead.run(Forehead.java:543)
     [exec] [ERROR]     at
com.werken.forehead.Forehead.main(Forehead.java:573)
     [exec] [ERROR] Caused by:
javax.xml.parsers.FactoryConfigurationError: Provider
org.apache.xerces.jaxp.SAXParserFactoryImpl not found
     [exec] [ERROR]     at
javax.xml.parsers.SAXParserFactory.newInstance(SAXParserFactory.java:93)
     [exec] [ERROR]     at
org.apache.maven.jelly.JellyUtils.compileScript(JellyUtils.java:193)
     [exec] [ERROR]     at
org.apache.maven.MavenUtils.getJellyProject(MavenUtils.java:205)
     [exec] [ERROR]     at
org.apache.maven.MavenUtils.getProject(MavenUtils.java:167)
     [exec] [ERROR]     at
org.apache.maven.MavenUtils.getProjects(MavenUtils.java:394)
     [exec] [ERROR]     at
org.apache.maven.jelly.tags.project.ReactorTag.doTag(ReactorTag.java:125)
     [exec] [ERROR]     at
org.apache.commons.jelly.impl.TagScript.run(TagScript.java:277)
     [exec] [ERROR]     at
org.apache.commons.jelly.impl.ScriptBlock.run(ScriptBlock.java:134)
     [exec] [ERROR]     at
org.apache.commons.jelly.TagSupport.invokeBody(TagSupport.java:193)
     [exec] [ERROR]     at
org.apache.commons.jelly.tags.werkz.GoalTag$1.performAction(GoalTag.java:119)
     [exec] [ERROR]     at com.werken.werkz.Goal.fire(Goal.java:632)
     [exec] [ERROR]     at com.werken.werkz.Goal.attain(Goal.java:568)
     [exec] [ERROR]     at org.apache.maven.Maven.runGoals(Maven.java:467)
     [exec] [ERROR]     at org.apache.maven.Maven.attainGoals(Maven.java:381)
     [exec] [ERROR]     at org.apache.maven.cli.App.doMain(App.java:551)
     [exec] [ERROR]     at org.apache.maven.cli.App.main(App.java:1096)
     [exec] [ERROR]     ... 6 more


I then did a checkout of '-D 2002-12-01' and it had an issue with the
vdoclet (?) plugin.

Version '-D 2002-11-30' seems to build OK.

This is on a Mandrake 9.0 box, j2sdk 1.4.0_01, ant 1.5

Later,
J




Mime
View raw message