maven-dev mailing list archives

Site index · List index
Message view « Date » · « Thread »
Top « Date » · « Thread »
From b..@werken.com
Subject [maven-bug] Closed: (MAVEN-15) Performance
Date Tue, 03 Dec 2002 05:51:22 GMT
Message:

   The following issue has been closed.

   Resolver: Jason van Zyl
       Date: Mon, 2 Dec 2002 11:51 PM

Caching now helps to make things decent.
---------------------------------------------------------------------
View the issue:

  http://jira.werken.com/secure/ViewIssue.jspa?key=MAVEN-15


Here is an overview of the issue:
---------------------------------------------------------------------
        Key: MAVEN-15
    Summary: Performance
       Type: Bug

     Status: Closed
   Priority: Major
 Resolution: FIXED

 Time Spent: Unknown
   Estimate: Unknown

    Project: maven
  Component: core
   Versions:
             b5

   Assignee: Jason van Zyl
   Reporter: dion gillard

    Created: Sun, 4 Aug 2002 2:29 AM
    Updated: Mon, 2 Dec 2002 11:51 PM

Description:
b5 takes 16 seconds to work out the plugin or goal name is invalid on a P3 1GHz, e.g.:

[dion@dhcp-795-11 jakarta-turbine-maven]$ maven validate-pom
 __  __
|  \/  |__ Jakarta _ ___
| |\/| / _` \ V / -_) ' \  ~ intelligent projects ~
|_|  |_\__,_|\_/\___|_||_|   v. 1.0-b5-dev

Maven (maven) 1.0-b5-dev
/home/dion/source/jakarta-turbine-maven

Getting: http://jakarta.apache.org/turbine/jars2/non-distributable-jars.list
Not modified - so not downloaded
Getting: http://jakarta.apache.org/turbine/jars2/commons-betwixt/jars/commons-betwixt-SNAPSHOT.jar
Not modified - so not downloaded
Getting: http://jakarta.apache.org/turbine/jars2/commons-jelly/jars/commons-jelly-SNAPSHOT.jar
Not modified - so not downloaded
Getting: http://jakarta.apache.org/turbine/jars2/commons-jexl/jars/commons-jexl-1.0-dev.jar
Not modified - so not downloaded
Getting: http://jakarta.apache.org/turbine/jars2/werkz/jars/werkz-SNAPSHOT.jar
Not modified - so not downloaded
Getting: http://jakarta.apache.org/turbine/jars2/commons-beanutils/jars/commons-beanutils-SNAPSHOT.jar
Not modified - so not downloaded
Getting: http://jakarta.apache.org/turbine/jars2/commons-cli/jars/commons-cli-SNAPSHOT.jar
Not modified - so not downloaded
Getting: http://jakarta.apache.org/turbine/jars2/commons-util/jars/commons-util-1.0-rc2-dev.jar
Not modified - so not downloaded
Getting: http://jakarta.apache.org/turbine/jars2/velocity/jars/velocity-1.4-dev.jar
Not modified - so not downloaded
[ERROR] BUILD FAILED
[ERROR] Goal "validate-pom" does not exist in this project.
Total time: 16 seconds




---------------------------------------------------------------------
JIRA INFORMATION:
This message is automatically generated by JIRA.

If you think it was sent incorrectly contact one of the administrators:
   http://jira.werken.com/Administrators.jspa

If you want more information on JIRA, or have a bug to report see:
   http://www.atlassian.com/software/jira


Mime
View raw message