maven-commits mailing list archives

Site index · List index
Message view « Date » · « Thread »
Top « Date » · « Thread »
From Continuum <contin...@maven.zones.apache.org>
Subject [continuum] BUILD FAILURE: Maven Plugin Descriptor Model
Date Wed, 04 Jan 2006 02:56:41 GMT
Online report : http://maven.zones.apache.org:8080/continuum/servlet/continuum/target/ProjectBuild.vm/view/ProjectBuild/id/11/buildId/1953
Build statistics:
  State: Failed
  Previous State: Ok
  Started at: Wed, 4 Jan 2006 02:55:17 +0000
  Finished at: Wed, 4 Jan 2006 02:56:36 +0000
  Total time: 1m 19s
  Build Trigger: Forced
  Exit code: 1
  Building machine hostname: maven.zones.apache.org
  Operating system : SunOS(unknown)
  Java version : 1.4.2_09(Sun Microsystems Inc.)

Changes
      No files changed
  
****************************************************************************
Output:
****************************************************************************
[INFO] Scanning for projects...
[INFO] ----------------------------------------------------------------------------
[INFO] Building Maven Plugin Descriptor Model
[INFO]    task-segment: [clean, install]
[INFO] ----------------------------------------------------------------------------
Downloading: http://test.maven.codehaus.org/maven2/org/codehaus/modello/modello-maven-plugin/1.0-alpha-7/modello-maven-plugin-1.0-alpha-7.pom
2K downloaded
Downloading: http://test.maven.codehaus.org/maven2/org/codehaus/modello/modello/1.0-alpha-7/modello-1.0-alpha-7.pom
8K downloaded
Downloading: http://test.maven.codehaus.org/maven2/org/codehaus/modello/modello-maven-plugin/1.0-alpha-7/modello-maven-plugin-1.0-alpha-7.jar
10K downloaded
[INFO] [clean:clean]
[INFO] Deleting directory /export/home/continuum/data/work/11/target
Downloading: http://test.maven.codehaus.org/maven2/org/codehaus/modello/modello-plugin-xsd/1.0-alpha-7/modello-plugin-xsd-1.0-alpha-7.pom
605b downloaded
Downloading: http://test.maven.codehaus.org/maven2/org/codehaus/modello/modello-plugins/1.0-alpha-7/modello-plugins-1.0-alpha-7.pom
1K downloaded
Downloading: http://test.maven.codehaus.org/maven2/org/codehaus/modello/modello-core/1.0-alpha-7/modello-core-1.0-alpha-7.pom
783b downloaded
Downloading: http://test.maven.codehaus.org/maven2/org/codehaus/modello/modello-plugin-xml/1.0-alpha-7/modello-plugin-xml-1.0-alpha-7.pom
402b downloaded
Downloading: http://test.maven.codehaus.org/maven2/org/codehaus/modello/modello-plugin-xpp3/1.0-alpha-7/modello-plugin-xpp3-1.0-alpha-7.pom
762b downloaded
Downloading: http://test.maven.codehaus.org/maven2/org/codehaus/modello/modello-plugin-xdoc/1.0-alpha-7/modello-plugin-xdoc-1.0-alpha-7.pom
607b downloaded
Downloading: http://test.maven.codehaus.org/maven2/org/codehaus/modello/modello-plugin-jpox/1.0-alpha-7/modello-plugin-jpox-1.0-alpha-7.pom
609b downloaded
Downloading: http://test.maven.codehaus.org/maven2/org/codehaus/modello/modello-plugin-store/1.0-alpha-7/modello-plugin-store-1.0-alpha-7.pom
568b downloaded
Downloading: http://test.maven.codehaus.org/maven2/org/codehaus/modello/modello-plugin-prevayler/1.0-alpha-7/modello-plugin-prevayler-1.0-alpha-7.pom
619b downloaded
Downloading: http://test.maven.codehaus.org/maven2/org/codehaus/modello/modello-plugin-store/1.0-alpha-7/modello-plugin-store-1.0-alpha-7.jar
14K downloaded
Downloading: http://test.maven.codehaus.org/maven2/org/codehaus/modello/modello-core/1.0-alpha-7/modello-core-1.0-alpha-7.jar
152K downloaded
Downloading: http://test.maven.codehaus.org/maven2/org/codehaus/modello/modello-plugin-xml/1.0-alpha-7/modello-plugin-xml-1.0-alpha-7.jar
8K downloaded
Downloading: http://test.maven.codehaus.org/maven2/org/codehaus/modello/modello-plugin-prevayler/1.0-alpha-7/modello-plugin-prevayler-1.0-alpha-7.jar
5K downloaded
Downloading: http://test.maven.codehaus.org/maven2/org/codehaus/modello/modello-plugin-xsd/1.0-alpha-7/modello-plugin-xsd-1.0-alpha-7.jar
6K downloaded
Downloading: http://test.maven.codehaus.org/maven2/org/codehaus/modello/modello-plugin-xdoc/1.0-alpha-7/modello-plugin-xdoc-1.0-alpha-7.jar
6K downloaded
Downloading: http://test.maven.codehaus.org/maven2/org/codehaus/modello/modello-plugin-jpox/1.0-alpha-7/modello-plugin-jpox-1.0-alpha-7.jar
16K downloaded
Downloading: http://test.maven.codehaus.org/maven2/org/codehaus/modello/modello-plugin-xpp3/1.0-alpha-7/modello-plugin-xpp3-1.0-alpha-7.jar
21K downloaded
[INFO] Setting property: classpath.resource.loader.class => 'org.codehaus.plexus.velocity.ContextClassLoaderResourceLoader'.
[INFO] Setting property: velocimacro.messages.on => 'false'.
[INFO] Setting property: resource.loader => 'classpath'.
[INFO] Setting property: resource.manager.logwhenfound => 'false'.
[INFO] ************************************************************** 
[INFO] Starting Jakarta Velocity v1.4
[INFO] RuntimeInstance initializing.
[INFO] Default Properties File: org/apache/velocity/runtime/defaults/velocity.properties
[INFO] Default ResourceManager initializing. (class org.apache.velocity.runtime.resource.ResourceManagerImpl)
[INFO] Resource Loader Instantiated: org.codehaus.plexus.velocity.ContextClassLoaderResourceLoader
[INFO] ClasspathResourceLoader : initialization starting.
[INFO] ClasspathResourceLoader : initialization complete.
[INFO] ResourceCache : initialized. (class org.apache.velocity.runtime.resource.ResourceCacheImpl)
[INFO] Default ResourceManager initialization complete.
[INFO] Loaded System Directive: org.apache.velocity.runtime.directive.Literal
[INFO] Loaded System Directive: org.apache.velocity.runtime.directive.Macro
[INFO] Loaded System Directive: org.apache.velocity.runtime.directive.Parse
[INFO] Loaded System Directive: org.apache.velocity.runtime.directive.Include
[INFO] Loaded System Directive: org.apache.velocity.runtime.directive.Foreach
[INFO] Created: 20 parsers.
[INFO] Velocimacro : initialization starting.
[INFO] Velocimacro : adding VMs from VM library template : VM_global_library.vm
[ERROR] ResourceManager : unable to find resource 'VM_global_library.vm' in any resource loader.
[INFO] Velocimacro : error using  VM library template VM_global_library.vm : org.apache.velocity.exception.ResourceNotFoundException:
Unable to find resource 'VM_global_library.vm'
[INFO] Velocimacro :  VM library template macro registration complete.
[INFO] Velocimacro : allowInline = true : VMs can be defined inline in templates
[INFO] Velocimacro : allowInlineToOverride = false : VMs defined inline may NOT replace previous
VM definitions
[INFO] Velocimacro : allowInlineLocal = false : VMs defined inline will be  global in scope
if allowed.
[INFO] Velocimacro : initialization complete.
[INFO] Velocity successfully started.
[INFO] [modello:java {execution: default}]
[INFO] outputDirectory: /export/home/continuum/data/work/11/target/generated-sources/modello
[INFO] [modello:xpp3-reader {execution: default}]
[INFO] outputDirectory: /export/home/continuum/data/work/11/target/generated-sources/modello
[INFO] [modello:xpp3-writer {execution: default}]
[INFO] outputDirectory: /export/home/continuum/data/work/11/target/generated-sources/modello
[INFO] [resources:resources]
[INFO] Using default encoding to copy filtered resources.
Downloading: http://snapshots.maven.codehaus.org/maven2/org/apache/maven/maven-plugin-api/2.1-SNAPSHOT/maven-plugin-api-2.1-SNAPSHOT.pom
[WARNING] Unable to get resource from repository snapshots (http://snapshots.maven.codehaus.org/maven2)
Downloading: http://cvs.apache.org/maven-snapshot-repository/org/apache/maven/maven-plugin-api/2.1-SNAPSHOT/maven-plugin-api-2.1-SNAPSHOT.pom
[WARNING] Unable to get resource from repository apache.snapshots (http://cvs.apache.org/maven-snapshot-repository)
[WARNING] 
	Artifact junit:junit:jar:3.8.1 retains local scope 'test' overriding broader scope 'compile'
	given by a dependency. If this is not intended, modify or remove the local scope.

Downloading: http://snapshots.maven.codehaus.org/maven2/org/apache/maven/maven-plugin-api/2.1-SNAPSHOT/maven-plugin-api-2.1-SNAPSHOT.jar
[WARNING] Unable to get resource from repository snapshots (http://snapshots.maven.codehaus.org/maven2)
Downloading: http://cvs.apache.org/maven-snapshot-repository/org/apache/maven/maven-plugin-api/2.1-SNAPSHOT/maven-plugin-api-2.1-SNAPSHOT.jar
[WARNING] Unable to get resource from repository apache.snapshots (http://cvs.apache.org/maven-snapshot-repository)
[INFO] ----------------------------------------------------------------------------
[ERROR] BUILD ERROR
[INFO] ----------------------------------------------------------------------------
[INFO] Failed to resolve artifact.

required artifacts missing:
  org.apache.maven:maven-plugin-api:jar:2.1-SNAPSHOT

for the artifact:
  org.apache.maven:maven-plugin-descriptor:jar:2.1-SNAPSHOT

from the specified remote repositories:
  central (http://repo1.maven.org/maven2),
  apache.snapshots (http://cvs.apache.org/maven-snapshot-repository),
  snapshots (http://snapshots.maven.codehaus.org/maven2)


[INFO] ----------------------------------------------------------------------------
[INFO] For more information, run Maven with the -e switch
[INFO] ----------------------------------------------------------------------------
[INFO] Total time: 1 minute 16 seconds
[INFO] Finished at: Wed Jan 04 02:56:36 GMT+00:00 2006
[INFO] Final Memory: 6M/11M
[INFO] ----------------------------------------------------------------------------

****************************************************************************



Mime
View raw message