maven-commits mailing list archives

Site index · List index
Message view « Date » · « Thread »
Top « Date » · « Thread »
From Continuum <contin...@maven.zones.apache.org>
Subject [continuum] BUILD FAILURE: Maven Archiver
Date Thu, 05 Jan 2006 04:08:00 GMT
Online report : http://maven.zones.apache.org:8080/continuum/servlet/continuum/target/ProjectBuild.vm/view/ProjectBuild/id/2/buildId/2114
Build statistics:
  State: Failed
  Previous State: Ok
  Started at: Thu, 5 Jan 2006 04:07:53 +0000
  Finished at: Thu, 5 Jan 2006 04:07:56 +0000
  Total time: 2s
  Build Trigger: Forced
  Exit code: 1
  Building machine hostname: maven.zones.apache.org
  Operating system : SunOS(unknown)
  Java version : 1.4.2_09(Sun Microsystems Inc.)

Changes
      No files changed
  
****************************************************************************
Output:
****************************************************************************
[INFO] Scanning for projects...
[INFO] ----------------------------------------------------------------------------
[ERROR] FATAL ERROR
[INFO] ----------------------------------------------------------------------------
[INFO] Failed to resolve artifact.

GroupId: org.apache.maven
ArtifactId: maven
Version: 2.1-SNAPSHOT

Reason: Unable to download the artifact from any repository
  org.apache.maven:maven:pom:2.1-SNAPSHOT

from the specified remote repositories:
  central (http://repo1.maven.org/maven2)


[INFO] ----------------------------------------------------------------------------
[INFO] Trace
org.apache.maven.reactor.MavenExecutionException: POM 'org.apache.maven:maven' not found in
repository: Unable to download the artifact from any repository
  org.apache.maven:maven:pom:2.1-SNAPSHOT

from the specified remote repositories:
  central (http://repo1.maven.org/maven2)

	at org.apache.maven.DefaultMaven.getProjects(DefaultMaven.java:365)
	at org.apache.maven.DefaultMaven.doExecute(DefaultMaven.java:278)
	at org.apache.maven.DefaultMaven.execute(DefaultMaven.java:115)
	at org.apache.maven.cli.MavenCli.main(MavenCli.java:249)
	at sun.reflect.NativeMethodAccessorImpl.invoke0(Native Method)
	at sun.reflect.NativeMethodAccessorImpl.invoke(NativeMethodAccessorImpl.java:39)
	at sun.reflect.DelegatingMethodAccessorImpl.invoke(DelegatingMethodAccessorImpl.java:25)
	at java.lang.reflect.Method.invoke(Method.java:324)
	at org.codehaus.classworlds.Launcher.launchEnhanced(Launcher.java:315)
	at org.codehaus.classworlds.Launcher.launch(Launcher.java:255)
	at org.codehaus.classworlds.Launcher.mainWithExitCode(Launcher.java:430)
	at org.codehaus.classworlds.Launcher.main(Launcher.java:375)
Caused by: org.apache.maven.project.ProjectBuildingException: POM 'org.apache.maven:maven'
not found in repository: Unable to download the artifact from any repository
  org.apache.maven:maven:pom:2.1-SNAPSHOT

from the specified remote repositories:
  central (http://repo1.maven.org/maven2)

	at org.apache.maven.project.DefaultMavenProjectBuilder.findModelFromRepository(DefaultMavenProjectBuilder.java:420)
	at org.apache.maven.project.DefaultMavenProjectBuilder.assembleLineage(DefaultMavenProjectBuilder.java:952)
	at org.apache.maven.project.DefaultMavenProjectBuilder.build(DefaultMavenProjectBuilder.java:583)
	at org.apache.maven.project.DefaultMavenProjectBuilder.buildFromSourceFile(DefaultMavenProjectBuilder.java:295)
	at org.apache.maven.project.DefaultMavenProjectBuilder.build(DefaultMavenProjectBuilder.java:273)
	at org.apache.maven.DefaultMaven.getProject(DefaultMaven.java:515)
	at org.apache.maven.DefaultMaven.collectProjects(DefaultMaven.java:447)
	at org.apache.maven.DefaultMaven.getProjects(DefaultMaven.java:351)
	... 11 more
Caused by: org.apache.maven.artifact.resolver.ArtifactNotFoundException: Unable to download
the artifact from any repository
  org.apache.maven:maven:pom:2.1-SNAPSHOT

from the specified remote repositories:
  central (http://repo1.maven.org/maven2)

	at org.apache.maven.artifact.resolver.DefaultArtifactResolver.resolve(DefaultArtifactResolver.java:136)
	at org.apache.maven.artifact.resolver.DefaultArtifactResolver.resolve(DefaultArtifactResolver.java:63)
	at org.apache.maven.project.DefaultMavenProjectBuilder.findModelFromRepository(DefaultMavenProjectBuilder.java:377)
	... 18 more
Caused by: org.apache.maven.wagon.ResourceDoesNotExistException: Unable to download the artifact
from any repository
	at org.apache.maven.artifact.manager.DefaultWagonManager.getArtifact(DefaultWagonManager.java:260)
	at org.apache.maven.artifact.resolver.DefaultArtifactResolver.resolve(DefaultArtifactResolver.java:124)
	... 20 more
[INFO] ----------------------------------------------------------------------------
[INFO] Total time: < 1 second
[INFO] Finished at: Thu Jan 05 04:07:55 GMT+00:00 2006
[INFO] Final Memory: 1M/2M
[INFO] ----------------------------------------------------------------------------

****************************************************************************



Mime
View raw message