maven-commits mailing list archives

Site index · List index
Message view « Date » · « Thread »
Top « Date » · « Thread »
From Continuum <contin...@maven.zones.apache.org>
Subject [continuum] BUILD FAILURE: Maven Repository Standard Reports
Date Sat, 10 Dec 2005 20:40:52 GMT
Online report : http://maven.zones.apache.org:8080/continuum/servlet/continuum/target/ProjectBuild.vm/view/ProjectBuild/id/33/buildId/503
Build statistics:
  State: Failed
  Previous State: Failed
  Started at: Sat, 10 Dec 2005 20:40:28 +0000
  Finished at: Sat, 10 Dec 2005 20:40:51 +0000
  Total time: 22s
  Build Trigger: Forced
  Exit code: 1
  Building machine hostname: maven.zones.apache.org
  Operating system : SunOS(unknown)
  Java version : 1.4.2_09(Sun Microsystems Inc.)

Changes
      No files changed
  
****************************************************************************
Output:
****************************************************************************
[INFO] Scanning for projects...
[INFO] ----------------------------------------------------------------------------
[INFO] Building Maven Repository Standard Reports
[INFO]    task-segment: [clean, install]
[INFO] ----------------------------------------------------------------------------
[INFO] [clean:clean]
[INFO] Deleting directory /export/home/continuum/continuum-1.0.1/apps/continuum/working-directory/33/target
[INFO] [resources:resources]
[INFO] Using default encoding to copy filtered resources.
[WARNING] 
	Artifact junit:junit:jar:3.8.1 retains local scope 'test' overriding broader scope 'compile'
	given by a dependency. If this is not intended, modify or remove the local scope.

[INFO] [compiler:compile]
Compiling 15 source files to /export/home/continuum/continuum-1.0.1/apps/continuum/working-directory/33/target/classes
[INFO] [resources:testResources]
[INFO] Using default encoding to copy filtered resources.
[INFO] [compiler:testCompile]
Compiling 15 source files to /export/home/continuum/continuum-1.0.1/apps/continuum/working-directory/33/target/test-classes
[INFO] ----------------------------------------------------------------------------
[ERROR] BUILD FAILURE
[INFO] ----------------------------------------------------------------------------
[INFO] Compilation failure

/export/home/continuum/continuum-1.0.1/apps/continuum/working-directory/33/src/test/java/org/apache/maven/repository/reporting/MockArtifactFactory.java:[26,7]
org.apache.maven.repository.reporting.MockArtifactFactory is not abstract and does not override
abstract method createDependencyArtifact(java.lang.String,java.lang.String,org.apache.maven.artifact.versioning.VersionRange,java.lang.String,java.lang.String,java.lang.String,boolean)
in org.apache.maven.artifact.factory.ArtifactFactory

/export/home/continuum/continuum-1.0.1/apps/continuum/working-directory/33/src/test/java/org/apache/maven/repository/reporting/MockArtifact.java:[35,7]
org.apache.maven.repository.reporting.MockArtifact is not abstract and does not override abstract
method setOptional(boolean) in org.apache.maven.artifact.Artifact


[INFO] ----------------------------------------------------------------------------
[INFO] For more information, run Maven with the -e switch
[INFO] ----------------------------------------------------------------------------
[INFO] Total time: 16 seconds
[INFO] Finished at: Sat Dec 10 20:40:51 GMT+00:00 2005
[INFO] Final Memory: 4M/9M
[INFO] ----------------------------------------------------------------------------

****************************************************************************



Mime
View raw message