maven-commits mailing list archives

Site index · List index
Message view « Date » · « Thread »
Top « Date » · « Thread »
From Continuum <contin...@maven.zones.apache.org>
Subject [continuum] BUILD FAILURE: Maven Profile Model
Date Sat, 10 Dec 2005 04:43:35 GMT
Online report : http://maven.zones.apache.org:8080/continuum/servlet/continuum/target/ProjectBuild.vm/view/ProjectBuild/id/19/buildId/462
Build statistics:
  State: Failed
  Previous State: Error
  Started at: Sat, 10 Dec 2005 04:42:48 +0000
  Finished at: Sat, 10 Dec 2005 04:43:31 +0000
  Total time: 43s
  Build Trigger: Forced
  Exit code: 1
  Building machine hostname: maven.zones.apache.org
  Operating system : SunOS(unknown)
  Java version : 1.4.2_09(Sun Microsystems Inc.)

Changes
      No files changed
  
****************************************************************************
Output:
****************************************************************************
[INFO] Scanning for projects...
[INFO] ----------------------------------------------------------------------------
[INFO] Building Maven Profile Model
[INFO]    task-segment: [clean, install]
[INFO] ----------------------------------------------------------------------------
[INFO] snapshot org.codehaus.modello:modello-maven-plugin:1.0-alpha-7-SNAPSHOT: checking for
updates from snapshots
[INFO] snapshot org.codehaus.modello:modello-maven-plugin:1.0-alpha-7-SNAPSHOT: checking for
updates from apache.snapshots
Downloading: http://snapshots.maven.codehaus.org/maven2/org/codehaus/modello/modello-maven-plugin/1.0-alpha-7-SNAPSHOT/modello-maven-plugin-1.0-alpha-7-20051209.174352-2.pom
2K downloaded
[INFO] snapshot org.codehaus.modello:modello:1.0-alpha-7-SNAPSHOT: checking for updates from
snapshots
[INFO] snapshot org.codehaus.modello:modello:1.0-alpha-7-SNAPSHOT: checking for updates from
apache.snapshots
Downloading: http://snapshots.maven.codehaus.org/maven2/org/codehaus/modello/modello/1.0-alpha-7-SNAPSHOT/modello-1.0-alpha-7-20051209.074935-2.pom
7K downloaded
Downloading: http://snapshots.maven.codehaus.org/maven2/org/codehaus/modello/modello-maven-plugin/1.0-alpha-7-SNAPSHOT/modello-maven-plugin-1.0-alpha-7-20051209.174352-2.jar
11K downloaded
[INFO] [clean:clean]
[INFO] Deleting directory /export/home/continuum/continuum-1.0.1/apps/continuum/working-directory/19/target
[INFO] snapshot org.codehaus.modello:modello-plugin-xsd:1.0-alpha-7-SNAPSHOT: checking for
updates from snapshots
Downloading: http://snapshots.maven.codehaus.org/maven2/org/codehaus/modello/modello-plugin-xsd/1.0-alpha-7-SNAPSHOT/modello-plugin-xsd-1.0-alpha-7-20051209.221143-3.pom
641b downloaded
[INFO] snapshot org.codehaus.modello:modello-plugins:1.0-alpha-7-SNAPSHOT: checking for updates
from snapshots
Downloading: http://snapshots.maven.codehaus.org/maven2/org/codehaus/modello/modello-plugins/1.0-alpha-7-SNAPSHOT/modello-plugins-1.0-alpha-7-20051209.074935-1.pom
1K downloaded
[INFO] snapshot org.codehaus.modello:modello-core:1.0-alpha-7-SNAPSHOT: checking for updates
from snapshots
Downloading: http://snapshots.maven.codehaus.org/maven2/org/codehaus/modello/modello-core/1.0-alpha-7-SNAPSHOT/modello-core-1.0-alpha-7-20051209.074935-1.pom
819b downloaded
[INFO] snapshot org.codehaus.modello:modello-plugin-xml:1.0-alpha-7-SNAPSHOT: checking for
updates from snapshots
Downloading: http://snapshots.maven.codehaus.org/maven2/org/codehaus/modello/modello-plugin-xml/1.0-alpha-7-SNAPSHOT/modello-plugin-xml-1.0-alpha-7-20051209.111224-4.pom
429b downloaded
[INFO] snapshot org.codehaus.modello:modello-plugin-jpox:1.0-alpha-7-SNAPSHOT: checking for
updates from snapshots
Downloading: http://snapshots.maven.codehaus.org/maven2/org/codehaus/modello/modello-plugin-jpox/1.0-alpha-7-SNAPSHOT/modello-plugin-jpox-1.0-alpha-7-20051209.223912-5.pom
645b downloaded
[INFO] snapshot org.codehaus.modello:modello-plugin-store:1.0-alpha-7-SNAPSHOT: checking for
updates from snapshots
Downloading: http://snapshots.maven.codehaus.org/maven2/org/codehaus/modello/modello-plugin-store/1.0-alpha-7-SNAPSHOT/modello-plugin-store-1.0-alpha-7-20051209.220859-3.pom
595b downloaded
[INFO] snapshot org.codehaus.modello:modello-plugin-xdoc:1.0-alpha-7-SNAPSHOT: checking for
updates from snapshots
Downloading: http://snapshots.maven.codehaus.org/maven2/org/codehaus/modello/modello-plugin-xdoc/1.0-alpha-7-SNAPSHOT/modello-plugin-xdoc-1.0-alpha-7-20051209.075612-1.pom
643b downloaded
[INFO] snapshot org.codehaus.modello:modello-plugin-prevayler:1.0-alpha-7-SNAPSHOT: checking
for updates from snapshots
Downloading: http://snapshots.maven.codehaus.org/maven2/org/codehaus/modello/modello-plugin-prevayler/1.0-alpha-7-SNAPSHOT/modello-plugin-prevayler-1.0-alpha-7-20051209.220426-2.pom
655b downloaded
[INFO] snapshot org.codehaus.modello:modello-plugin-xpp3:1.0-alpha-7-SNAPSHOT: checking for
updates from snapshots
Downloading: http://snapshots.maven.codehaus.org/maven2/org/codehaus/modello/modello-plugin-xpp3/1.0-alpha-7-SNAPSHOT/modello-plugin-xpp3-1.0-alpha-7-20051209.111534-3.pom
643b downloaded
Downloading: http://snapshots.maven.codehaus.org/maven2/org/codehaus/modello/modello-plugin-prevayler/1.0-alpha-7-SNAPSHOT/modello-plugin-prevayler-1.0-alpha-7-20051209.220426-2.jar
6K downloaded
Downloading: http://snapshots.maven.codehaus.org/maven2/org/codehaus/modello/modello-plugin-xpp3/1.0-alpha-7-SNAPSHOT/modello-plugin-xpp3-1.0-alpha-7-20051209.111534-3.jar
22K downloaded
Downloading: http://snapshots.maven.codehaus.org/maven2/org/codehaus/modello/modello-plugin-xml/1.0-alpha-7-SNAPSHOT/modello-plugin-xml-1.0-alpha-7-20051209.111224-4.jar
9K downloaded
Downloading: http://snapshots.maven.codehaus.org/maven2/org/codehaus/modello/modello-core/1.0-alpha-7-SNAPSHOT/modello-core-1.0-alpha-7-20051209.074935-1.jar
153K downloaded
Downloading: http://snapshots.maven.codehaus.org/maven2/org/codehaus/modello/modello-plugin-jpox/1.0-alpha-7-SNAPSHOT/modello-plugin-jpox-1.0-alpha-7-20051209.223912-5.jar
18K downloaded
Downloading: http://snapshots.maven.codehaus.org/maven2/org/codehaus/modello/modello-plugin-store/1.0-alpha-7-SNAPSHOT/modello-plugin-store-1.0-alpha-7-20051209.220859-3.jar
15K downloaded
Downloading: http://snapshots.maven.codehaus.org/maven2/org/codehaus/modello/modello-plugin-xsd/1.0-alpha-7-SNAPSHOT/modello-plugin-xsd-1.0-alpha-7-20051209.221143-3.jar
8K downloaded
Downloading: http://snapshots.maven.codehaus.org/maven2/org/codehaus/modello/modello-plugin-xdoc/1.0-alpha-7-SNAPSHOT/modello-plugin-xdoc-1.0-alpha-7-20051209.075612-1.jar
7K downloaded
[INFO] Setting property: classpath.resource.loader.class => 'org.codehaus.plexus.velocity.ContextClassLoaderResourceLoader'.
[INFO] Setting property: velocimacro.messages.on => 'false'.
[INFO] Setting property: resource.loader => 'classpath'.
[INFO] Setting property: resource.manager.logwhenfound => 'false'.
[INFO] ************************************************************** 
[INFO] Starting Jakarta Velocity v1.4
[INFO] RuntimeInstance initializing.
[INFO] Default Properties File: org/apache/velocity/runtime/defaults/velocity.properties
[INFO] Default ResourceManager initializing. (class org.apache.velocity.runtime.resource.ResourceManagerImpl)
[INFO] Resource Loader Instantiated: org.codehaus.plexus.velocity.ContextClassLoaderResourceLoader
[INFO] ClasspathResourceLoader : initialization starting.
[INFO] ClasspathResourceLoader : initialization complete.
[INFO] ResourceCache : initialized. (class org.apache.velocity.runtime.resource.ResourceCacheImpl)
[INFO] Default ResourceManager initialization complete.
[INFO] Loaded System Directive: org.apache.velocity.runtime.directive.Literal
[INFO] Loaded System Directive: org.apache.velocity.runtime.directive.Macro
[INFO] Loaded System Directive: org.apache.velocity.runtime.directive.Parse
[INFO] Loaded System Directive: org.apache.velocity.runtime.directive.Include
[INFO] Loaded System Directive: org.apache.velocity.runtime.directive.Foreach
[INFO] Created: 20 parsers.
[INFO] Velocimacro : initialization starting.
[INFO] Velocimacro : adding VMs from VM library template : VM_global_library.vm
[ERROR] ResourceManager : unable to find resource 'VM_global_library.vm' in any resource loader.
[INFO] Velocimacro : error using  VM library template VM_global_library.vm : org.apache.velocity.exception.ResourceNotFoundException:
Unable to find resource 'VM_global_library.vm'
[INFO] Velocimacro :  VM library template macro registration complete.
[INFO] Velocimacro : allowInline = true : VMs can be defined inline in templates
[INFO] Velocimacro : allowInlineToOverride = false : VMs defined inline may NOT replace previous
VM definitions
[INFO] Velocimacro : allowInlineLocal = false : VMs defined inline will be  global in scope
if allowed.
[INFO] Velocimacro : initialization complete.
[INFO] Velocity successfully started.
[INFO] [modello:xpp3-writer {execution: default}]
[INFO] outputDirectory: /export/home/continuum/continuum-1.0.1/apps/continuum/working-directory/19/target/generated-sources/modello
[INFO] [modello:java {execution: default}]
[INFO] outputDirectory: /export/home/continuum/continuum-1.0.1/apps/continuum/working-directory/19/target/generated-sources/modello
[INFO] [modello:xpp3-reader {execution: default}]
[INFO] outputDirectory: /export/home/continuum/continuum-1.0.1/apps/continuum/working-directory/19/target/generated-sources/modello
[INFO] [resources:resources]
[INFO] Using default encoding to copy filtered resources.
[INFO] snapshot org.codehaus.plexus:plexus-utils:1.0.5-SNAPSHOT: checking for updates from
snapshots
Downloading: http://snapshots.maven.codehaus.org/maven2/org/codehaus/plexus/plexus-utils/1.0.5-SNAPSHOT/plexus-utils-1.0.5-20051207.205025-8.pom
936b downloaded
[INFO] snapshot org.apache.maven:maven-model:2.0.1-SNAPSHOT: checking for updates from snapshots
[INFO] snapshot org.apache.maven:maven-model:2.0.1-SNAPSHOT: checking for updates from apache.snapshots
Downloading: http://snapshots.maven.codehaus.org/maven2/org/apache/maven/maven-model/2.0.1-SNAPSHOT/maven-model-2.0.1-SNAPSHOT.pom
[WARNING] Unable to get resource from repository snapshots (http://snapshots.maven.codehaus.org/maven2)
Downloading: http://cvs.apache.org/maven-snapshot-repository/org/apache/maven/maven-model/2.0.1-SNAPSHOT/maven-model-2.0.1-SNAPSHOT.pom
[WARNING] Unable to get resource from repository apache.snapshots (http://cvs.apache.org/maven-snapshot-repository)
[INFO] snapshot org.codehaus.plexus:plexus-container-default:1.0-alpha-9-SNAPSHOT: checking
for updates from snapshots
Downloading: http://snapshots.maven.codehaus.org/maven2/org/codehaus/plexus/plexus-container-default/1.0-alpha-9-SNAPSHOT/plexus-container-default-1.0-alpha-9-20051129.040742-1.pom
1K downloaded
Downloading: http://test.maven.codehaus.org/maven2/org/codehaus/plexus/plexus-containers/1.0.3/plexus-containers-1.0.3.pom
492b downloaded
[WARNING] 
	Artifact junit:junit:jar:3.8.1 retains local scope 'test' overriding broader scope 'compile'
	given by a dependency. If this is not intended, modify or remove the local scope.

Downloading: http://snapshots.maven.codehaus.org/maven2/org/codehaus/plexus/plexus-utils/1.0.5-SNAPSHOT/plexus-utils-1.0.5-20051207.205025-8.jar
164K downloaded
Downloading: http://snapshots.maven.codehaus.org/maven2/org/apache/maven/maven-model/2.0.1-SNAPSHOT/maven-model-2.0.1-SNAPSHOT.jar
[WARNING] Unable to get resource from repository snapshots (http://snapshots.maven.codehaus.org/maven2)
Downloading: http://cvs.apache.org/maven-snapshot-repository/org/apache/maven/maven-model/2.0.1-SNAPSHOT/maven-model-2.0.1-SNAPSHOT.jar
[WARNING] Unable to get resource from repository apache.snapshots (http://cvs.apache.org/maven-snapshot-repository)
Downloading: http://snapshots.maven.codehaus.org/maven2/org/codehaus/plexus/plexus-container-default/1.0-alpha-9-SNAPSHOT/plexus-container-default-1.0-alpha-9-20051129.040742-1.jar
190K downloaded
[INFO] ----------------------------------------------------------------------------
[ERROR] BUILD ERROR
[INFO] ----------------------------------------------------------------------------
[INFO] Failed to resolve artifact.

required artifacts missing:
  org.apache.maven:maven-model:jar:2.0.1-SNAPSHOT

for the artifact:
  org.apache.maven:maven-profile:jar:2.0.1-SNAPSHOT

from the specified remote repositories:
  central (http://repo1.maven.org/maven2),
  apache.snapshots (http://cvs.apache.org/maven-snapshot-repository),
  snapshots (http://snapshots.maven.codehaus.org/maven2)


[INFO] ----------------------------------------------------------------------------
[INFO] For more information, run Maven with the -e switch
[INFO] ----------------------------------------------------------------------------
[INFO] Total time: 40 seconds
[INFO] Finished at: Sat Dec 10 04:43:31 GMT+00:00 2005
[INFO] Final Memory: 6M/12M
[INFO] ----------------------------------------------------------------------------

****************************************************************************



Mime
View raw message