maven-commits mailing list archives

Site index · List index
Message view « Date » · « Thread »
Top « Date » · « Thread »
From Continuum <contin...@maven.zones.apache.org>
Subject [continuum] BUILD SUCCESSFUL: Maven Artifact Manager
Date Sat, 24 Dec 2005 18:55:55 GMT
Online report : http://maven.zones.apache.org:8080/continuum/servlet/continuum/target/ProjectBuild.vm/view/ProjectBuild/id/4/buildId/1411
Build statistics:
  State: Ok
  Previous State: Failed
  Started at: Sat, 24 Dec 2005 18:55:44 +0000
  Finished at: Sat, 24 Dec 2005 18:55:51 +0000
  Total time: 7s
  Build Trigger: Forced
  Exit code: 0
  Building machine hostname: maven.zones.apache.org
  Operating system : SunOS(unknown)
  Java version : 1.4.2_09(Sun Microsystems Inc.)

Changes
      No files changed
  
****************************************************************************
Output:
****************************************************************************
[INFO] Scanning for projects...
[INFO] ----------------------------------------------------------------------------
[INFO] Building Maven Artifact Manager
[INFO]    task-segment: [clean, install]
[INFO] ----------------------------------------------------------------------------
[INFO] [clean:clean]
[INFO] Deleting directory /export/home/continuum/data/work/4/target
[INFO] [resources:resources]
[INFO] Using default encoding to copy filtered resources.
[WARNING] 
	Artifact junit:junit:jar:3.8.1 retains local scope 'test' overriding broader scope 'compile'
	given by a dependency. If this is not intended, modify or remove the local scope.

[INFO] [compiler:compile]
Compiling 23 source files to /export/home/continuum/data/work/4/target/classes
[INFO] [resources:testResources]
[INFO] Using default encoding to copy filtered resources.
[INFO] [compiler:testCompile]
Compiling 8 source files to /export/home/continuum/data/work/4/target/test-classes
[INFO] [surefire:test]
[INFO] Setting reports dir: /export/home/continuum/data/work/4/target/surefire-reports

-------------------------------------------------------
 T E S T S
-------------------------------------------------------
[WARNING] *** CHECKSUM FAILED - Error retrieving checksum file for org.apache.maven/jars/b-1.0.jar
- IGNORING
[WARNING] *** CHECKSUM FAILED - Error retrieving checksum file for org.apache.maven/jars/j-1.0.jar
- IGNORING
[WARNING] *** CHECKSUM FAILED - Error retrieving checksum file for org.apache.maven/jars/i-1.0.jar
- IGNORING
[WARNING] Unable to get resource from repository test (file:///export/home/continuum/data/work/4/target/test-classes/repositories/resolver/remote-repository)
[WARNING] *** CHECKSUM FAILED - Error retrieving checksum file for org.apache.maven/jars/l-1.0.jar
- IGNORING
[surefire] Running org.apache.maven.artifact.resolver.ArtifactResolverTest
[surefire] Tests run: 6, Failures: 0, Errors: 0, Time elapsed: 0.585 sec
[INFO] Retrieving previous metadata from test
[INFO] Uploading repository metadata for: 'artifact org.apache.maven:artifact'
[surefire] Running org.apache.maven.artifact.deployer.ArtifactDeployerTest
[surefire] Tests run: 1, Failures: 0, Errors: 0, Time elapsed: 0.093 sec
[surefire] Running org.apache.maven.artifact.manager.DefaultWagonManagerTest
[surefire] Tests run: 1, Failures: 0, Errors: 0, Time elapsed: 0.027 sec
[INFO] Installing /export/home/continuum/data/work/4/src/test/resources/artifact-install/artifact-1.0.jar
to /export/home/continuum/data/work/4/target/test-classes/repositories/installer/local-repository/org.apache.maven/jars/artifact-1.0.jar
[surefire] Running org.apache.maven.artifact.installer.ArtifactInstallerTest
[surefire] Tests run: 1, Failures: 0, Errors: 0, Time elapsed: 0.035 sec

Results :
[surefire] Tests run: 9, Failures: 0, Errors: 0

[INFO] [jar:jar]
[INFO] Building jar: /export/home/continuum/data/work/4/target/maven-artifact-manager-2.1-SNAPSHOT.jar
[INFO] [install:install]
[INFO] Installing /export/home/continuum/data/work/4/target/maven-artifact-manager-2.1-SNAPSHOT.jar
to /export/home/continuum/maven-repo-local/org/apache/maven/maven-artifact-manager/2.1-SNAPSHOT/maven-artifact-manager-2.1-SNAPSHOT.jar
[INFO] ----------------------------------------------------------------------------
[INFO] BUILD SUCCESSFUL
[INFO] ----------------------------------------------------------------------------
[INFO] Total time: 5 seconds
[INFO] Finished at: Sat Dec 24 18:55:51 GMT+00:00 2005
[INFO] Final Memory: 5M/12M
[INFO] ----------------------------------------------------------------------------

****************************************************************************



Mime
View raw message