manifoldcf-dev mailing list archives

Site index · List index
Message view « Date » · « Thread »
Top « Date » · « Thread »
From Apache Jenkins Server <jenk...@builds.apache.org>
Subject Build failed in Jenkins: ManifoldCF-mvn #665
Date Mon, 13 Aug 2018 01:28:25 GMT
See <https://builds.apache.org/job/ManifoldCF-mvn/665/display/redirect?page=changes>

Changes:

[kwright] Add README file so things work on git

[kwright] Reformat build.xml

------------------------------------------
[...truncated 606.86 KB...]
[INFO] 
[INFO] --- maven-dependency-plugin:2.8:copy (copy-war) @ mcf-slack-connector ---
[INFO] Configured Artifact: org.apache.manifoldcf:mcf-api-service:2.11-SNAPSHOT:war
[INFO] Configured Artifact: org.apache.manifoldcf:mcf-authority-service:2.11-SNAPSHOT:war
[INFO] Configured Artifact: org.apache.manifoldcf:mcf-crawler-ui:2.11-SNAPSHOT:war
[INFO] Copying mcf-api-service-2.11-SNAPSHOT.war to <https://builds.apache.org/job/ManifoldCF-mvn/ws/connectors/slack/target/dependency/mcf-api-service.war>
[INFO] Copying mcf-authority-service-2.11-SNAPSHOT.war to <https://builds.apache.org/job/ManifoldCF-mvn/ws/connectors/slack/target/dependency/mcf-authority-service.war>
[INFO] Copying mcf-crawler-ui-2.11-SNAPSHOT.war to <https://builds.apache.org/job/ManifoldCF-mvn/ws/connectors/slack/target/dependency/mcf-crawler-ui.war>
[INFO] 
[INFO] --- maven-resources-plugin:2.5:resources (default-resources) @ mcf-slack-connector
---
[debug] execute contextualize
[INFO] Using 'UTF-8' encoding to copy filtered resources.
[INFO] Copying 4 resources
[INFO] Copying 6 resources
[INFO] Copying 3 resources
[INFO] 
[INFO] --- maven-compiler-plugin:2.3.2:compile (default-compile) @ mcf-slack-connector ---
[INFO] Compiling 5 source files to <https://builds.apache.org/job/ManifoldCF-mvn/ws/connectors/slack/target/classes>
[INFO] 
[INFO] --- native2ascii-maven-plugin:1.0-beta-1:native2ascii (native2ascii-utf8) @ mcf-slack-connector
---
[INFO] Includes: [**/*.properties]
[INFO] Excludes: []
[INFO] Processing <https://builds.apache.org/job/ManifoldCF-mvn/ws/connectors/slack/target/classes/org/apache/manifoldcf/crawler/notifications/slack/common_ja_JP.properties>
[INFO] Processing <https://builds.apache.org/job/ManifoldCF-mvn/ws/connectors/slack/target/classes/org/apache/manifoldcf/crawler/notifications/slack/common_es_ES.properties>
[INFO] Processing <https://builds.apache.org/job/ManifoldCF-mvn/ws/connectors/slack/target/classes/org/apache/manifoldcf/crawler/notifications/slack/common_zh_CN.properties>
[INFO] Processing <https://builds.apache.org/job/ManifoldCF-mvn/ws/connectors/slack/target/classes/org/apache/manifoldcf/crawler/notifications/slack/common_en_US.properties>
[INFO] 
[INFO] --- maven-resources-plugin:2.5:testResources (default-testResources) @ mcf-slack-connector
---
[debug] execute contextualize
[INFO] Using 'UTF-8' encoding to copy filtered resources.
[INFO] skip non existing resourceDirectory <https://builds.apache.org/job/ManifoldCF-mvn/ws/connectors/slack/connector/src/test/resources>
[INFO] Copying 3 resources
[INFO] 
[INFO] --- maven-compiler-plugin:2.3.2:testCompile (default-testCompile) @ mcf-slack-connector
---
[INFO] No sources to compile
[INFO] 
[INFO] --- maven-surefire-plugin:2.17:test (default-test) @ mcf-slack-connector ---
[INFO] Tests are skipped.
[INFO] 
[INFO] --- maven-jar-plugin:2.3.1:jar (default-jar) @ mcf-slack-connector ---
[INFO] Building jar: <https://builds.apache.org/job/ManifoldCF-mvn/ws/connectors/slack/target/mcf-slack-connector-2.11-SNAPSHOT.jar>
[INFO] 
[INFO] --- maven-site-plugin:3.4:attach-descriptor (attach-descriptor) @ mcf-slack-connector
---
[INFO] 
[INFO] >>> maven-source-plugin:2.4:jar (attach-sources) @ mcf-slack-connector >>>
[INFO] 
[INFO] <<< maven-source-plugin:2.4:jar (attach-sources) @ mcf-slack-connector <<<
[INFO] 
[INFO] --- maven-source-plugin:2.4:jar (attach-sources) @ mcf-slack-connector ---
[INFO] Building jar: <https://builds.apache.org/job/ManifoldCF-mvn/ws/connectors/slack/target/mcf-slack-connector-2.11-SNAPSHOT-sources.jar>
[INFO] 
[INFO] --- maven-failsafe-plugin:2.18.1:integration-test (integration-test) @ mcf-slack-connector
---
[INFO] Tests are skipped.
[INFO] 
[INFO] --- maven-failsafe-plugin:2.18.1:verify (verify) @ mcf-slack-connector ---
[INFO] Tests are skipped.
[INFO] 
[INFO] --- maven-install-plugin:2.5.2:install (default-install) @ mcf-slack-connector ---
[INFO] Installing <https://builds.apache.org/job/ManifoldCF-mvn/ws/connectors/slack/target/mcf-slack-connector-2.11-SNAPSHOT.jar>
to /home/jenkins/.m2/repository/org/apache/manifoldcf/mcf-slack-connector/2.11-SNAPSHOT/mcf-slack-connector-2.11-SNAPSHOT.jar
[INFO] Installing <https://builds.apache.org/job/ManifoldCF-mvn/ws/connectors/slack/pom.xml>
to /home/jenkins/.m2/repository/org/apache/manifoldcf/mcf-slack-connector/2.11-SNAPSHOT/mcf-slack-connector-2.11-SNAPSHOT.pom
[INFO] Installing <https://builds.apache.org/job/ManifoldCF-mvn/ws/connectors/slack/target/mcf-slack-connector-2.11-SNAPSHOT-sources.jar>
to /home/jenkins/.m2/repository/org/apache/manifoldcf/mcf-slack-connector/2.11-SNAPSHOT/mcf-slack-connector-2.11-SNAPSHOT-sources.jar
[INFO]                                                                         
[INFO] ------------------------------------------------------------------------
[INFO] Building ManifoldCF - Connectors - Rocket.Chat 2.11-SNAPSHOT
[INFO] ------------------------------------------------------------------------
[INFO] 
[INFO] --- maven-clean-plugin:2.4.1:clean (default-clean) @ mcf-rocketchat-connector ---
[INFO] 
[INFO] --- maven-remote-resources-plugin:1.5:process (default) @ mcf-rocketchat-connector
---
[INFO] 
[INFO] --- maven-dependency-plugin:2.8:copy (copy-war) @ mcf-rocketchat-connector ---
[INFO] Configured Artifact: org.apache.manifoldcf:mcf-api-service:2.11-SNAPSHOT:war
[INFO] Configured Artifact: org.apache.manifoldcf:mcf-authority-service:2.11-SNAPSHOT:war
[INFO] Configured Artifact: org.apache.manifoldcf:mcf-crawler-ui:2.11-SNAPSHOT:war
[INFO] Copying mcf-api-service-2.11-SNAPSHOT.war to <https://builds.apache.org/job/ManifoldCF-mvn/ws/connectors/rocketchat/target/dependency/mcf-api-service.war>
[INFO] Copying mcf-authority-service-2.11-SNAPSHOT.war to <https://builds.apache.org/job/ManifoldCF-mvn/ws/connectors/rocketchat/target/dependency/mcf-authority-service.war>
[INFO] Copying mcf-crawler-ui-2.11-SNAPSHOT.war to <https://builds.apache.org/job/ManifoldCF-mvn/ws/connectors/rocketchat/target/dependency/mcf-crawler-ui.war>
[INFO] 
[INFO] --- maven-resources-plugin:2.5:resources (default-resources) @ mcf-rocketchat-connector
---
[debug] execute contextualize
[INFO] Using 'UTF-8' encoding to copy filtered resources.
[INFO] Copying 4 resources
[INFO] Copying 6 resources
[INFO] Copying 3 resources
[INFO] 
[INFO] --- maven-compiler-plugin:2.3.2:compile (default-compile) @ mcf-rocketchat-connector
---
[INFO] Compiling 6 source files to <https://builds.apache.org/job/ManifoldCF-mvn/ws/connectors/rocketchat/target/classes>
[INFO] 
[INFO] --- native2ascii-maven-plugin:1.0-beta-1:native2ascii (native2ascii-utf8) @ mcf-rocketchat-connector
---
[INFO] Includes: [**/*.properties]
[INFO] Excludes: []
[INFO] Processing <https://builds.apache.org/job/ManifoldCF-mvn/ws/connectors/rocketchat/target/classes/org/apache/manifoldcf/crawler/notifications/rocketchat/common_ja_JP.properties>
[INFO] Processing <https://builds.apache.org/job/ManifoldCF-mvn/ws/connectors/rocketchat/target/classes/org/apache/manifoldcf/crawler/notifications/rocketchat/common_es_ES.properties>
[INFO] Processing <https://builds.apache.org/job/ManifoldCF-mvn/ws/connectors/rocketchat/target/classes/org/apache/manifoldcf/crawler/notifications/rocketchat/common_zh_CN.properties>
[INFO] Processing <https://builds.apache.org/job/ManifoldCF-mvn/ws/connectors/rocketchat/target/classes/org/apache/manifoldcf/crawler/notifications/rocketchat/common_en_US.properties>
[INFO] 
[INFO] --- maven-resources-plugin:2.5:testResources (default-testResources) @ mcf-rocketchat-connector
---
[debug] execute contextualize
[INFO] Using 'UTF-8' encoding to copy filtered resources.
[INFO] skip non existing resourceDirectory <https://builds.apache.org/job/ManifoldCF-mvn/ws/connectors/rocketchat/connector/src/test/resources>
[INFO] Copying 3 resources
[INFO] 
[INFO] --- maven-compiler-plugin:2.3.2:testCompile (default-testCompile) @ mcf-rocketchat-connector
---
[INFO] No sources to compile
[INFO] 
[INFO] --- maven-surefire-plugin:2.17:test (default-test) @ mcf-rocketchat-connector ---
[INFO] Tests are skipped.
[INFO] 
[INFO] --- maven-jar-plugin:2.3.1:jar (default-jar) @ mcf-rocketchat-connector ---
[INFO] Building jar: <https://builds.apache.org/job/ManifoldCF-mvn/ws/connectors/rocketchat/target/mcf-rocketchat-connector-2.11-SNAPSHOT.jar>
[INFO] 
[INFO] --- maven-site-plugin:3.4:attach-descriptor (attach-descriptor) @ mcf-rocketchat-connector
---
[INFO] 
[INFO] >>> maven-source-plugin:2.4:jar (attach-sources) @ mcf-rocketchat-connector
>>>
[INFO] 
[INFO] <<< maven-source-plugin:2.4:jar (attach-sources) @ mcf-rocketchat-connector
<<<
[INFO] 
[INFO] --- maven-source-plugin:2.4:jar (attach-sources) @ mcf-rocketchat-connector ---
[INFO] Building jar: <https://builds.apache.org/job/ManifoldCF-mvn/ws/connectors/rocketchat/target/mcf-rocketchat-connector-2.11-SNAPSHOT-sources.jar>
[INFO] 
[INFO] --- maven-failsafe-plugin:2.18.1:integration-test (integration-test) @ mcf-rocketchat-connector
---
[INFO] Tests are skipped.
[INFO] 
[INFO] --- maven-failsafe-plugin:2.18.1:verify (verify) @ mcf-rocketchat-connector ---
[INFO] Tests are skipped.
[INFO] 
[INFO] --- maven-install-plugin:2.5.2:install (default-install) @ mcf-rocketchat-connector
---
[INFO] Installing <https://builds.apache.org/job/ManifoldCF-mvn/ws/connectors/rocketchat/target/mcf-rocketchat-connector-2.11-SNAPSHOT.jar>
to /home/jenkins/.m2/repository/org/apache/manifoldcf/mcf-rocketchat-connector/2.11-SNAPSHOT/mcf-rocketchat-connector-2.11-SNAPSHOT.jar
[INFO] Installing <https://builds.apache.org/job/ManifoldCF-mvn/ws/connectors/rocketchat/pom.xml>
to /home/jenkins/.m2/repository/org/apache/manifoldcf/mcf-rocketchat-connector/2.11-SNAPSHOT/mcf-rocketchat-connector-2.11-SNAPSHOT.pom
[INFO] Installing <https://builds.apache.org/job/ManifoldCF-mvn/ws/connectors/rocketchat/target/mcf-rocketchat-connector-2.11-SNAPSHOT-sources.jar>
to /home/jenkins/.m2/repository/org/apache/manifoldcf/mcf-rocketchat-connector/2.11-SNAPSHOT/mcf-rocketchat-connector-2.11-SNAPSHOT-sources.jar
[INFO]                                                                         
[INFO] ------------------------------------------------------------------------
[INFO] Building ManifoldCF - Connectors - HTML Extractor 2.11-SNAPSHOT
[INFO] ------------------------------------------------------------------------
[INFO] 
[INFO] --- maven-clean-plugin:2.4.1:clean (default-clean) @ mcf-html-extractor-connector ---
[INFO] 
[INFO] --- maven-remote-resources-plugin:1.5:process (default) @ mcf-html-extractor-connector
---
[INFO] 
[INFO] --- maven-dependency-plugin:2.8:copy (copy-war) @ mcf-html-extractor-connector ---
[INFO] Configured Artifact: org.apache.manifoldcf:mcf-api-service:2.11-SNAPSHOT:war
[INFO] Configured Artifact: org.apache.manifoldcf:mcf-authority-service:2.11-SNAPSHOT:war
[INFO] Configured Artifact: org.apache.manifoldcf:mcf-crawler-ui:2.11-SNAPSHOT:war
[INFO] Copying mcf-api-service-2.11-SNAPSHOT.war to <https://builds.apache.org/job/ManifoldCF-mvn/ws/connectors/html-extractor/target/dependency/mcf-api-service.war>
[INFO] Copying mcf-authority-service-2.11-SNAPSHOT.war to <https://builds.apache.org/job/ManifoldCF-mvn/ws/connectors/html-extractor/target/dependency/mcf-authority-service.war>
[INFO] Copying mcf-crawler-ui-2.11-SNAPSHOT.war to <https://builds.apache.org/job/ManifoldCF-mvn/ws/connectors/html-extractor/target/dependency/mcf-crawler-ui.war>
[INFO] 
[INFO] --- maven-resources-plugin:2.5:resources (default-resources) @ mcf-html-extractor-connector
---
[debug] execute contextualize
[INFO] Using 'UTF-8' encoding to copy filtered resources.
[INFO] Copying 4 resources
[INFO] Copying 5 resources
[INFO] Copying 3 resources
[INFO] 
[INFO] --- maven-compiler-plugin:2.3.2:compile (default-compile) @ mcf-html-extractor-connector
---
[INFO] Compiling 6 source files to <https://builds.apache.org/job/ManifoldCF-mvn/ws/connectors/html-extractor/target/classes>
[INFO] -------------------------------------------------------------
[ERROR] COMPILATION ERROR : 
[INFO] -------------------------------------------------------------
[ERROR] <https://builds.apache.org/job/ManifoldCF-mvn/ws/connectors/html-extractor/connector/src/main/java/org/apache/manifoldcf/agents/transformation/htmlextractor/HtmlExtractor.java>:[23,43]
error: package org.apache.manifoldcf.crawler.system does not exist
[INFO] 1 error
[INFO] -------------------------------------------------------------
[INFO] ------------------------------------------------------------------------
[INFO] Reactor Summary:
[INFO] 
[INFO] ManifoldCF ........................................ SUCCESS [  3.006 s]
[INFO] ManifoldCF - Framework ............................ SUCCESS [  0.083 s]
[INFO] ManifoldCF - Framework - Less Compiler ............ SUCCESS [  2.363 s]
[INFO] ManifoldCF - Framework - Core ..................... SUCCESS [  6.790 s]
[INFO] ManifoldCF - Connector-Common ..................... SUCCESS [  3.908 s]
[INFO] ManifoldCF - Framework - UI Core .................. SUCCESS [  1.824 s]
[INFO] ManifoldCF - Framework - Agents ................... SUCCESS [  3.816 s]
[INFO] ManifoldCF - Framework - Pull Agent ............... SUCCESS [  8.160 s]
[INFO] ManifoldCF - Framework - Authority Servlet ........ SUCCESS [  1.201 s]
[INFO] ManifoldCF - Framework - API Servlet .............. SUCCESS [  1.141 s]
[INFO] ManifoldCF - Framework - Authority Service ........ SUCCESS [  3.165 s]
[INFO] ManifoldCF - Framework - API Service .............. SUCCESS [  2.759 s]
[INFO] ManifoldCF - Framework - Crawler UI ............... SUCCESS [  6.897 s]
[INFO] ManifoldCF - Framework - Script Engine ............ SUCCESS [  3.238 s]
[INFO] ManifoldCF - Framework - Combined Service ......... SUCCESS [  3.260 s]
[INFO] ManifoldCF - Test materials ....................... SUCCESS [  0.146 s]
[INFO] ManifoldCF - Test Materials - Alfresco WAR ........ SUCCESS [ 27.274 s]
[INFO] ManifoldCF - Connectors ........................... SUCCESS [  0.629 s]
[INFO] ManifoldCF - Connectors - Active Directory ........ SUCCESS [  3.473 s]
[INFO] ManifoldCF - Connectors - Alfresco Webscript ...... SUCCESS [  7.682 s]
[INFO] ManifoldCF - Connectors - Filesystem .............. SUCCESS [  3.433 s]
[INFO] ManifoldCF - Connectors - MetaCarta GTS ........... SUCCESS [  2.921 s]
[INFO] ManifoldCF - Connectors - HDFS .................... SUCCESS [  8.278 s]
[INFO] ManifoldCF - Connectors - jCIFS ................... SUCCESS [  3.511 s]
[INFO] ManifoldCF - Connectors - JDBC .................... SUCCESS [  4.098 s]
[INFO] ManifoldCF - Connectors - GridFS .................. SUCCESS [  2.300 s]
[INFO] ManifoldCF - Connectors - LDAP .................... SUCCESS [  3.608 s]
[INFO] ManifoldCF - Connectors - Null Authority .......... SUCCESS [  2.042 s]
[INFO] ManifoldCF - Connectors - Null Output ............. SUCCESS [  1.151 s]
[INFO] ManifoldCF - Connectors - Null Transformation ..... SUCCESS [  1.030 s]
[INFO] ManifoldCF - Connectors - RSS ..................... SUCCESS [  4.906 s]
[INFO] ManifoldCF - Connectors - SharePoint .............. SUCCESS [  9.768 s]
[INFO] ManifoldCF - Connectors - Solr .................... SUCCESS [  4.246 s]
[INFO] ManifoldCF - Connectors - Web ..................... SUCCESS [  5.541 s]
[INFO] ManifoldCF - Connectors - CMIS .................... SUCCESS [  4.646 s]
[INFO] ManifoldCF - Connectors - OpenSearchServer ........ SUCCESS [  4.170 s]
[INFO] ManifoldCF - Connectors - Wiki .................... SUCCESS [  3.609 s]
[INFO] ManifoldCF - Connectors - Alfresco ................ SUCCESS [  4.654 s]
[INFO] ManifoldCF - Connectors - ElasticSearch ........... SUCCESS [  4.267 s]
[INFO] ManifoldCF - Connectors - Dropbox ................. SUCCESS [  1.662 s]
[INFO] ManifoldCF - Connectors - GoogleDrive ............. SUCCESS [  2.486 s]
[INFO] ManifoldCF - Connectors - Jira .................... SUCCESS [  2.035 s]
[INFO] ManifoldCF - Connectors - Generic ................. SUCCESS [  2.503 s]
[INFO] ManifoldCF - Connectors - Regexp Mapper ........... SUCCESS [  1.431 s]
[INFO] ManifoldCF - Connectors - Email ................... SUCCESS [  2.045 s]
[INFO] ManifoldCF - Connectors - Amazon CloudSearch Output  SUCCESS [  2.949 s]
[INFO] ManifoldCF - Connectors - Forced metadata ......... SUCCESS [  2.510 s]
[INFO] ManifoldCF - Connectors - Tika Transformer ........ SUCCESS [  4.319 s]
[INFO] ManifoldCF - Connectors - Tika Service Transformer  SUCCESS [  1.872 s]
[INFO] ManifoldCF - Connectors - Document Filter ......... SUCCESS [  1.449 s]
[INFO] ManifoldCF - Connectors - SearchBlox .............. SUCCESS [ 13.792 s]
[INFO] ManifoldCF - Connectors - Confluence Connector .... SUCCESS [  4.448 s]
[INFO] ManifoldCF - Connectors - Amazon S3 ............... SUCCESS [  5.332 s]
[INFO] ManifoldCF - Connectors - Kafka ................... SUCCESS [  4.397 s]
[INFO] ManifoldCF - Connectors - OpenNlp Extractor ....... SUCCESS [  2.246 s]
[INFO] ManifoldCF - Connectors - Nuxeo Connector ......... SUCCESS [  6.669 s]
[INFO] ManifoldCF - Connectors - Content Limiter ......... SUCCESS [  1.235 s]
[INFO] ManifoldCF - Connectors - Slack ................... SUCCESS [  1.687 s]
[INFO] ManifoldCF - Connectors - Rocket.Chat ............. SUCCESS [  1.613 s]
[INFO] ManifoldCF - Connectors - HTML Extractor .......... FAILURE [  1.027 s]
[INFO] ManifoldCF - Connectors - Mongodb ................. SKIPPED
[INFO] ManifoldCF - Framework - Jetty Runner ............. SKIPPED
[INFO] ------------------------------------------------------------------------
[INFO] BUILD FAILURE
[INFO] ------------------------------------------------------------------------
[INFO] Total time: 03:57 min
[INFO] Finished at: 2018-08-13T01:28:24+00:00
[INFO] Final Memory: 129M/8937M
[INFO] ------------------------------------------------------------------------
[ERROR] Failed to execute goal org.apache.maven.plugins:maven-compiler-plugin:2.3.2:compile
(default-compile) on project mcf-html-extractor-connector: Compilation failure
[ERROR] <https://builds.apache.org/job/ManifoldCF-mvn/ws/connectors/html-extractor/connector/src/main/java/org/apache/manifoldcf/agents/transformation/htmlextractor/HtmlExtractor.java>:[23,43]
error: package org.apache.manifoldcf.crawler.system does not exist
[ERROR] -> [Help 1]
[ERROR] 
[ERROR] To see the full stack trace of the errors, re-run Maven with the -e switch.
[ERROR] Re-run Maven using the -X switch to enable full debug logging.
[ERROR] 
[ERROR] For more information about the errors and possible solutions, please read the following
articles:
[ERROR] [Help 1] http://cwiki.apache.org/confluence/display/MAVEN/MojoFailureException
[ERROR] 
[ERROR] After correcting the problems, you can resume the build with the command
[ERROR]   mvn <goals> -rf :mcf-html-extractor-connector
Build step 'Invoke top-level Maven targets' marked build as failure
[locks-and-latches] Releasing all the locks
[locks-and-latches] All the locks released

Mime
View raw message