manifoldcf-dev mailing list archives

Site index · List index
Message view « Date » · « Thread »
Top « Date » · « Thread »
From Apache Jenkins Server <jenk...@builds.apache.org>
Subject Build failed in Jenkins: ManifoldCF-mvn #647
Date Thu, 26 Apr 2018 01:26:03 GMT
See <https://builds.apache.org/job/ManifoldCF-mvn/647/display/redirect?page=changes>

Changes:

[kwright] Tentative fix for CONNECTORS-1503.

------------------------------------------
[...truncated 481.84 KB...]
4/5 KB   5/5 KB            Downloaded: http://repo.maven.apache.org/maven2/org/seleniumhq/selenium/selenium-remote-driver/3.0.0-beta4/selenium-remote-driver-3.0.0-beta4.pom
(5 KB at 530.2 KB/sec)
Downloading: http://repo.maven.apache.org/maven2/org/seleniumhq/selenium/selenium-api/3.0.0-beta4/selenium-api-3.0.0-beta4.pom
3/3 KB            Downloaded: http://repo.maven.apache.org/maven2/org/seleniumhq/selenium/selenium-api/3.0.0-beta4/selenium-api-3.0.0-beta4.pom
(3 KB at 322.3 KB/sec)
Downloading: http://repo.maven.apache.org/maven2/org/seleniumhq/selenium/selenium-support/3.0.0/selenium-support-3.0.0.pom
3/3 KB            Downloaded: http://repo.maven.apache.org/maven2/org/seleniumhq/selenium/selenium-support/3.0.0/selenium-support-3.0.0.pom
(3 KB at 371.5 KB/sec)
Downloading: http://repo.maven.apache.org/maven2/org/seleniumhq/selenium/selenium-remote-driver/3.0.0/selenium-remote-driver-3.0.0.pom
4/4 KB   4/4 KB            Downloaded: http://repo.maven.apache.org/maven2/org/seleniumhq/selenium/selenium-remote-driver/3.0.0/selenium-remote-driver-3.0.0.pom
(4 KB at 484.0 KB/sec)
Downloading: http://repo.maven.apache.org/maven2/org/seleniumhq/selenium/selenium-api/3.0.0/selenium-api-3.0.0.pom
3/3 KB            Downloaded: http://repo.maven.apache.org/maven2/org/seleniumhq/selenium/selenium-api/3.0.0/selenium-api-3.0.0.pom
(3 KB at 160.8 KB/sec)
Downloading: http://repo.maven.apache.org/maven2/org/seleniumhq/selenium/selenium-support/3.0.1/selenium-support-3.0.1.pom
3/3 KB            Downloaded: http://repo.maven.apache.org/maven2/org/seleniumhq/selenium/selenium-support/3.0.1/selenium-support-3.0.1.pom
(3 KB at 371.5 KB/sec)
Downloading: http://repo.maven.apache.org/maven2/org/seleniumhq/selenium/selenium-remote-driver/3.0.1/selenium-remote-driver-3.0.1.pom
4/4 KB   4/4 KB            Downloaded: http://repo.maven.apache.org/maven2/org/seleniumhq/selenium/selenium-remote-driver/3.0.1/selenium-remote-driver-3.0.1.pom
(4 KB at 484.0 KB/sec)
Downloading: http://repo.maven.apache.org/maven2/org/seleniumhq/selenium/selenium-api/3.0.1/selenium-api-3.0.1.pom
3/3 KB            Downloaded: http://repo.maven.apache.org/maven2/org/seleniumhq/selenium/selenium-api/3.0.1/selenium-api-3.0.1.pom
(3 KB at 197.9 KB/sec)
Downloading: http://repo.maven.apache.org/maven2/org/seleniumhq/selenium/selenium-support/3.1.0/selenium-support-3.1.0.pom
3/3 KB            Downloaded: http://repo.maven.apache.org/maven2/org/seleniumhq/selenium/selenium-support/3.1.0/selenium-support-3.1.0.pom
(3 KB at 371.5 KB/sec)
Downloading: http://repo.maven.apache.org/maven2/org/seleniumhq/selenium/selenium-support/3.2.0/selenium-support-3.2.0.pom
4/4 KB            Downloaded: http://repo.maven.apache.org/maven2/org/seleniumhq/selenium/selenium-support/3.2.0/selenium-support-3.2.0.pom
(4 KB at 393.7 KB/sec)
Downloading: http://repo.maven.apache.org/maven2/org/seleniumhq/selenium/selenium-remote-driver/3.2.0/selenium-remote-driver-3.2.0.pom
4/4 KB   4/4 KB            Downloaded: http://repo.maven.apache.org/maven2/org/seleniumhq/selenium/selenium-remote-driver/3.2.0/selenium-remote-driver-3.2.0.pom
(4 KB at 322.8 KB/sec)
Downloading: http://repo.maven.apache.org/maven2/org/seleniumhq/selenium/selenium-api/3.2.0/selenium-api-3.2.0.pom
3/3 KB            Downloaded: http://repo.maven.apache.org/maven2/org/seleniumhq/selenium/selenium-api/3.2.0/selenium-api-3.2.0.pom
(3 KB at 257.2 KB/sec)
Downloading: http://repo.maven.apache.org/maven2/org/seleniumhq/selenium/selenium-support/3.3.0/selenium-support-3.3.0.pom
1/4 KB   4/4 KB            Downloaded: http://repo.maven.apache.org/maven2/org/seleniumhq/selenium/selenium-support/3.3.0/selenium-support-3.3.0.pom
(4 KB at 349.9 KB/sec)
Downloading: http://repo.maven.apache.org/maven2/org/seleniumhq/selenium/selenium-remote-driver/3.3.0/selenium-remote-driver-3.3.0.pom
3/4 KB   4/4 KB            Downloaded: http://repo.maven.apache.org/maven2/org/seleniumhq/selenium/selenium-remote-driver/3.3.0/selenium-remote-driver-3.3.0.pom
(4 KB at 430.4 KB/sec)
Downloading: http://repo.maven.apache.org/maven2/org/seleniumhq/selenium/selenium-api/3.3.0/selenium-api-3.3.0.pom
3/3 KB   3/3 KB            Downloaded: http://repo.maven.apache.org/maven2/org/seleniumhq/selenium/selenium-api/3.3.0/selenium-api-3.3.0.pom
(3 KB at 183.7 KB/sec)
Downloading: http://repo.maven.apache.org/maven2/org/seleniumhq/selenium/selenium-support/3.3.1/selenium-support-3.3.1.pom
4/4 KB            Downloaded: http://repo.maven.apache.org/maven2/org/seleniumhq/selenium/selenium-support/3.3.1/selenium-support-3.3.1.pom
(4 KB at 349.9 KB/sec)
Downloading: http://repo.maven.apache.org/maven2/org/seleniumhq/selenium/selenium-support/3.4.0/selenium-support-3.4.0.pom
3/6 KB   5/6 KB   6/6 KB            Downloaded: http://repo.maven.apache.org/maven2/org/seleniumhq/selenium/selenium-support/3.4.0/selenium-support-3.4.0.pom
(6 KB at 638.3 KB/sec)
Downloading: http://repo.maven.apache.org/maven2/org/seleniumhq/selenium/selenium-api/3.4.0/selenium-api-3.4.0.pom
3/3 KB            Downloaded: http://repo.maven.apache.org/maven2/org/seleniumhq/selenium/selenium-api/3.4.0/selenium-api-3.4.0.pom
(3 KB at 151.3 KB/sec)
Downloading: http://repo.maven.apache.org/maven2/org/seleniumhq/selenium/selenium-remote-driver/3.4.0/selenium-remote-driver-3.4.0.pom
4/5 KB   5/5 KB            Downloaded: http://repo.maven.apache.org/maven2/org/seleniumhq/selenium/selenium-remote-driver/3.4.0/selenium-remote-driver-3.4.0.pom
(5 KB at 509.5 KB/sec)
Downloading: http://repo.maven.apache.org/maven2/org/seleniumhq/selenium/selenium-support/3.5.1/selenium-support-3.5.1.pom
3/6 KB   5/6 KB   6/6 KB            Downloaded: http://repo.maven.apache.org/maven2/org/seleniumhq/selenium/selenium-support/3.5.1/selenium-support-3.5.1.pom
(6 KB at 340.4 KB/sec)
Downloading: http://repo.maven.apache.org/maven2/org/seleniumhq/selenium/selenium-api/3.5.1/selenium-api-3.5.1.pom
3/3 KB            Downloaded: http://repo.maven.apache.org/maven2/org/seleniumhq/selenium/selenium-api/3.5.1/selenium-api-3.5.1.pom
(3 KB at 257.2 KB/sec)
Downloading: http://repo.maven.apache.org/maven2/org/seleniumhq/selenium/selenium-remote-driver/3.5.1/selenium-remote-driver-3.5.1.pom
4/5 KB   5/5 KB            Downloaded: http://repo.maven.apache.org/maven2/org/seleniumhq/selenium/selenium-remote-driver/3.5.1/selenium-remote-driver-3.5.1.pom
(5 KB at 352.8 KB/sec)
Downloading: http://repo.maven.apache.org/maven2/com/google/guava/guava/23.0/guava-23.0.pom
4/6 KB   6/6 KB            Downloaded: http://repo.maven.apache.org/maven2/com/google/guava/guava/23.0/guava-23.0.pom
(6 KB at 259.9 KB/sec)
Downloading: http://repo.maven.apache.org/maven2/com/google/guava/guava-parent/23.0/guava-parent-23.0.pom
4/10 KB   8/10 KB   10/10 KB              Downloaded: http://repo.maven.apache.org/maven2/com/google/guava/guava-parent/23.0/guava-parent-23.0.pom
(10 KB at 911.6 KB/sec)
Downloading: http://repo.maven.apache.org/maven2/org/seleniumhq/selenium/selenium-support/3.5.2/selenium-support-3.5.2.pom
4/6 KB     5/6 KB   6/6 KB            Downloaded: http://repo.maven.apache.org/maven2/org/seleniumhq/selenium/selenium-support/3.5.2/selenium-support-3.5.2.pom
(6 KB at 464.2 KB/sec)
Downloading: http://repo.maven.apache.org/maven2/org/seleniumhq/selenium/selenium-api/3.5.2/selenium-api-3.5.2.pom
3/3 KB            Downloaded: http://repo.maven.apache.org/maven2/org/seleniumhq/selenium/selenium-api/3.5.2/selenium-api-3.5.2.pom
(3 KB at 233.8 KB/sec)
Downloading: http://repo.maven.apache.org/maven2/org/seleniumhq/selenium/selenium-remote-driver/3.5.2/selenium-remote-driver-3.5.2.pom
4/5 KB   5/5 KB            Downloaded: http://repo.maven.apache.org/maven2/org/seleniumhq/selenium/selenium-remote-driver/3.5.2/selenium-remote-driver-3.5.2.pom
(5 KB at 199.4 KB/sec)
Downloading: http://repo.maven.apache.org/maven2/org/seleniumhq/selenium/selenium-support/3.5.3/selenium-support-3.5.3.pom
4/6 KB   6/6 KB            Downloaded: http://repo.maven.apache.org/maven2/org/seleniumhq/selenium/selenium-support/3.5.3/selenium-support-3.5.3.pom
(6 KB at 567.4 KB/sec)
Downloading: http://repo.maven.apache.org/maven2/org/seleniumhq/selenium/selenium-api/3.5.3/selenium-api-3.5.3.pom
3/3 KB            Downloaded: http://repo.maven.apache.org/maven2/org/seleniumhq/selenium/selenium-api/3.5.3/selenium-api-3.5.3.pom
(3 KB at 257.2 KB/sec)
Downloading: http://repo.maven.apache.org/maven2/org/seleniumhq/selenium/selenium-remote-driver/3.5.3/selenium-remote-driver-3.5.3.pom
4/5 KB   5/5 KB            Downloaded: http://repo.maven.apache.org/maven2/org/seleniumhq/selenium/selenium-remote-driver/3.5.3/selenium-remote-driver-3.5.3.pom
(5 KB at 655.1 KB/sec)
Downloading: http://repo.maven.apache.org/maven2/org/seleniumhq/selenium/selenium-support/3.6.0/selenium-support-3.6.0.pom
4/5 KB   5/5 KB   5/5 KB            Downloaded: http://repo.maven.apache.org/maven2/org/seleniumhq/selenium/selenium-support/3.6.0/selenium-support-3.6.0.pom
(5 KB at 597.2 KB/sec)
Downloading: http://repo.maven.apache.org/maven2/org/seleniumhq/selenium/selenium-api/3.6.0/selenium-api-3.6.0.pom
3/3 KB            Downloaded: http://repo.maven.apache.org/maven2/org/seleniumhq/selenium/selenium-api/3.6.0/selenium-api-3.6.0.pom
(3 KB at 321.5 KB/sec)
Downloading: http://repo.maven.apache.org/maven2/org/seleniumhq/selenium/selenium-remote-driver/3.6.0/selenium-remote-driver-3.6.0.pom
4/5 KB   5/5 KB            Downloaded: http://repo.maven.apache.org/maven2/org/seleniumhq/selenium/selenium-remote-driver/3.6.0/selenium-remote-driver-3.6.0.pom
(5 KB at 459.3 KB/sec)
Downloading: http://repo.maven.apache.org/maven2/net/bytebuddy/byte-buddy/1.7.5/byte-buddy-1.7.5.pom
         [WARNING] Failed to create parent directories for tracking file /home/jenkins/.m2/repository/net/bytebuddy/byte-buddy/1.7.5/byte-buddy-1.7.5.pom.lastUpdated
Downloading: http://repo.maven.apache.org/maven2/org/seleniumhq/selenium/selenium-support/3.7.0/selenium-support-3.7.0.pom
4/5 KB   5/5 KB            Downloaded: http://repo.maven.apache.org/maven2/org/seleniumhq/selenium/selenium-support/3.7.0/selenium-support-3.7.0.pom
(5 KB at 245.9 KB/sec)
Downloading: http://repo.maven.apache.org/maven2/org/seleniumhq/selenium/selenium-api/3.7.0/selenium-api-3.7.0.pom
3/3 KB            Downloaded: http://repo.maven.apache.org/maven2/org/seleniumhq/selenium/selenium-api/3.7.0/selenium-api-3.7.0.pom
(3 KB at 142.9 KB/sec)
Downloading: http://repo.maven.apache.org/maven2/org/seleniumhq/selenium/selenium-remote-driver/3.7.0/selenium-remote-driver-3.7.0.pom
4/5 KB   5/5 KB            Downloaded: http://repo.maven.apache.org/maven2/org/seleniumhq/selenium/selenium-remote-driver/3.7.0/selenium-remote-driver-3.7.0.pom
(5 KB at 530.3 KB/sec)
Downloading: http://repo.maven.apache.org/maven2/com/google/code/gson/gson/2.8.2/gson-2.8.2.pom
2/2 KB            Downloaded: http://repo.maven.apache.org/maven2/com/google/code/gson/gson/2.8.2/gson-2.8.2.pom
(2 KB at 264.1 KB/sec)
Downloading: http://repo.maven.apache.org/maven2/com/google/code/gson/gson-parent/2.8.2/gson-parent-2.8.2.pom
4/4 KB   4/4 KB            Downloaded: http://repo.maven.apache.org/maven2/com/google/code/gson/gson-parent/2.8.2/gson-parent-2.8.2.pom
(4 KB at 256.6 KB/sec)
Downloading: http://repo.maven.apache.org/maven2/org/seleniumhq/selenium/selenium-support/3.7.1/selenium-support-3.7.1.pom
4/5 KB   5/5 KB            Downloaded: http://repo.maven.apache.org/maven2/org/seleniumhq/selenium/selenium-support/3.7.1/selenium-support-3.7.1.pom
(5 KB at 295.1 KB/sec)
Downloading: http://repo.maven.apache.org/maven2/org/seleniumhq/selenium/selenium-api/3.7.1/selenium-api-3.7.1.pom
3/3 KB   3/3 KB            Downloaded: http://repo.maven.apache.org/maven2/org/seleniumhq/selenium/selenium-api/3.7.1/selenium-api-3.7.1.pom
(3 KB at 321.5 KB/sec)
Downloading: http://repo.maven.apache.org/maven2/org/seleniumhq/selenium/selenium-remote-driver/3.7.1/selenium-remote-driver-3.7.1.pom
3/5 KB   5/5 KB            Downloaded: http://repo.maven.apache.org/maven2/org/seleniumhq/selenium/selenium-remote-driver/3.7.1/selenium-remote-driver-3.7.1.pom
(5 KB at 530.3 KB/sec)
Downloading: http://repo.maven.apache.org/maven2/org/seleniumhq/selenium/selenium-support/3.8.0/selenium-support-3.8.0.pom
3/5 KB   5/5 KB            Downloaded: http://repo.maven.apache.org/maven2/org/seleniumhq/selenium/selenium-support/3.8.0/selenium-support-3.8.0.pom
(5 KB at 245.9 KB/sec)
Downloading: http://repo.maven.apache.org/maven2/org/seleniumhq/selenium/selenium-api/3.8.0/selenium-api-3.8.0.pom
3/3 KB            Downloaded: http://repo.maven.apache.org/maven2/org/seleniumhq/selenium/selenium-api/3.8.0/selenium-api-3.8.0.pom
(3 KB at 321.5 KB/sec)
Downloading: http://repo.maven.apache.org/maven2/org/seleniumhq/selenium/selenium-remote-driver/3.8.0/selenium-remote-driver-3.8.0.pom
4/5 KB   5/5 KB            Downloaded: http://repo.maven.apache.org/maven2/org/seleniumhq/selenium/selenium-remote-driver/3.8.0/selenium-remote-driver-3.8.0.pom
(5 KB at 530.3 KB/sec)
Downloading: http://repo.maven.apache.org/maven2/org/seleniumhq/selenium/selenium-support/3.8.1/selenium-support-3.8.1.pom
4/5 KB   5/5 KB            Downloaded: http://repo.maven.apache.org/maven2/org/seleniumhq/selenium/selenium-support/3.8.1/selenium-support-3.8.1.pom
(5 KB at 553.3 KB/sec)
Downloading: http://repo.maven.apache.org/maven2/org/seleniumhq/selenium/selenium-api/3.8.1/selenium-api-3.8.1.pom
3/3 KB            Downloaded: http://repo.maven.apache.org/maven2/org/seleniumhq/selenium/selenium-api/3.8.1/selenium-api-3.8.1.pom
(3 KB at 285.8 KB/sec)
Downloading: http://repo.maven.apache.org/maven2/org/seleniumhq/selenium/selenium-remote-driver/3.8.1/selenium-remote-driver-3.8.1.pom
4/5 KB   5/5 KB            Downloaded: http://repo.maven.apache.org/maven2/org/seleniumhq/selenium/selenium-remote-driver/3.8.1/selenium-remote-driver-3.8.1.pom
(5 KB at 530.3 KB/sec)
Downloading: http://repo.maven.apache.org/maven2/org/seleniumhq/selenium/selenium-support/3.9.0/selenium-support-3.9.0.pom
4/5 KB   5/5 KB   5/5 KB            Downloaded: http://repo.maven.apache.org/maven2/org/seleniumhq/selenium/selenium-support/3.9.0/selenium-support-3.9.0.pom
(5 KB at 478.2 KB/sec)
Downloading: http://repo.maven.apache.org/maven2/org/seleniumhq/selenium/selenium-api/3.9.0/selenium-api-3.9.0.pom
3/3 KB   3/3 KB            Downloaded: http://repo.maven.apache.org/maven2/org/seleniumhq/selenium/selenium-api/3.9.0/selenium-api-3.9.0.pom
(3 KB at 321.5 KB/sec)
Downloading: http://repo.maven.apache.org/maven2/org/seleniumhq/selenium/selenium-remote-driver/3.9.0/selenium-remote-driver-3.9.0.pom
4/5 KB   5/5 KB            Downloaded: http://repo.maven.apache.org/maven2/org/seleniumhq/selenium/selenium-remote-driver/3.9.0/selenium-remote-driver-3.9.0.pom
(5 KB at 574.7 KB/sec)
Downloading: http://repo.maven.apache.org/maven2/net/bytebuddy/byte-buddy/1.7.9/byte-buddy-1.7.9.pom
         [WARNING] Failed to create parent directories for tracking file /home/jenkins/.m2/repository/net/bytebuddy/byte-buddy/1.7.9/byte-buddy-1.7.9.pom.lastUpdated
Downloading: http://repo.maven.apache.org/maven2/com/google/guava/guava/23.6-jre/guava-23.6-jre.pom
4/8 KB   8/8 KB   8/8 KB            Downloaded: http://repo.maven.apache.org/maven2/com/google/guava/guava/23.6-jre/guava-23.6-jre.pom
(8 KB at 956.2 KB/sec)
Downloading: http://repo.maven.apache.org/maven2/com/google/guava/guava-parent/23.6-jre/guava-parent-23.6-jre.pom
4/10 KB   8/10 KB   10/10 KB              Downloaded: http://repo.maven.apache.org/maven2/com/google/guava/guava-parent/23.6-jre/guava-parent-23.6-jre.pom
(10 KB at 706.2 KB/sec)
Downloading: http://repo.maven.apache.org/maven2/org/checkerframework/checker-compat-qual/2.0.0/checker-compat-qual-2.0.0.pom
4/5 KB     5/5 KB            Downloaded: http://repo.maven.apache.org/maven2/org/checkerframework/checker-compat-qual/2.0.0/checker-compat-qual-2.0.0.pom
(5 KB at 513.3 KB/sec)
Downloading: http://repo.maven.apache.org/maven2/com/google/errorprone/error_prone_annotations/2.1.3/error_prone_annotations-2.1.3.pom
2/2 KB            Downloaded: http://repo.maven.apache.org/maven2/com/google/errorprone/error_prone_annotations/2.1.3/error_prone_annotations-2.1.3.pom
(2 KB at 145.8 KB/sec)
Downloading: http://repo.maven.apache.org/maven2/com/google/errorprone/error_prone_parent/2.1.3/error_prone_parent-2.1.3.pom
4/5 KB   5/5 KB            Downloaded: http://repo.maven.apache.org/maven2/com/google/errorprone/error_prone_parent/2.1.3/error_prone_parent-2.1.3.pom
(5 KB at 622.3 KB/sec)
Downloading: http://repo.maven.apache.org/maven2/com/squareup/okhttp3/okhttp/3.9.1/okhttp-3.9.1.pom
         [WARNING] Failed to create parent directories for tracking file /home/jenkins/.m2/repository/com/squareup/okhttp3/okhttp/3.9.1/okhttp-3.9.1.pom.lastUpdated
Downloading: http://repo.maven.apache.org/maven2/com/squareup/okio/okio/1.13.0/okio-1.13.0.pom
         [WARNING] Failed to create parent directories for tracking file /home/jenkins/.m2/repository/com/squareup/okio/okio/1.13.0/okio-1.13.0.pom.lastUpdated
Downloading: http://repo.maven.apache.org/maven2/org/seleniumhq/selenium/selenium-support/3.9.1/selenium-support-3.9.1.pom
4/5 KB   5/5 KB            Downloaded: http://repo.maven.apache.org/maven2/org/seleniumhq/selenium/selenium-support/3.9.1/selenium-support-3.9.1.pom
(5 KB at 398.5 KB/sec)
Downloading: http://repo.maven.apache.org/maven2/org/seleniumhq/selenium/selenium-api/3.9.1/selenium-api-3.9.1.pom
3/3 KB            Downloaded: http://repo.maven.apache.org/maven2/org/seleniumhq/selenium/selenium-api/3.9.1/selenium-api-3.9.1.pom
(3 KB at 197.9 KB/sec)
Downloading: http://repo.maven.apache.org/maven2/org/seleniumhq/selenium/selenium-remote-driver/3.9.1/selenium-remote-driver-3.9.1.pom
3/5 KB   5/5 KB            Downloaded: http://repo.maven.apache.org/maven2/org/seleniumhq/selenium/selenium-remote-driver/3.9.1/selenium-remote-driver-3.9.1.pom
(5 KB at 574.7 KB/sec)
Downloading: http://repo.maven.apache.org/maven2/org/seleniumhq/selenium/selenium-support/3.10.0/selenium-support-3.10.0.pom
4/5 KB   5/5 KB            Downloaded: http://repo.maven.apache.org/maven2/org/seleniumhq/selenium/selenium-support/3.10.0/selenium-support-3.10.0.pom
(5 KB at 478.5 KB/sec)
Downloading: http://repo.maven.apache.org/maven2/org/seleniumhq/selenium/selenium-api/3.10.0/selenium-api-3.10.0.pom
3/3 KB            Downloaded: http://repo.maven.apache.org/maven2/org/seleniumhq/selenium/selenium-api/3.10.0/selenium-api-3.10.0.pom
(3 KB at 367.6 KB/sec)
Downloading: http://repo.maven.apache.org/maven2/org/seleniumhq/selenium/selenium-remote-driver/3.10.0/selenium-remote-driver-3.10.0.pom
4/5 KB   5/5 KB            Downloaded: http://repo.maven.apache.org/maven2/org/seleniumhq/selenium/selenium-remote-driver/3.10.0/selenium-remote-driver-3.10.0.pom
(5 KB at 575.0 KB/sec)
Downloading: http://repo.maven.apache.org/maven2/org/seleniumhq/selenium/selenium-support/3.11.0/selenium-support-3.11.0.pom
3/5 KB   5/5 KB            Downloaded: http://repo.maven.apache.org/maven2/org/seleniumhq/selenium/selenium-support/3.11.0/selenium-support-3.11.0.pom
(5 KB at 598.1 KB/sec)
Downloading: http://repo.maven.apache.org/maven2/org/seleniumhq/selenium/selenium-api/3.11.0/selenium-api-3.11.0.pom
3/3 KB            Downloaded: http://repo.maven.apache.org/maven2/org/seleniumhq/selenium/selenium-api/3.11.0/selenium-api-3.11.0.pom
(3 KB at 367.6 KB/sec)
Downloading: http://repo.maven.apache.org/maven2/org/seleniumhq/selenium/selenium-remote-driver/3.11.0/selenium-remote-driver-3.11.0.pom
4/5 KB   5/5 KB            Downloaded: http://repo.maven.apache.org/maven2/org/seleniumhq/selenium/selenium-remote-driver/3.11.0/selenium-remote-driver-3.11.0.pom
(5 KB at 287.5 KB/sec)
Downloading: http://repo.maven.apache.org/maven2/net/sourceforge/htmlunit/htmlunit/2.24/htmlunit-2.24.pom
3/36 KB   5/36 KB   8/36 KB   10/36 KB   13/36 KB   14/36 KB   17/36 KB   21/36 KB   24/36
KB   25/36 KB   29/36 KB   31/36 KB   34/36 KB   36/36 KB              Downloaded: http://repo.maven.apache.org/maven2/net/sourceforge/htmlunit/htmlunit/2.24/htmlunit-2.24.pom
(36 KB at 1770.2 KB/sec)
Downloading: http://repo.maven.apache.org/maven2/net/sourceforge/htmlunit/htmlunit-core-js/2.23/htmlunit-core-js-2.23.pom
2/2 KB              Downloaded: http://repo.maven.apache.org/maven2/net/sourceforge/htmlunit/htmlunit-core-js/2.23/htmlunit-core-js-2.23.pom
(2 KB at 74.1 KB/sec)
Downloading: http://repo.maven.apache.org/maven2/net/sourceforge/htmlunit/neko-htmlunit/2.24/neko-htmlunit-2.24.pom
4/4 KB            Downloaded: http://repo.maven.apache.org/maven2/net/sourceforge/htmlunit/neko-htmlunit/2.24/neko-htmlunit-2.24.pom
(4 KB at 58.7 KB/sec)
Downloading: http://repo.maven.apache.org/maven2/net/sourceforge/cssparser/cssparser/0.9.21/cssparser-0.9.21.pom
3/14 KB   5/14 KB   8/14 KB   10/14 KB   12/14 KB   13/14 KB   14/14 KB              Downloaded:
http://repo.maven.apache.org/maven2/net/sourceforge/cssparser/cssparser/0.9.21/cssparser-0.9.21.pom
(14 KB at 862.1 KB/sec)
Downloading: http://repo.maven.apache.org/maven2/org/eclipse/jetty/websocket/websocket-client/9.2.20.v20161216/websocket-client-9.2.20.v20161216.pom
3/5 KB     5/5 KB            Downloaded: http://repo.maven.apache.org/maven2/org/eclipse/jetty/websocket/websocket-client/9.2.20.v20161216/websocket-client-9.2.20.v20161216.pom
(5 KB at 199.8 KB/sec)
Downloading: http://repo.maven.apache.org/maven2/org/eclipse/jetty/websocket/websocket-parent/9.2.20.v20161216/websocket-parent-9.2.20.v20161216.pom
3/4 KB   4/4 KB            Downloaded: http://repo.maven.apache.org/maven2/org/eclipse/jetty/websocket/websocket-parent/9.2.20.v20161216/websocket-parent-9.2.20.v20161216.pom
(4 KB at 426.8 KB/sec)
Downloading: http://repo.maven.apache.org/maven2/org/eclipse/jetty/jetty-project/9.2.20.v20161216/jetty-project-9.2.20.v20161216.pom
3/43 KB   5/43 KB   8/43 KB   10/43 KB   13/43 KB   17/43 KB   21/43 KB   25/43 KB   29/43
KB   30/43 KB   33/43 KB   34/43 KB   35/43 KB   39/43 KB   42/43 KB   43/43 KB          
   Downloaded: http://repo.maven.apache.org/maven2/org/eclipse/jetty/jetty-project/9.2.20.v20161216/jetty-project-9.2.20.v20161216.pom
(43 KB at 2627.0 KB/sec)
Downloading: http://repo.maven.apache.org/maven2/org/eclipse/jetty/jetty-util/9.2.20.v20161216/jetty-util-9.2.20.v20161216.pom
4/4 KB     4/4 KB            Downloaded: http://repo.maven.apache.org/maven2/org/eclipse/jetty/jetty-util/9.2.20.v20161216/jetty-util-9.2.20.v20161216.pom
(4 KB at 390.3 KB/sec)
Downloading: http://repo.maven.apache.org/maven2/org/eclipse/jetty/jetty-io/9.2.20.v20161216/jetty-io-9.2.20.v20161216.pom
3/3 KB            Downloaded: http://repo.maven.apache.org/maven2/org/eclipse/jetty/jetty-io/9.2.20.v20161216/jetty-io-9.2.20.v20161216.pom
(3 KB at 248.3 KB/sec)
Downloading: http://repo.maven.apache.org/maven2/org/eclipse/jetty/websocket/websocket-common/9.2.20.v20161216/websocket-common-9.2.20.v20161216.pom
3/3 KB            Downloaded: http://repo.maven.apache.org/maven2/org/eclipse/jetty/websocket/websocket-common/9.2.20.v20161216/websocket-common-9.2.20.v20161216.pom
(3 KB at 323.2 KB/sec)
Downloading: http://repo.maven.apache.org/maven2/org/eclipse/jetty/websocket/websocket-api/9.2.20.v20161216/websocket-api-9.2.20.v20161216.pom
3/3 KB            Downloaded: http://repo.maven.apache.org/maven2/org/eclipse/jetty/websocket/websocket-api/9.2.20.v20161216/websocket-api-9.2.20.v20161216.pom
(3 KB at 268.6 KB/sec)
Downloading: http://repo.maven.apache.org/maven2/org/postgresql/postgresql/42.1.3/postgresql-42.1.3.pom
3/10 KB   7/10 KB   8/10 KB   10/10 KB              Downloaded: http://repo.maven.apache.org/maven2/org/postgresql/postgresql/42.1.3/postgresql-42.1.3.pom
(10 KB at 901.2 KB/sec)
Downloading: http://repo.maven.apache.org/maven2/org/postgresql/pgjdbc-core-parent/1.1.2/pgjdbc-core-parent-1.1.2.pom
3/16 KB    6/16 KB   7/16 KB   11/16 KB   15/16 KB   16/16 KB              Downloaded: http://repo.maven.apache.org/maven2/org/postgresql/pgjdbc-core-parent/1.1.2/pgjdbc-core-parent-1.1.2.pom
(16 KB at 1307.5 KB/sec)
Downloading: http://repo.maven.apache.org/maven2/org/postgresql/pgjdbc-versions/1.1.2/pgjdbc-versions-1.1.2.pom
4/23 KB    6/23 KB   10/23 KB   11/23 KB   14/23 KB   18/23 KB   19/23 KB   20/23 KB   21/23
KB   23/23 KB              Downloaded: http://repo.maven.apache.org/maven2/org/postgresql/pgjdbc-versions/1.1.2/pgjdbc-versions-1.1.2.pom
(23 KB at 2263.9 KB/sec)
Downloading: http://repo.maven.apache.org/maven2/org/hsqldb/hsqldb/2.3.2/hsqldb-2.3.2.pom
2/2 KB              Downloaded: http://repo.maven.apache.org/maven2/org/hsqldb/hsqldb/2.3.2/hsqldb-2.3.2.pom
(2 KB at 136.3 KB/sec)
[INFO] ------------------------------------------------------------------------
[INFO] Reactor Summary:
[INFO] 
[INFO] ManifoldCF ........................................ SUCCESS [  6.226 s]
[INFO] ManifoldCF - Framework ............................ SUCCESS [  0.042 s]
[INFO] ManifoldCF - Framework - Less Compiler ............ SUCCESS [  3.542 s]
[INFO] ManifoldCF - Framework - Core ..................... FAILURE [  3.919 s]
[INFO] ManifoldCF - Connector-Common ..................... SKIPPED
[INFO] ManifoldCF - Framework - UI Core .................. SKIPPED
[INFO] ManifoldCF - Framework - Agents ................... SKIPPED
[INFO] ManifoldCF - Framework - Pull Agent ............... SKIPPED
[INFO] ManifoldCF - Framework - Authority Servlet ........ SKIPPED
[INFO] ManifoldCF - Framework - API Servlet .............. SKIPPED
[INFO] ManifoldCF - Framework - Authority Service ........ SKIPPED
[INFO] ManifoldCF - Framework - API Service .............. SKIPPED
[INFO] ManifoldCF - Framework - Crawler UI ............... SKIPPED
[INFO] ManifoldCF - Framework - Script Engine ............ SKIPPED
[INFO] ManifoldCF - Framework - Combined Service ......... SKIPPED
[INFO] ManifoldCF - Test materials ....................... SKIPPED
[INFO] ManifoldCF - Test Materials - Alfresco WAR ........ SKIPPED
[INFO] ManifoldCF - Connectors ........................... SKIPPED
[INFO] ManifoldCF - Connectors - Active Directory ........ SKIPPED
[INFO] ManifoldCF - Connectors - Alfresco Webscript ...... SKIPPED
[INFO] ManifoldCF - Connectors - Filesystem .............. SKIPPED
[INFO] ManifoldCF - Connectors - MetaCarta GTS ........... SKIPPED
[INFO] ManifoldCF - Connectors - HDFS .................... SKIPPED
[INFO] ManifoldCF - Connectors - jCIFS ................... SKIPPED
[INFO] ManifoldCF - Connectors - JDBC .................... SKIPPED
[INFO] ManifoldCF - Connectors - GridFS .................. SKIPPED
[INFO] ManifoldCF - Connectors - LDAP .................... SKIPPED
[INFO] ManifoldCF - Connectors - Null Authority .......... SKIPPED
[INFO] ManifoldCF - Connectors - Null Output ............. SKIPPED
[INFO] ManifoldCF - Connectors - Null Transformation ..... SKIPPED
[INFO] ManifoldCF - Connectors - RSS ..................... SKIPPED
[INFO] ManifoldCF - Connectors - SharePoint .............. SKIPPED
[INFO] ManifoldCF - Connectors - Solr .................... SKIPPED
[INFO] ManifoldCF - Connectors - Web ..................... SKIPPED
[INFO] ManifoldCF - Connectors - CMIS .................... SKIPPED
[INFO] ManifoldCF - Connectors - OpenSearchServer ........ SKIPPED
[INFO] ManifoldCF - Connectors - Wiki .................... SKIPPED
[INFO] ManifoldCF - Connectors - Alfresco ................ SKIPPED
[INFO] ManifoldCF - Connectors - ElasticSearch ........... SKIPPED
[INFO] ManifoldCF - Connectors - Dropbox ................. SKIPPED
[INFO] ManifoldCF - Connectors - GoogleDrive ............. SKIPPED
[INFO] ManifoldCF - Connectors - Jira .................... SKIPPED
[INFO] ManifoldCF - Connectors - Generic ................. SKIPPED
[INFO] ManifoldCF - Connectors - Regexp Mapper ........... SKIPPED
[INFO] ManifoldCF - Connectors - Email ................... SKIPPED
[INFO] ManifoldCF - Connectors - Amazon CloudSearch Output  SKIPPED
[INFO] ManifoldCF - Connectors - Forced metadata ......... SKIPPED
[INFO] ManifoldCF - Connectors - Tika Transformer ........ SKIPPED
[INFO] ManifoldCF - Connectors - Tika Service Transformer  SKIPPED
[INFO] ManifoldCF - Connectors - Document Filter ......... SKIPPED
[INFO] ManifoldCF - Connectors - SearchBlox .............. SKIPPED
[INFO] ManifoldCF - Connectors - Confluence Connector .... SKIPPED
[INFO] ManifoldCF - Connectors - Amazon S3 ............... SKIPPED
[INFO] ManifoldCF - Connectors - Kafka ................... SKIPPED
[INFO] ManifoldCF - Connectors - OpenNlp Extractor ....... SKIPPED
[INFO] ManifoldCF - Connectors - Nuxeo Connector ......... SKIPPED
[INFO] ManifoldCF - Connectors - Content Limiter ......... SKIPPED
[INFO] ManifoldCF - Connectors - Slack ................... SKIPPED
[INFO] ManifoldCF - Connectors - Rocket.Chat ............. SKIPPED
[INFO] ManifoldCF - Connectors - HTML Extractor .......... SKIPPED
[INFO] ManifoldCF - Framework - Jetty Runner ............. SKIPPED
[INFO] ------------------------------------------------------------------------
[INFO] BUILD FAILURE
[INFO] ------------------------------------------------------------------------
[INFO] Total time: 16.805 s
[INFO] Finished at: 2018-04-26T03:25:56+01:00
[INFO] Final Memory: 30M/444M
[INFO] ------------------------------------------------------------------------
[ERROR] Failed to execute goal on project mcf-core: Could not resolve dependencies for project
org.apache.manifoldcf:mcf-core:jar:2.11-SNAPSHOT: Failed to collect dependencies at org.seleniumhq.selenium:selenium-java:jar:3.3.1
-> org.seleniumhq.selenium:selenium-edge-driver:jar:3.3.1: Failed to read artifact descriptor
for org.seleniumhq.selenium:selenium-edge-driver:jar:3.3.1: Could not transfer artifact org.seleniumhq.selenium:selenium-edge-driver:pom:3.3.1
from/to central (http://repo.maven.apache.org/maven2): Specified destination directory cannot
be created: /home/jenkins/.m2/repository/org/seleniumhq/selenium/selenium-edge-driver/3.3.1
-> [Help 1]
[ERROR] 
[ERROR] To see the full stack trace of the errors, re-run Maven with the -e switch.
[ERROR] Re-run Maven using the -X switch to enable full debug logging.
[ERROR] 
[ERROR] For more information about the errors and possible solutions, please read the following
articles:
[ERROR] [Help 1] http://cwiki.apache.org/confluence/display/MAVEN/DependencyResolutionException
[ERROR] 
[ERROR] After correcting the problems, you can resume the build with the command
[ERROR]   mvn <goals> -rf :mcf-core
Build step 'Invoke top-level Maven targets' marked build as failure
[locks-and-latches] Releasing all the locks
[locks-and-latches] All the locks released

Mime
View raw message